##TITLE=Amostra 7 $$ Begin of the data block
##JCAMP-DX=5.00 $$ ACD/SpecManager v 10.08
##SPECTROMETER/DATA SYSTEM=Alpha
##DATE=23 Aug 2016 09:05:00
##DATA TYPE=INFRARED SPECTRUM
##DATA CLASS=XYDATA
##ORIGIN=
##OWNER=
##NPOINTS=1667
##FIRSTX=599.65820312
##LASTX=3997.72216797
##MAXX=3997.72216797
##MINX=599.65820312
##MAXY=0.87302643
##MINY=0.56091172
##XFACTOR=1.0000000000
##YFACTOR=1.000000000000000e-9
##FIRSTY=0.86916834
##DELTAX=2.03965425
##XUNITS=1/CM
##YUNITS=ARBITRARY UNITS
##XYDATA=(X++(Y..Y))
599.7H69168341j239061n66185l03805l84628k41816K00092N45025M81665L06368J57178
620.1H68123174j97411q80182j589775k094149k314151k041042j496553j242459q29041
638.4H55438411j788k2948q45670j179397r73762j065135j491189j654684j527071
656.8H46676767j490057j680910j928509k546191l659725k601087J11520J34409o97434
675.1H32318783j071096j207530j449347j554846j553238j694202j902044k154410
691.4H19732070k234221k269566k795517l828883n127669o661534q827388j1751175
707.8G76236117j2146711l046871J3090432K1161795J5916288O469786r03070n410373
724.1H11367393o360591k309263M069925O352067L364801j11878j312315j416743j808047
$$ y = [869168341, 867929280, 867363095, 867059290, 866674662, 866432846, 866632938, 867177963, 867659628, 867965996, 868123174, 867925763, 867045581, 865455806, 863361657, 861047506, 859006464, 857509911, 856267452, 855438411, 855436623, 855413675, 854568005, 853388608, 852414846, 851349711, 849858522, 848203838, 846676767, 845186710, 843505800, 841577291, 839031100, 835371375, 832770288, 832881808, 833016217, 832318783, 831247687, 830040157, 828590810, 827035964, 825482726, 823788524, 821886480, 819732070, 817497849, 815228283, 812432766, 808603883, 803476214, 796814680, 787987292, 776236117, 764089406, 761042535, 774132967, 795294762, 811211050, 817680836, 816777766, 811367393, 805006802, 802697539, 806767464, 813119531, 816484332, 816372454, 815060139, 813643396, 811835349]
742.4H11835349k498150k873302k871752k802133k549470k179205j965940j983702
758.8G92111695k358377l184021m272639m970730m429519k426386K44260K179861K627552
777.1G75521696K069831J226723K61068p20501j429319j760781j820684j929521k414286
795.5G69004226l247559m113794m694819m767835m337967l587007k933204k831579
811.8G38490462l390252m663050o628395r244144j2263357j4363170j3367951q493364
828.1F66076779j619994M374385P750094Q600592P896543O312549M174530K027929
844.4G05593407J088262J520633J046241r44734k747178m073381n296171o544530q026898
862.8F81615651r780169j1815667j3006151j0507464l596842M574298J1199177J5413224
$$ y = [811835349, 809337199, 806463897, 803592145, 800790012, 798240542, 796061337, 794095397, 792111695, 789753318, 786569297, 782296658, 777325928, 772896409, 770470023, 770714283, 772894144, 775521696, 777591527, 778818250, 779079318, 778358817, 776929498, 775168717, 773348033, 771418512, 769004226, 765756667, 761642873, 756948054, 752180219, 747842252, 744255245, 741322041, 738490462, 735100210, 730437160, 723808765, 714564621, 702301264, 687938094, 674570143, 666076779, 664456785, 668831170, 676581264, 685181856, 693078399, 699390948, 703565478, 705593407, 706681669, 708202302, 709248543, 708303809, 705556631, 701483250, 696187079, 689642549, 681615651, 671835482, 660019815, 647013664, 636506200, 632909358, 637483656, 648682833, 664096057]
879.1F64096057J7836452K1397710K6007473K5127888J6697228P550180K348602j91570
895.4G80870020j679182k460360k866268l137231l356695l476978l550112l619254
911.7G56723940l348410k554834j615047j063526r95934j076460j223683j511931j711131
930.1G41622984j747489j752018j808703j837075j661480j423120j341582j368403
946.4G28683114j352251j310646j313210j241386r97424p16209m99666l44932l77059
964.8G20530331o24716r74178j283527j510739j787663k058685k256274k489745k726257
983.1G04818547k850354k879739k772093k358257j650036q90970m86553o32643j121283
1001.5F89176619k012372l699481n637229n620182k644479O07550J449049J46627j934468
$$ y = [664096057, 681932509, 703330219, 729337692, 754465580, 771162808, 778712988, 781061590, 780870020, 779190838, 776730478, 773864210, 770726979, 767370284, 763893306, 760343194, 756723940, 753375530, 750820696, 749205649, 748142123, 747146189, 746069729, 744846046, 743334115, 741622984, 739875495, 738123477, 736314774, 734477699, 732816219, 731393099, 730051517, 728683114, 727330863, 726020217, 724707007, 723465621, 722468197, 721751988, 721252322, 720907390, 720530331, 719905615, 718931437, 717647910, 716137171, 714349508, 712290823, 710034549, 707544804, 704818547, 701968193, 699088454, 696316361, 693958104, 692308068, 691417098, 690930545, 690297902, 689176619, 687164247, 683464766, 677827537, 672207355, 669562876, 670170426, 671619475, 671766102, 669831634]
1019.8F69831634l693939m708171n253136n475402n352556n051971m570722l696025
1036.1F32029712k511263j432538o96003k83241j75178p9036L04818R48369J713038
1054.5F29818678K460122L061593L307104L206193K892494K392829J828432J198232
1070.8F50165677N52356K24233R2387l90172j177490j587748j064897J40906J096248
1089.2F48051500J197696N81503m49538j653791k664983l042817k377749o72280J409590
1107.5F40379131K993405L460169K766311J648068R20892Q56042J266122J610875J551509
1125.9F57452524J236021R18985P05242O09576N93186N20885K81930j51813o97017
1144.3F61469519j236677j655340j945138k335906k903342l402591l678262l762365
$$ y = [669831634, 666137695, 661429524, 656176388, 650700986, 645348430, 640296459, 635725737, 632029712, 629518449, 628085911, 627389908, 627106667, 626931489, 626852453, 627157271, 628105640, 629818678, 632278800, 635340393, 638647497, 641853690, 644746184, 647139013, 648967445, 650165677, 650718033, 650942266, 651034653, 650644481, 649466991, 647879243, 646814346, 646955252, 648051500, 649249196, 649830699, 649381161, 647727370, 645062387, 642019570, 639641821, 638969541, 640379131, 643372536, 646832705, 649599016, 651247084, 652167976, 653024018, 654290140, 655901015, 657452524, 658688545, 659607530, 660312772, 660922348, 661515534, 662036419, 662318349, 662166536, 661469519, 660232842, 658577502, 656632364, 654296458, 651393116, 647990525, 644312263, 640549898]
1160.6F40549898l684163l477275l231228l105759l231645l840327n349636p712365
1176.9F06917500r284853p456303j683891N508542J1014760J3364553J2772679J0226548
1193.2F41379535O884337L725767J268446n23388j946151l058613l830254m410684
1209.5F39488995m809797n026102n224585n462051n737960o095708o460726o600916
1225.8E94071150o365061n723953m734755l637492k743006k259612k216935k324224
1242.2E64066112k067506j086891O95288L204048O223678R145618J1164665J1740148
1258.5F03085160J0737121Q478105N732358L296614J519203L20852n23389j237869
1274.8F31408155j921773k556384l088176l444970l612637l487289k925098k089679
$$ y = [640549898, 636865735, 633388460, 630157232, 627051473, 623819828, 619979501, 614629865, 606917500, 597632647, 590176344, 588492453, 594000995, 605015755, 618380308, 631152987, 641379535, 648263872, 651989639, 653258085, 652734697, 650788546, 647729933, 643899679, 639488995, 634679198, 629653096, 624428511, 618966460, 613228500, 607132792, 600672066, 594071150, 587706089, 581982136, 577247381, 573609889, 570866883, 568607271, 566390336, 564066112, 561998606, 560911715, 561607003, 564811051, 571034729, 580180347, 591345012, 603085160, 613822281, 622300386, 628032744, 631329358, 632848561, 633169413, 632646024, 631408155, 629486382, 626929998, 623841822, 620396852, 616784215, 613296926, 610371828, 608282149]
1291.1F08282149j287222n71132K25187J196622K146542K626241K389490J645625R22501
1309.5F17576003P81953J195014J431942J115739N63860l5345o12259r72688j114727
1327.8F19929492j210272j254082j239180j336038j277924p09772k80917n03182q72433
1346.2F11245692j053632j215934j571775k174139l135264m367232m536152k180099
1362.5E91011465R48131J845181J064777j46389j164377j421690j622140k305806k736270
1380.9E85472882k515376j778126m92692L82483k88367j118123q75295j42097M42982
1399.2E79088271M91321J57952M23670P23302M28260L77237O32406O02066J226068
1417.6E84150553K934754K943098K023161J715064J330137J444042J484751Q34167
$$ y = [608282149, 606994927, 606423795, 606648982, 607845604, 609992146, 612618387, 615007877, 616653502, 617576003, 618357956, 619552970, 620984912, 622100651, 622664511, 622629166, 622016907, 621044219, 619929492, 618719220, 617465138, 616225958, 614889920, 613611996, 612902224, 612621307, 612118125, 611245692, 610192060, 608976126, 607404351, 605230212, 602094948, 597727716, 593191564, 591011465, 591959596, 593804777, 594869554, 594723165, 593558788, 592137098, 590514958, 588209152, 585472882, 582957506, 581179380, 580686688, 581069171, 580780804, 579662681, 578787386, 578645289, 579088271, 579579592, 579737544, 580161214, 580884516, 581312776, 581690013, 582322419, 582924485, 584150553, 587085307, 590028405, 592051566, 593766630, 595096767, 596540809, 598025560, 598859727]
1433.9E98859727J393617K718329K049565R58324K19047m32611m85420m94242j244187
1452.2F03542149j974761n93603K639949L081680K271473K910018L466129K275348
1468.6F17618382J400530K572239M105091M304051L952742L522575L207207K453804
1484.9F43136621J657843J966000K665281J282871j261235l574669o447732j0129989
1501.2F29294991j4022171j9716322k2236169r037852P025778J8893421K6795506K8576255
1517.5F45573437K4016321K0158470J5797793J1313856R922981Q116722O895006P714510
1533.8G49509096O436706M456281O554485Q696019P926584P363677O361961N773366
1550.1H03078175N361795M272938K735197M065574P819891N772113L182173K297461
$$ y = [598859727, 600253344, 602971673, 605021238, 605979562, 606198609, 605765998, 605280578, 604786336, 603542149, 601567388, 600973785, 603613734, 606695414, 608966887, 611876905, 615343034, 617618382, 619018912, 621591151, 625696242, 630000293, 633953035, 637475610, 640682817, 643136621, 644794464, 646760464, 649425745, 650708616, 649447381, 645872712, 639424980, 629294991, 615272820, 595556498, 573320329, 564282477, 571308255, 590201676, 616997182, 645573437, 669589758, 689748228, 705546021, 716859877, 726782858, 734899580, 741794586, 749509096, 755945802, 760402083, 766956568, 775652587, 783579171, 790942848, 797304809, 803078175, 808439970, 812712908, 815448105, 819513679, 827333570, 833105683, 836287856, 838585317]
1566.5H38585317K010465K242327R07361j402795k518237j967609m73082K199292N123139
1584.8H44706178O001770M490197J926601n18501k550900m414976o390094q302033
1601.1H34948242q994639o939173j698732N132019R988666J0506749R583592Q953691
1617.5H61480415N722761K571046J676619J188040L87550j23263j064598k154529j644075
1635.8H68039966L5584K4497j112521k169370k278745j228929j321375k085328m83752
1654.2H57420027Q62897k69890j480580j645386j342416j940131k554655j908243j380622
1672.5H45761001j432300j159965j614273k845049l219664j526713k88606r25958j643956
1690.9H31104517k571285l513992l661573l027975j820684j367032j882792k004087
$$ y = [838585317, 840595782, 842838109, 843745470, 842342675, 839824438, 837856829, 837383747, 839583039, 844706178, 850707948, 855198145, 857124746, 856606245, 854055345, 849640369, 843250275, 834948242, 825953603, 819014430, 817315698, 822447717, 832436383, 842943132, 852526724, 861480415, 867203176, 869774222, 871450841, 872638881, 873026431, 872903168, 871838570, 869684041, 868039966, 868075550, 868100047, 866987526, 864818156, 862539411, 861310482, 859989107, 857903779, 857420027, 858282924, 858013034, 856532454, 854887068, 853544652, 851604521, 849049866, 847141623, 845761001, 844328701, 843168736, 841554463, 838709414, 835489750, 833963037, 833674431, 832748473, 831104517, 828533232, 825019240, 821357667, 818329692, 816509008, 815141976, 813259184, 811255097]
1707.2H11255097k182483l030896l954113l963709k289235l41774j41441l98219m05312
1725.6G94547915p23838j319766j506865k04623J210332L25918o84202j004100j334607
1743.9G89306164j889527k438605k213061j531183j916051k910078l397822l552378
1760.2G69457459l564119l569484m191398m827023m952073m965663m948377n458534
1776.5G32980788o649077p553339p746101p705271p495999p166624o129861l121376
1792.9F79413140L18408K385080M433036O773591P959246P315994N879700M715085
1809.2G19193280M096687L649413L128886K905012L065288L265679L733515M642010
1825.5G47679770M978359N104243N018771L741622K342999J474738N39720m11093k71201
$$ y = [811255097, 809072614, 806041718, 802087605, 798123896, 795834661, 795492887, 795351446, 794953227, 794547915, 793824077, 792504311, 790997446, 790792823, 792003155, 792329073, 791644871, 790640771, 789306164, 787416637, 784978032, 782764971, 781233788, 779317737, 776407659, 773009837, 769457459, 765893340, 762323856, 758132458, 753305435, 748353362, 743387699, 738439322, 732980788, 726331711, 718778372, 711032271, 703327000, 695831001, 688664377, 682534516, 679413140, 679731548, 682116628, 686549664, 693323255, 701282501, 708598495, 714478195, 719193280, 723289967, 726939380, 730068266, 732973278, 736038566, 739304245, 743037760, 747679770, 752658129, 757762372, 762781143, 766522765, 768865764, 770340502, 770880222, 770469129, 770197928]
1843.9G70197928M80831M06205k4080l54171n91874p13468p13348o48260p00951j076758
1864.3G66262054j448690r95577p5161P7128k95699n67734p40409q06629p27952o88255
1884.7G59993076q17060p26223l13521k58445l95358k71320j89305l24249m77314m96566
1905G55723715m93288m26829k60234l38554o20544n53489k93076k99931j80781J4782
1925.4G52271771j51872l80337m21763m07636m09782n64873q37982p37727k36094l6716
1945.8G48086989k07722l51906m23014m56810m30405l37482k72214l42250n26250n01811
1966.2G44237125j93834j13905k65479l03209k91347k78175k54035l18587l91901m34219
1986.6G41392434n31555n03599k39134j25945k56180k60115k26081l19480l33369k34544
$$ y = [770197928, 770678759, 771084964, 771060884, 770706713, 770114839, 769401371, 768688023, 768039763, 767338812, 766262054, 764813364, 763817787, 763742626, 763819754, 763524055, 762956321, 762215912, 761409283, 760681331, 759993076, 759176016, 758449793, 758136272, 757877827, 757482469, 757211149, 757021844, 756697595, 756220281, 755723715, 755230427, 754803598, 754543364, 754204810, 753584266, 753030777, 752737701, 752437770, 752256989, 752271771, 752119899, 751739562, 751317799, 750910163, 750500381, 749935508, 749097526, 748359799, 748123705, 748086989, 747879267, 747527361, 747104347, 746647537, 746217132, 745879650, 745607436, 745265186, 744738936, 744237125, 744043291, 743929386, 743663907, 743360698, 743069351, 742791176, 742537141, 742218554, 741826653, 741392434, 740860879, 740357280, 740118146, 739992201, 739736021, 739475906, 739249825, 738930345, 738596976, 738362432]
2007G38362432k02179k98918m39524m35830k30729q9944j42097k37703k84076k45512
2027.4G35755920j64091j60098k19882k72929l30806l97623l87966k49804j43945j83761
2047.8G33245015k48670k75314k99216k87532k94865l36229l32773k70605j14501n3942
2068.2G30731368j80781k33948j83582j47820j51396j60277j45912j97291k61068j70529
2088.6G28898764k3008k3186j18673j74761j77741j47879j26064j25646j35839j78397
2109G27667570k33769k16842j57058j83881k42173j91987r3102p6950j04964r5069
2129.4G26071775j29700k48253k83063j77204o1989j7881l7194p9274j18792j61946
2149.8G24756479j78337j30594j11997j65105j35719l6598o1154j29640j20640j25408
$$ y = [738362432, 738160253, 737861335, 737421811, 736985981, 736755252, 736665308, 736523211, 736285508, 736001432, 735755920, 735591829, 735431731, 735211849, 734938920, 734608114, 734210491, 733822525, 733572721, 733428776, 733245015, 732996345, 732721031, 732421815, 732134283, 731839418, 731503189, 731170416, 730899811, 730785310, 730731368, 730550587, 730316639, 730133057, 729985237, 729833841, 729673564, 729527652, 729330361, 729069293, 728898764, 728875756, 728852570, 728733897, 728559136, 728381395, 728233516, 728107452, 727981806, 727845967, 727667570, 727433801, 727216959, 727059901, 726876020, 726633847, 726441860, 726348758, 726271808, 726166844, 726071775, 725942075, 725693822, 725410759, 725233555, 725171566, 725153685, 725116491, 725037217, 724918425, 724756479, 724578142, 724447548, 724335551, 724170446, 724034727, 723998129, 723936975, 723807335, 723686695, 723561287]
2170.2G23561287j18613p7546q7857j43707j98066k05338j64688r4652o199k8610j97411
2192.6G22238600k80142j49369l3498j06454j81674j52469j15752j15931j38164j39356
2213G20825791j53303j73628j37508j28388j47164j13964j02401j42038j39713j00732
2233.4G19486952q7440r1851j24752j59681j48118j64628j94073j09911j1622j2279
2253.8G18382597j04845k12371j49429n4598j33633k23935j60694n0545l8266o8784
2274.2G17185497j13129j53661j56820j66535j96040k08020k15352k96652m01318Tl73185
2296.7G14503467m62413n32865m87328n57422p23482o45101l24487j35959k63452m41492
2317G09929466m36067k19167J25289J80602o5922j8537L55601M73320K22981l7074
$$ y = [723561287, 723442674, 723365128, 723277271, 723133564, 722935498, 722730160, 722565472, 722470820, 722464621, 722436011, 722238600, 721958458, 721809089, 721775591, 721669137, 721487463, 721334994, 721219242, 721103311, 720965147, 720825791, 720672488, 720498860, 720361352, 720232964, 720085800, 719971836, 719869435, 719727397, 719587684, 719486952, 719399512, 719307661, 719182909, 719023228, 718875110, 718710482, 718516409, 718406498, 718394876, 718382597, 718277752, 718065381, 717915952, 717861354, 717727721, 717503786, 717343092, 717292547, 717254281, 717185497, 717072368, 716918707, 716761887, 716595352, 716399312, 716191292, 715975940, 715679288, 715277970, 714876652, 714503467, 714041054, 713508189, 713020861, 712463439, 711739957, 711094856, 710770369, 710634410, 710370958, 709929466, 709493399, 709274232, 709399521, 709580123, 709514201, 709495664, 709851265, 710324585, 710547566, 710510492]
2337.4G10510492q1241N0485L32713P2122j191676j674473o37591N81682O62804M20928
2357.8G09046245N92351O58214K90692j5140L4273l4333j38640M470J57953K58207
2378.2G10854292L71158M51148M63426L40283J24275J4961J2457o4432j57237j15454
2398.6G12294877n3466m1723l6538q1062q8096n7459j03175j23799r8228j30713j73271
2421.1G11307347j44482q7082p7248p3969j1564J9730k0922m2140m0472l2961K742
2443.5G10798979J0073n0843o7889n6744p6413o4969j10209j40727m3034n9843k07305
2465.9G09931076k17379j77741k28881k24948j81973k22147k96414l25203l18706l04699
2486.3G07432985k63989k42650k79546l29316l54588l46601l50296l80457l77535l21508
$$ y = [710510492, 710429251, 710479736, 710812449, 710884571, 709692895, 708018422, 707380831, 707962513, 708625317, 709046245, 709638596, 710296810, 710587502, 710572362, 710606635, 710572302, 710433662, 710438132, 710596085, 710854292, 711225450, 711676598, 712140024, 712480307, 712604582, 712619543, 712632000, 712567568, 712410331, 712294877, 712241411, 712199688, 712163150, 712082088, 711993992, 711936533, 711833358, 711709559, 711611331, 711480618, 711307347, 711162865, 711075783, 710998535, 710924566, 710913002, 710932732, 710911810, 710869670, 710829198, 710796237, 710798979, 710809052, 710758209, 710690320, 710633576, 710557163, 710492194, 710381985, 710241258, 710198224, 710138381, 709931076, 709713697, 709535956, 709307075, 709082127, 708900154, 708678007, 708381593, 708056390, 707737684, 707432985, 707168996, 706926346, 706646800, 706317484, 705962896, 705616295, 705265999, 704885542, 704508007, 704186499]
2506.7G04186499k05874r1017o3240k0385Q9526J86026K79069L53337L84867L85821
2527.1G05484629L34918L35097L91186L37243K95758L49879K16127m888K3425J30176
2547.5G07893550J13547Q5294J32323J75774J29282M3631J9789P8857J03354L3856
2567.9G08809257l9578k4736N7817R0003M9173M3870P3194p510j28985r9599K1696
2590.3G08844602P0155L9696L8982P3373M9770k7895k5868N0246R6977R5487M2558
2612.8G09348083J5914J8477p689k3245k1995k4914j5021L0101M5478J848k1815o378
2637.3G09338844J2874J3292L4333R6321O2644p4386j09077m6909p272J9849K6345
2659.7G09366858j4961p8857q3685L219N126j16348j71423j51873j01507j7344O8247
$$ y = [704186499, 703980625, 703889608, 703826368, 703805983, 703895509, 704081535, 704360604, 704713941, 705098808, 705484629, 705819547, 706154644, 706545830, 706883073, 707178831, 707528710, 707744837, 707739949, 707763374, 707893550, 708007097, 708092391, 708224714, 708400488, 708529770, 708573401, 708593190, 708672047, 708775401, 708809257, 708769679, 708744943, 708802760, 708892763, 708941936, 708985806, 709059000, 709051490, 708922505, 708822906, 708844602, 708914757, 708954453, 708993435, 709066808, 709116578, 709088683, 709062815, 709113061, 709210038, 709305525, 709348083, 709363997, 709382474, 709374785, 709351540, 709329545, 709304631, 709289610, 709319711, 709365189, 709367037, 709345222, 709338844, 709351718, 709365010, 709399343, 709495664, 709558308, 709483922, 709374845, 709327936, 709320664, 709340513, 709366858, 709351897, 709273040, 709189355, 709192574, 709197700, 709081352, 708909929, 708758056, 708656549, 708639205, 708707452]
2682.1G08707452R5367J8180q5533j14024q0049q5950q4459k1518k9623r9838j13368
2704.6G08106637o9022k9266M232P629n6922j13428j55568j52349o6877l5286j4901
2727G07424879P7546Q3089L695j9848m4167o1870l2604q1420j83761j56522J7941O4433
2751.5G07091391r7632j38045k7358L1531R3579J04606l2544j20997o8129j00016k23160
2773.9G06513226j27733N9903L7372m3034j12415k79724l64244j69874M9711J7047
2794.3G05580235j52171j54436M8518P3255j07289k30491k84255j88052m3273m0531
2814.7G04501510o6519q8453j83344k94745l09289k66075k76685l66389m90308o11961
2835.1G01547742p21216n14984n1976n3346m86851p10845o54101o93560r43362j198292
$$ y = [708707452, 708802819, 708820999, 708735466, 708621442, 708541393, 708455443, 708370984, 708349466, 708319843, 708220005, 708106637, 708037615, 708008349, 708012581, 708020210, 707963288, 707849860, 707694292, 707541943, 707475066, 707439780, 707424879, 707502425, 707585514, 707589209, 707569361, 707525194, 707463324, 707430720, 707349300, 707165539, 707009017, 707026958, 707091391, 706993759, 706855714, 706828356, 706859887, 706953466, 707058072, 707025528, 706904531, 706836402, 706736386, 706513226, 706385493, 706445396, 706482768, 706439734, 706327319, 706047595, 705683351, 705513477, 705563188, 705580235, 705428064, 705273628, 705322146, 705395401, 705288112, 705057621, 704773366, 704585314, 704542041, 704501510, 704434991, 704346538, 704163194, 703868449, 703559160, 703293085, 703016400, 702650011, 702159703, 701547742, 700826526, 700311542, 700259566, 700206220, 699719369, 699008524, 698354423, 697660863, 696717501, 695519209]
2855.5F95519209j503110j829088j972437k071857k182543k011598j556575r57668
2871.8F81434333m3213R05693J260697J144588J011491Q80778O81996N04613M52340
2890.2F88233316M56333L57151K43426J45673j03593m19259n90324o66857q45313j094878
2910.6F85715675j131296r00388p64548q75533j066148j213432j196682j103818r41873
2928.9F76521957m70340J61349O12319P92682P32839N54204L92318K68042J30355k13146
2949.3F79482579p46786j139284j494109j982510k176106j789570j047552j62065Q18312
2967.7F69762909J727045K259135K501011K754808K884090K833128K763450K557397
2984F90042973K171099J817584J526296J283586J169503R90629Q56280R35137Q77917
$$ y = [695519209, 694016099, 692187011, 690214574, 688142717, 685960174, 683948576, 682392001, 681434333, 681391120, 682296813, 683557510, 684702098, 685713589, 686594367, 687276363, 687780976, 688233316, 688689649, 689046800, 689290226, 689435899, 689332306, 688913047, 688322723, 687655866, 686810553, 685715675, 684584379, 683683991, 682919443, 682043910, 680977762, 679764330, 678567648, 677463830, 676521957, 676051617, 676212966, 676825285, 677617967, 678350806, 678905010, 679297328, 679565370, 679695725, 679482579, 678735793, 677596509, 676102400, 674119890, 671943784, 670154214, 669106662, 668944597, 669762909, 671489954, 673749089, 676250100, 679004908, 681888998, 684722126, 687485576, 690042973, 692214072, 694031656, 695557952, 696841538, 698011041, 699001670, 699857950, 700793087, 701671004]
3002.3G01671004O82652N47409L20137k086k7955L88920P28429N64933R9301l83794
3022.7G04588950o48082o74069q18312r98318q98123n22315j23024N9843K02715L41356
3043.1G00510621K44200N4181o4850j49190j42515m9770N0724J32441J80721J89782
3063.5G00956345K25782L52204M95791M97639K94686J35839J97887L03805L15964K52128
3083.9G04028070K24829J80900m5359k64049k57432j47403l0517J12116K01225J09554
3104.3G04111934o736R0778J37687n1796j92523j78934r0897k9027j03533j13905M4942
3126.7G03617990P5638l6955o7174l1054Q881J5318m3869r6023j02162j01328r5904
3149.2G03143358o6697n2572p4505q1182q4281j33812j58191j23680j55210k27511
$$ y = [701671004, 702353656, 702901065, 703221202, 703219116, 703191161, 703580081, 704308510, 704873443, 704972744, 704588950, 703940868, 703266799, 702448487, 701450169, 700552046, 700029731, 699906707, 699966550, 700169265, 700510621, 700754821, 700809002, 700744152, 700594962, 700452447, 700402677, 700453401, 700585842, 700766563, 700956345, 701182127, 701534331, 702030122, 702527761, 702822447, 702958286, 703156173, 703459978, 703775942, 704028070, 704252899, 704433799, 704388440, 704124391, 703866959, 703719556, 703689039, 703801155, 704002380, 704111934, 704105198, 704195976, 704333663, 704281867, 704089344, 703910410, 703819513, 703790486, 703686953, 703573048, 703617990, 703693628, 703656673, 703589499, 703558445, 703567326, 703582644, 703538775, 703442752, 703340590, 703239262, 703143358, 703076661, 703024089, 702949584, 702868402, 702784121, 702650309, 702492118, 702368438, 702213228, 701985717]
3169.6G01985717j86265j20997j67012k19405j71840q9467n0723m9651q8811j19805
3190G00721741j21594j57952j53661q9228o5744n0783k2292q9705j93238j81914j63436
3212.4F99432194j69158j31786j66595k81512k82884k26319k86102k70248j46150j94311
3232.8F97277129l67403m05312l04282j70767n6565p8320k04325k98440k78533j36554
3253.2F94976628q2135j86563k34246k72334l37064k50995j29342p6175r0718j88649
3273.6F93128407k65360k66552j83701j19269j64151j97649k01643k12252j69218j22666
3294F91225946j13666j54913k65181k64108p7188l5763k57551m28260m10258k52724
3314.4F88966334r5427p1228n7697j9670j66773m19438m06981k02179j60455j54674
$$ y = [701985717, 701799452, 701678455, 701511443, 701292038, 701120198, 701030731, 700980008, 700930357, 700841546, 700721741, 700600147, 700442195, 700288534, 700199306, 700133562, 700082779, 700060487, 699970782, 699777544, 699595630, 699432194, 699263036, 699131250, 698964655, 698683143, 698400259, 698173940, 697887838, 697617590, 697471440, 697277129, 696909726, 696504414, 696200132, 696029365, 695972800, 695894480, 695690155, 695391715, 695113182, 694976628, 694894493, 694707930, 694473684, 694201350, 693864286, 693613291, 693483949, 693407774, 693317056, 693128407, 692863047, 692596495, 692412794, 692293525, 692129374, 691931725, 691730082, 691517830, 691348612, 691225946, 691112280, 690957367, 690692186, 690428078, 690350890, 690315127, 690057576, 689629316, 689219058, 688966334, 688870907, 688799679, 688741982, 688722312, 688555539, 688136101, 687729120, 687526941, 687366486, 687211812]
3334.8F87211812J5556K3723j52826j94490k31147k98083k09987j38938k13624k16603
3355.2F85595393r2864k6107m2319k9325m6254j80840k65777j70946l4511r180q7916
3377.6F84609354j17064n1200j06812k18093k06709j41919l7968L3021n4896k36452
3398F83471262j63257J60039K60472O5625r9003p5281k4617L1710Q7678n4776j09852
3420.4F83550000J30713K51889J22369M0889N9902k9981o5088J15275J99020R6738
3440.8F84471726L3975J26362K38597K27273J71423J10209P4148O0379O6936J63675
3461.2F85744703J68919O1453J10388L08275L81231J89662l2544o5029J40369M29452
3481.6F87436879M27544K51949K44140K80857J96338J15514J67906J35064L994J17659
$$ y = [687211812, 687227368, 687251091, 687098265, 686903775, 686672628, 686374545, 686164558, 686025620, 685811996, 685595393, 685502529, 685476422, 685434103, 685404778, 685358524, 685177684, 684911907, 684740961, 684706450, 684697270, 684609354, 684492290, 684441090, 684334278, 684116185, 683909476, 683767557, 683729589, 683762610, 683707714, 683471262, 683308005, 683468044, 683728516, 683794141, 683695138, 683619857, 683595240, 683626950, 683714628, 683659852, 683550000, 683680713, 683932602, 684054971, 684095860, 684155762, 684125781, 684060693, 684175968, 684374988, 684471726, 684505701, 684632063, 684870660, 685097933, 685269356, 685379565, 685453713, 685514092, 685581028, 685744703, 685913622, 685975075, 686085463, 686393738, 686774969, 686964631, 686932087, 686867058, 687007427, 687436879, 687864423, 688116372, 688360512, 688641369, 688837707, 688953221, 689121127, 689256191, 689260185, 689377844]
3502F89377844K65837K31922L10302N20229N35846L47852K23041J08361O1393J80125
3522.4F92162752K73645M04656N96285O21498M08947K14517K96772L48389O437l30388
3542.8F95003510k0385O97970R15527O66857N18859M46677L18229J38521j38461m23968
3563.2F98123336k00093O57558J193762J062930Q00312O25729N18859K63631k50876
3581.6G02795148o86109j71304J053929J128555M51863M44948O22273M93228L83914
3599.9G06516445K25246j46509j75893J63376K40803J75774L1233J3232N86689Q25107
3620.3G08455503K4855j058876p73430J228809J702786N98967J87933O8009N9724k05994
3640.7G10288286r89198j650692j043975Q82745J417339L73244M41790O52075J68740
$$ y = [689377844, 689643681, 689875603, 690185905, 690706134, 691241980, 691589832, 691812873, 691921234, 691982627, 692162752, 692436397, 692841053, 693437338, 694058836, 694467783, 694682300, 694979072, 695327461, 695333898, 695003510, 694983125, 695681095, 696596622, 697263479, 697782338, 698229015, 698547244, 698685765, 698547304, 698123336, 697923243, 698580801, 699774563, 700837493, 701637805, 702263534, 702782393, 703046024, 702795148, 702109039, 701937735, 702991664, 704120219, 704572082, 705017030, 705639303, 706132531, 706516445, 706741691, 706595182, 706419289, 706582665, 706823468, 706999242, 707030475, 707043707, 707630396, 708455503, 708480358, 707421482, 706648052, 707876861, 709579647, 710178614, 710366547, 710434556, 710494280, 710288286, 709299088, 707648396, 706604421, 707487166, 708904505, 709277749, 709719539, 710371614, 710540354]
3659.1G10540354j6272l70979j045942p66874O4254o93202m85122J502275J334012
3677.4G10062504L66747N5611p58826j126647l1114J131892P04527j0669k37823k64883
3697.8G09891319J68801O44922q94q40545p26044L56913J039266K45512l56198m49836
3718.2G09973216n08189m69327q2851O4910m94659q84712q00490J90079J171291j27137
3738.6G08032131j247704L47734J303434k85208L95179J994609Q93712m07755Q226
3757G11034358O27517R5785n02288l95537M5002P35819P25567m2915n04196j65462
3777.4G11653650L80456K34902J80423L72351J08301k68161m76539m40955m90725o97971
3797.8G10555732L71456P91788j61647Q06451J024603p47025j327514k04087J19091
$$ y = [710540354, 710524082, 710153103, 709107161, 708340287, 708404541, 707711339, 707226217, 708728492, 710062504, 710429251, 710484862, 709726036, 708599389, 708568275, 709700167, 710404694, 710394025, 710156202, 709891319, 710060120, 710705042, 710704148, 709863603, 709137559, 709494472, 710533738, 710779250, 710423052, 709973216, 709465027, 708995700, 708912849, 708977759, 708483100, 707598388, 706797898, 706987977, 708159268, 708032131, 706784427, 707132161, 708435595, 708150387, 708545566, 710540175, 711433887, 711026132, 711034358, 711661875, 711757660, 711255372, 710859835, 710904837, 711640656, 712366223, 712323308, 711819112, 711653650, 712034106, 712269008, 712449431, 712821782, 712930083, 712661922, 712185383, 711744428, 711253703, 710555732, 710927188, 711718976, 711557329, 712363780, 713388383, 712641358, 711313844, 711109757, 711228848]
3816.1G11228848o98746M78506J029671M2438j31845k50817k66492m64559n50031M43875
3836.5G10860848P77424R8228K49565Q7678j038432j869321o43611K592922K181768
3854.9G13297069q19623r63748k63870N8055l34024m94659L84033N69641L61741R8228
3875.3G11892843l99232l22878m53651J6153O38723q3446P4446P99358r537r92596
3895.7G11160183r63271m78565L71396J338303J301170N24401k742l81231o76215m73618
3916.1G11719811R4593K66552J48236J85669J30951j2815P4029K01225J33098L3915
3936.4G12975264j50562j46091O8605m0293j22904J17540L18527K00570q3566j31905
3956.8G13005185R2566K44200J44244N4895R2268L875k00451j69694K3782k3365r5367
$$ y = [711228848, 710530102, 711008608, 712038279, 712080717, 711948872, 711698055, 711431563, 710967004, 710416973, 710860848, 711638272, 711736500, 711986065, 712073743, 711035311, 709165990, 708522379, 711115301, 713297069, 712477446, 711513698, 711249828, 711307883, 710973859, 710479200, 710863233, 711432874, 711794615, 711892843, 711493611, 711170733, 710717082, 710733235, 711371958, 711288512, 711362958, 712162316, 712152779, 711160183, 710196912, 709718347, 710089743, 711428046, 712729216, 713253617, 713250875, 712869644, 712193429, 711719811, 711814404, 712080956, 712229192, 712414861, 712545812, 712532997, 712607026, 712808251, 712941349, 712975264, 712824702, 712678611, 712747216, 712706923, 712584019, 712701559, 713020086, 713220656, 713137090, 713005185, 713097751, 713341951, 713486195, 713541090, 713633358, 713637233, 713436782, 713267088, 713290870, 713267505, 713172138]
3979.3G13172138J00732K52723K04623R0420j6987n961J15276J43289L3319
3997.6G14089572
$$ y = [713172138, 713272870, 713525593, 713730216, 713820636, 713803649, 713797688, 713912964, 714056253, 714089572]
##END=$$ End of the data block
