##TITLE=Amostra 7 $$ Begin of the data block
##JCAMP-DX=5.00 $$ ACD/SpecManager v 10.08
##SPECTROMETER/DATA SYSTEM=Alpha
##DATE=23 Aug 2016 09:05:00
##DATA TYPE=INFRARED SPECTRUM
##DATA CLASS=XYDATA
##ORIGIN=
##OWNER=
##NPOINTS=1667
##FIRSTX=599.65820312
##LASTX=3997.72216797
##MAXX=3997.72216797
##MINX=599.65820312
##MAXY=0.96890879
##MINY=0.86773932
##XFACTOR=1.0000000000
##YFACTOR=1.000000000000000e-9
##FIRSTY=0.96479613
##DELTAX=2.03965425
##XUNITS=1/CM
##YUNITS=ARBITRARY UNITS
##XYDATA=(X++(Y..Y))
599.7 964796126 964070141 963526726 963249624 963155091 963329375 963769674 964335680 965071499 966044307 966958404
620.1 966958404 967450261 967705727 967871666 967627168 966930509 966181993 965746522 965647042 965712130 965847552
640.5 965847552 965840280 965551019 965291679 965240479 965043783 964573145 964260042 964352667 964397848 964112222 963818610
662.9 963818610 962888241 960311532 958784640 960281610 961456895 961544096 961267114 960924268 960511684
681.2 960511684 960164130 959940612 959689796 959339082 958863974 958417356 958132625 957744360 957009315 955950260
701.6 955950260 954459906 952280760 949435174 946643054 946032524 949238181 954211533 957575858 958681166
720 958681166 958579481 957667470 956288159 955682933 956543684 958059609 959092796 959276795 958910346 958357573
740.4 958357573 957868218 957390249 956828296 956308544 955744445 955095410 954483986 953914762 953378022 952825308
760.8 952825308 952119529 951115370 949966431 949043274 948468804 948307514 948529303 948894739 949369609
779.1 949369609 949900329 950253606 950411677 950371444 950112224 949868679 949688077 949339032 948808432 948091328
799.5 948091328 947034061 945736229 944440126 943364620 942570388 941873729 941168129 940095544 938240111
817.9 938240111 935687065 932476401 928488731 924169600 920744598 919258952 919784129 921559811 923551023
836.3 923551023 925282836 926804543 927981615 928622782 928932488 929252446 929564536 929561317 929062665 928147197
856.7 928147197 926905036 925254703 923170984 920723438 917649269 913844049 910320401 908509791
873 908509791 908966005 911386788 915132642 919724822 925407469 932300866 939083815 943980932 946708500
891.3 946708500 948103189 948637426 948572874 948260486 947795987 947204113 946563423 945841312 944945455 943972468
911.7 943972468 943159401 942537069 942033589 941599429 941165388 940837860 940615773 940296054 939792395 939215779
932.1 939215779 938761950 938377857 937921643 937429547 937017500 936678588 936351538 936118305 935883403 935518026
952.5 935518026 935154498 934895217 934690118 934468865 934302986 934150279 933863640 933598399 933432639 933184564
972.9 933184564 932799757 932391167 932028830 931574166 930889964 930124938 929421246 928703368 928034067 927535355
993.3 927535355 927197576 927015722 926930666 926835418 926549256 925831437 924569786 923137128 922373056 922599673
1013.7 922599673 923200488 923465192 923111618 922141612 920742154 919112146 917347550 915498316 913609147
1032.1 913609147 911802709 910214484 908956945 908150911 907700658 907386422 907184184 907123983 907122135 907090425
1052.5 907090425 907169104 907634854 908444107 909293711 910084128 910858035 911572576 912218630 912673473 912799776
1072.9 912799776 912825108 912904143 912880421 912683189 912382483 912185371 912326932 912717104 913045645 913147509
1093.3 913147509 913005888 912561119 911804259 910924792 910178363 909787416 909858346 910369456 911224842 912084758
1113.7 912084758 912543952 912652612 912811756 913170099 913578749 914004147 914437413 914734423 914896905 915094495
1134.1 915094495 915391862 915645957 915750384 915786445 915774226 915633678 915332735 914882779 914299130 913609207
1154.4 913609207 912816167 911867380 910804927 909768462 908823609 907927096 906996131 905978441 904762208
1172.8 904762208 903011978 900297403 896765530 893577397 892206490 893326521 896458149 900507569
1189.1 900507569 904465675 907733619 910093248 911582232 912340224 912454426 912051916 911356330 910441041
1207.5 910441041 909236789 907838523 906386614 904853165 903185725 901341736 899298668 897081196
1223.8 897081196 894739628 892383873 890169621 888265312 886728168 885486245 884418786 883373559
1240.1 883373559 882281661 881273806 880619884 880585492 881433427 883392274 886493146 890433073 894618094
1258.5 894618094 898425996 901325226 903057694 903857052 904131830 904168367 904152215 904016197 903559983
1276.8 903559983 902788818 901828110 900748670 899561405 898354411 897316813 896543682 896009386 895656049
1295.2 895656049 895534515 895765305 896326542 897081852 897820413 898320079 898516655 898596883 898891032 899366379
1315.6 899366379 899676442 899852753 900009453 899945796 899618387 899191022 898789644 898428380 897936344 897117972
1336 897117972 896155238 895808458 896237135 896525323 896307766 895915806 895478308 894863367 893988907 892852068
1356.4 892852068 891150713 888947308 887652099 888208389 889229834 889571428 889199495 888171613 887236953
1374.7 887236953 886845469 886386633 885679007 884873748 883888185 883143902 883227408 883178711 882098019 880997658
1395.1 880997658 880901456 881498396 882162392 882203639 882086396 882475317 882728696 882664144 882574081 882094264
1415.5 882094264 881376207 881924272 883476377 884545684 885243416 885589242 885732770 886038899 885777116
1433.9 885777116 885255873 886317074 888037741 888839841 888796270 888126791 887451172 887184680 886555254
1452.2 886555254 884912014 883269191 884254456 886682093 888040662 888798416 890024841 890945554 890712321
1470.6 890712321 890417874 891594529 893799245 895927250 897470951 898555100 898922741 898346543 897935808
1489 897935808 899082601 900439143 900092840 898491681 896668375 893924713 889021575 880463839 870701849
1507.3 870701849 867739320 871151030 877930820 886270046 894531786 900959492 906184494 910863936
1523.6 910863936 914321959 917375863 919927180 921428084 923129380 925114870 925824881 926203728 928240001
1542 928240001 931140482 934168279 936528921 938296437 940002024 941193104 941279113 941460729 944763005
1560.3 944763005 948525846 950596750 951625824 952255309 953467429 954747438 954967856 954949498 955561399
1578.7 955561399 956292808 957198322 958527684 960068285 961518586 962585926 963057518 963066339 962764800
1597.1 962764800 961913884 960364819 958460808 956785798 956049502 956847310 958859563 960886359 962531805
1615.4 962531805 964501381 966210365 966875911 967306197 967998981 968520820 968908787 968868792 967889667
1633.8 967889667 966970384 967539728 968399644 968417108 967364609 965789735 965329409 965215623 963941038
1652.1 963941038 963871241 965699196 966626883 966232836 965496957 965296805 964799404 963496864 962770164
1670.5 962770164 962695420 962323725 962153316 961879015 960628808 958744228 958154798 959188461 959847867
1688.8 959847867 959970653 959282458 957497537 955738127 954563260 954455972 955128968 955302179 955307722
1707.2 955307722 955271840 954508245 952783167 950704277 949793816 950675189 951657355 951943219 951806366
1725.6 951806366 951122105 949944437 948537767 947778046 948854148 949865639 949735880 949280560 948845148
1743.9 948845148 948157251 947012126 946142673 946473658 946893096 946367919 945483744 944528818 943769276
1762.3 943769276 943321049 942138314 940374494 938854814 937688351 937025070 936271489 934753180 932767153
1780.6 932767153 930699527 928551733 926488698 924180984 921641767 920365453 920723200 921425402 922227025
1799 922227025 923748195 926065385 928235114 929607153 930408239 931143522 932027161 932742834 933219552
1817.3 933219552 933759868 934235811 934539914 935199916 936193287 937250257 938656747 939892471 940461338
1835.7 940461338 940680027 940634370 940019786 939368784 939674914 940424502 940906525 941061556 940983772 940778255
1856.1 940778255 940455616 940199971 940091968 939732611 938834310 938093066 938354671 939005077 939240754 939129710
1876.5 939129710 938887358 938628912 938419163 938190579 937785268 937323809 937271953 937400699 937331676 937331975
1896.9 937331975 937396228 937326610 937191725 937022388 936762929 936528325 936480224 936476529 936193585 935727775
1917.3 935727775 935509145 935462952 935521781 935802639 935973346 935866773 935661793 935521722 935497105 935376585
1937.7 935376585 934904218 934320211 934214532 934483409 934649765 934657991 934549034 934352100 934193254 934134603
1958.1 934134603 934091568 933982670 933727860 933403671 933293760 933418453 933496594 933384478 933256805 933235884
1978.5 933235884 933201492 933089435 932924449 932712853 932443976 932144880 932027996 932163537 932300925 932309866
1998.9 932309866 932180941 931986928 931882024 931861877 931866169 931823671 931623816 931344807 931239545 931361198
2019.3 931361198 931451142 931340098 931155801 931072354 931062400 931006968 930907190 930810392 930724859 930617630 930506289
2041.7 930506289 930452228 930409133 930351198 930310488 930229247 930077910 929962993 929918766 929844558 929688931 929502726
2064.1 929502726 929412365 929424107 929434299 929421902 929372966 929335535 929299593 929179490 929057837 928960145 928852916
2086.6 928852916 928802013 928844333 928901255 928882241 928857446 928854525 928795993 928719223 928689659 928684950 928635180 928545296
2111.1 928545296 928474426 928407431 928326905 928259254 928200424 928126514 928048074 928004920 927993953 927955031 927844763
2133.5 927844763 927699268 927607298 927608430 927629650 927608609 927617550 927635908 927537501 927386343 927315533 927291155
2155.9 927291155 927239478 927170217 927103460 927062869 927089274 927123964 927083075 927025795 926993370 926953912 926931083
2178.4 926931083 926912367 926858008 926797807 926771104 926782668 926785231 926710010 926594257 926527321 926493526 926468253
2200.8 926468253 926469505 926455617 926422894 926422358 926401198 926324368 926269293 926219225 926120043 926015675 925927758 925870419
2225.3 925870419 925848961 925830781 925820768 925806046 925777018 925742924 925715208 925725400 925688207 925546169 925384402
2247.7 925384402 925286055 925276577 925255597 925179422 925148666 925167739 925147057 925038695 924887478 924811661 924837768
2270.1 924837768 924873173 924883425 924836159 924738169 924690068 924650133 924527764 924396932 924268305 923985660 923542738
2292.6 923542738 923117816 922693670 922167718 921646357 921153426 920528710 919773996 919167995 918887675 918788671
2313 918788671 918692172 918411136 917849123 917341053 917388022 917794168 917862892 917661607 917840004 918433368
2333.4 918433368 918872535 918829799 918480694 918122470 917714238 917383492 917414367 917447567 917184591 916854203
2353.8 916854203 916685998 916548073 916481495 916710258 917051256 917176604 917137980 917129636 917298079 917666018
2374.2 917666018 918170035 918929338 919991374 921118081 922101915 922852397 923306584 923515320 923617542
2392.5 923617542 923652887 923612833 923558593 923492789 923390687 923332691 923357904 923414409 923454583 923427284 923358083
2414.9 923358083 923314989 923258960 923170805 923108160 923065245 923014522 922974765 922987998 923069596 923138261 923140705 923149943
2439.4 923149943 923196852 923254132 923298657 923267543 923168004 923062921 922975838 922949016 922997952 923065603 923084974
2461.9 923084974 923037827 922978103 922975242 922986269 922935069 922841489 922742844 922651887 922586799 922533214 922424436
2484.3 922424436 922316551 922336042 922412217 922386229 922250211 922140718 922147870 922172070 922117293 922027230 921899378
2506.7 921899378 921772540 921780586 921888292 921955466 921929359 921890795 921976447 922146440 922279179 922326148 922290146
2529.2 922290146 922318935 922449350 922541022 922637224 922770679 922798038 922732711 922701240 922700524 922691762 922677577 922684908
2553.6 922684908 922715306 922722638 922706246 922730327 922832549 922943354 922947824 922850430 922805488 922846675 922848046 922822297
2578.1 922822297 922877848 922981381 923013985 922933459 922847927 922892809 922974348 922957838 922913551 922928870 922974348
2600.5 922974348 923007429 923025787 923006952 922973335 922967970 922975004 922990322 922978759 922866821 922715068 922680914
2623 922680914 922779679 922880590 922947705 923029602 923060358 922993064 922899425 922822416 922799349 922875047 922987819
2645.4 922987819 923019230 922949433 922852397 922797859 922799110 922804713 922805309 922859132 922967970 923057258 923043013 922934830
2669.9 922934830 922783196 922603488 922499835 922564924 922707558 922776520 922757685 922741652 922729433 922709763 922738492
2692.3 922738492 922762632 922734916 922705173 922646523 922604501 922629058 922639906 922648489 922706068 922751129 922700703 922600985
2716.8 922600985 922532141 922518611 922547400 922551274 922526896 922510326 922520339 922576904 922636271 922620237 922512650
2739.2 922512650 922409296 922438800 922553420 922601163 922588587 922542453 922445536 922368705 922334850 922360778 922483683
2761.7 922483683 922575057 922562122 922549188 922563255 922545433 922445595 922333598 922327816 922350824 922328174 922295332
2784.1 922295332 922248244 922206759 922215402 922273278 922286630 922193646 922117531 922118545 922113240 922079861 921988249 921819091
2808.6 921819091 921707690 921703637 921723902 921769261 921821237 921796978 921646714 921464443 921369910 921255469 921042502
2831 921042502 920820951 920580387 920279622 920120716 920279443 920505404 920547128 920495331 920476377 920463920 920278370
2853.4 920278370 919819355 919235706 918658495 918069780 917429686 916708529 916034639 915590644 915300965 915145934
2873.8 915145934 915301442 915672660 915980220 916194618 916386425 916562915 916755676 916936755 917044997 917094231
2894.2 917094231 917143941 917189181 917184711 917157710 917115450 916999519 916757405 916396081 916044414 915850341 915768027
2916.7 915768027 915614545 915313184 914940953 914569914 914186060 913838863 913648427 913648427 913813353 914062440
2937.1 914062440 914247870 914329052 914339662 914332628 914392352 914400637 914184213 913837373 913458645 912945926 912304580
2959.5 912304580 911751032 911421776 911272049 911346674 911724567 912272930 912971437 913804173 914577901 915344179
2979.9 915344179 916211426 917016864 917591929 918032587 918477535 918921351 919372320 919792771 920160592 920545101
3000.3 920545101 920878649 921130896 921401083 921586812 921580136 921567082 921744168 922034562 922258735 922379971
3020.7 922379971 922379851 922274232 922156513 921970189 921652615 921299934 921020269 920876205 920853496 920917809
3041.1 920917809 921065450 921147346 921064913 921010196 921097815 921173573 921144605 921183527 921367168 921447933 921352088
3063.5 921352088 921344995 921508551 921684504 921755135 921709239 921656132 921687186 921825945 922017336 922157347 922267914
3086 922267914 922368705 922362447 922234237 922141612 922174215 922242045 922300816 922380149 922389269 922310412 922295868 922325253
3110.4 922325253 922300041 922235489 922167659 922162533 922248721 922290504 922214568 922153294 922123134 922090292 922169268 922329068
3134.9 922329068 922416329 922428548 922416449 922351360 922266543 922272980 922285318 922186613 922089875 922071040 922127724 922252178
3159.4 922252178 922313869 922271490 922210157 922080994 921912313 921843171 921846747 921894372 921983242 922004163 921897411
3181.8 921897411 921786666 921773016 921755910 921710134 921702206 921695948 921674669 921664059 921690702 921763361 921820700 921758294
3206.3 921758294 921578944 921436191 921424091 921478927 921480834 921385348 921245456 921195745 921286225 921300709 921158731
3228.7 921158731 921036124 920931995 920785785 920637131 920505822 920467019 920473278 920425534 920402467 920364678 920276940
3251.2 920276940 920251608 920272410 920293689 920286596 920159221 919974566 919826627 919751406 919814885 919889629 919871449
3273.6 919871449 919840157 919823110 919833839 919862390 919750750 919534922 919431090 919352829 919252455 919247389 919253945
3296 919253945 919187069 919083178 919026017 919051349 919037640 918980360 918967187 918899715 918751657 918634772 918596685
3318.5 918596685 918655515 918782175 918792903 918647528 918565512 918553710 918465734 918388784 918427467 918408632 918289542
3340.9 918289542 918261230 918313861 918282151 918114126 917917132 917778611 917729139 917762637 917795241 917777538 917780757
3363.3 917780757 917829573 917774856 917628109 917567670 917591929 917656302 917741358 917731822 917581499 917383254 917300344
3385.8 917300344 917373359 917358637 917214692 917247176 917389214 917292237 917060375 916987062 917090714 917188525 917172015
3408.2 917172015 917217970 917412341 917609572 917658150 917401969 917066336 917054534 917262673 917451799 917565584
3428.6 917565584 917578042 917551339 917629540 917757154 917705119 917574704 917587996 917631686 917623639 917721570 917893827
3451 917893827 917981744 918044209 918039322 917878747 917780757 917912245 918075919 918075502 918110669 918333292 918479383
3473.5 918479383 918464243 918454111 918410301 918405414 918567359 918675959 918670833 918860495 919157505 919198811 919110596
3495.9 919110596 919064164 918898880 918668807 918711126 918936908 919046998 919329941 919846892 920118272 920084417
3516.3 920084417 919932127 919681489 919425666 919313848 919383168 919694781 920225322 920613647 920655072 920719802
3536.7 920719802 920996189 921048999 920552373 919926226 920023859 920704186 921136498 921393037 921775341 922003448
3557.1 922003448 921944618 921801567 921264589 920055628 919542193 920794785 922347784 923054159 923315823
3575.4 923315823 923529804 923477829 923071325 922261000 921069920 920709372 921827316 922758520 922818005 922988534
3595.8 922988534 923517048 923914909 924185693 924186468 923615336 923016310 922940373 922985792 923056304 923080623 922897458
3618.3 922897458 923260510 924074769 924123883 922914445 921680689 922351837 923713028 924400091 924833834
3636.6 924833834 925210774 925322652 925105691 924252033 922485054 921147346 922097802 923780143 924367368
3655 924367368 924582243 925183058 925577104 925557315 925258934 924575806 923740208 923342228 922914922 922502279
3675.4 922502279 923274457 924510121 925278246 925467730 924898088 923728883 923153102 923918605 924944520
3693.7 924944520 925425589 925361931 925020635 924928784 925287962 925441563 924940169 924152374 923961639 924657047
3714.1 924657047 925324500 925347269 924823821 924070239 923418760 923341572 923797250 923715174 922450304 921097338
3734.5 921097338 921445727 923014164 923796833 923210740 922605693 923076928 923452377 923501492 924115717 924879909
3754.9 924879909 925264060 925670505 926317692 926503539 926151454 925991416 926171422 926607430 927079141 927110314
3775.3 927110314 926751554 926548779 926728308 926963389 927137673 927285433 927337885 927282214 926972032 926508546
3795.7 926508546 926320374 926274300 926187456 926307201 926564753 926930606 927271962 927325666 927055061 926600218
3816.1 926600218 926068306 925519824 925687134 926482141 926979899 927175820 927138805 926762402 926231265 925624669
3836.5 925624669 925154626 925310612 926035762 926850736 927235246 926894605 925759315 924505830 924902439
3854.9 924902439 926227272 926829875 926652730 926231563 926093042 925979257 925599933 925660908 926262736 926849544
3875.3 926849544 926897466 926178634 925685465 925781965 926003456 926481664 926679850 926611185 927087188 927348614
3895.7 927348614 926492393 925153613 924446106 924873233 926153123 927469611 928273261 928428054 927874744
3914 927874744 927010953 926748455 927138150 927415371 927466750 927624702 927669346 927375078 927228570 927610815
3934.4 927610815 928144336 928358674 928204238 927966177 927886367 927769661 927717030 928125024 928583801 928609610
3954.8 928609610 928425670 928434670 928678334 928898752 929052711 929135501 928995252 928748965 928601205 928519607
3975.2 928519607 928508580 928675234 929002702 929287314 929316342 929160178 929002464 928950012 929119110 929493427
3995.6 929493427 929852605
3997.6 929852605
##END=$$ End of the data block
