##TITLE=Amostra 6 $$ Begin of the data block
##JCAMP-DX=5.00 $$ ACD/SpecManager v 10.08
##SPECTROMETER/DATA SYSTEM=Alpha
##DATE=23 Aug 2016 09:05:00
##DATA TYPE=INFRARED SPECTRUM
##DATA CLASS=XYDATA
##ORIGIN=
##OWNER=
##NPOINTS=1667
##FIRSTX=599.65820312
##LASTX=3997.72216797
##MAXX=3997.72216797
##MINX=599.65820312
##MAXY=0.89971876
##MINY=0.01952713
##XFACTOR=1.0000000000
##YFACTOR=1.000000000000000e-9
##FIRSTY=0.58427781
##DELTAX=2.03965425
##XUNITS=1/CM
##YUNITS=ARBITRARY UNITS
##XYDATA=(X++(Y..Y))
599.7E84277809P773339Q793533J2160301J5209795J5763402J3983547J1411727R239733
616F78613186P850945O916165N806566M221797K531051J049042j07885j404047n563378
634.3F99913442j2146890r982407M964113J6312182J4386058P255375J863659o25909
650.7G21939623k53856J158893J152516n67556k876639m754841n136967l715217m96447
669G06449509K139151L937363N361915N093694L846228K608359J582384P81596M1186
687.4G31841385p97331j530170j830280j993418l537774p647634j4862060k5094628
703.7F74548090l8761974n9742451q2468181p3298544j4447361M9462586P2269500
718E27561665N7673573K4867237r059549k7530074j8024921J0313868K4274469J2512684
$$ plain form
599.7 584277809 592051148 600844681 613004982 628214777 643978179 657961726 669373453 678613186
616 678613186 686464131 693380296 699186862 703408659 705939710 706988752 706880867 705476820 699913442
634.3 699913442 687766552 677784145 682748258 699060440 713446498 720701873 722565532 721939623
650.7 721939623 721685767 722844660 723997176 723429620 720552981 715798140 710661173 706945956 706449509
669 706449509 708588660 712526023 717887938 722981632 726827860 729436219 731018603 731800199 731841385
687.4 731841385 731044054 729513884 727683604 725690186 722152412 714504778 699642718 674548090
703.7 674548090 635786116 576043665 493575484 420276940 405829579 455292165 527561665
718 527561665 585235238 610102475 601042926 573512852 555487931 565801799 590076268 602588952
734.3F02588952K769529J3172031K4747133J7880201O35088j1544049j5493989j4689207
750.6F20065689j2180567r532988p365346o710291r008944j5209257k4435103l2094002
766.9E03529191l1453431j8767774L657609K8454036M7073722N3208828M6171129L1903505
783.2F63776815J7874122P268548l11852n670428j0204375j6052902k4592876l5119295
799.5E96967757m4273258m7323763m1874349l0155838j8053144j1583686j3381153
813.8C90322566k3087114l8396120n4543913o3878089n9883564m3953345k4721339
828.1H1859082r466693M52571O941736J2066461J6623959K0472198K3165018K4100974
844.4A76215306K4791747K8312013L0253142K5363684J6677290N474210p647753j8179447
$$ plain form
734.3 602588952 605358481 618530512 643277645 661157846 661792934 650248885 634754896 620065689
750.6 620065689 607885122 598352134 590986788 584276497 575267553 560058296 535623193 503529191
766.9 503529191 472075760 453307986 456965595 485419631 532493353 585702181 631873310 663776815
783.2 663776815 681650937 688919485 688607633 682937205 672732830 656679928 632087052 596967757
799.5 596967757 552694499 505370736 463496387 433340549 415287405 403703719 390322566
813.8 390322566 367235452 328839332 274295419 210417330 150533766 106580421 81859082
828.1 81859082 72392389 72844960 79786696 91853157 108477116 128949314 152114332 176215306
844.4 176215306 201007053 229319066 259572208 284935892 301613182 307087392 299439639 281260192
860.7B81260192k2924721k3070380k3853898k8645828l2353148k7150318j3725579
875A09536320J027763J1913434J8615618K8637230M6842978O0029760N4843574L8923175
891.3C70369852K4885118J4590829N313188l898323j2049496j6921580j7533689j6220361
907.6C48535538j6320646j7359316j4583856m306197J1828392K7033240L3584893K8822809
924C97234857J7349184O360203j05590k129823j596600J401K013206L878057M947514
942.3D27952409M785836L440916J367718r49711k790808l375054k578914j103133L30359
960.7D27079618J355857J322984k09689k130985k382636m00931J829177J611650j815140
979D26259905o937146j1605561j4644772j6003996j5770763j3680607r623498m590928
$$ plain form
860.7 281260192 258335471 235265091 211411193 182765365 150412217 123261899 109536320
875 109536320 110564083 122477517 141093135 169730365 216573343 276603103 331446677 370369852
891.3 370369852 395254970 409845799 415158987 411260664 399211168 382289588 364755899 348535538
907.6 348535538 332214892 314855576 300271720 295965523 307793915 334827155 368412048 397234857
924 397234857 414584041 420944244 420838654 418708831 417112231 417113632 419126838 423004895 427952409
942.3 427952409 432738245 436179161 437546879 436597168 433806360 430431306 427852392 426749259 427079618
960.7 427079618 428435475 429758459 429548770 427417785 425035149 424634218 426463395 428075045 426259905
979 426259905 419322759 407717198 393072426 377068430 361297667 347617060 337993562 333402634
995.4C33402634r09448p81894m308521j1016876k3079753l8778603m2491943k4049490
1011.7A87986106p93830P882983K939373p219479j6089365k0346626k0691544j9005902
1028A14661716j6164370j2693003r061739n492165k167061Q08663L198296M757993
1044.3G7848330N294621M885174M138150L713138L871322M700392O030038P211261
1060.6A17692426P787213P665947O654381M656241K200231L88220J88693J220837J518190
1079A49972379n82233l664285l891229l5629M624024O455511M930749J310781l444418
1097.3A55675650q305341j1479274j1328719p552125j417160M465014P440761O646066
1113.7A34144872L448934N49361K52902K404884M509061M622520L144368J779273J796425
$$ plain form
995.4 333402634 332493186 331711292 327402771 316385895 293306142 254527539 212035596 187986106
1011.7 187986106 187192276 195075259 198014632 190795153 174705788 154359162 133667618 114661716
1028 114661716 98497346 85804343 76742604 71250439 69083378 69892041 73090337 77848330
1044.3 77848330 83142951 88028125 92166275 95879413 99750735 104451127 110481165 117692426
1060.6 117692426 125479639 133145586 139799967 144456208 146656439 147044659 147233352 148454189 149972379
1079 149972379 149390146 145725861 141834632 141799003 146423027 152878538 157809287 159120068 155675650
1097.3 155675650 147370309 135891035 124562316 117010191 115593031 120058045 127498806 134144872
1113.7 134144872 137593806 138143167 138396069 140800953 145310014 149932534 153076902 154856175 156652600
1132A56652600L204882N152538O720856P127687N934656L566131J141399o31288k159059
1150.4A86710402m176899o628663q601993r185523q541882p629484o956830o627173
1166.7A28361955o774090p489733r201751j2478604j6145647j6822763j2785367o310359
1183D0353641j73975N313411J1280511J8186785K4301321K6564560K3475677J6272560
1199.3A65574491P681891j14336o443694j1355743j4622763j6026721j5924759j4848694
1215.6I3919672j3307378j1659294r892810p974316o181821m728418l448896k327498
1232C4399241j574095j221735j061116r35260q53764p64675n68936k33005K03967P31077
1252.4B8121699J485372K681350M324064O185226P734231Q319155P712628O233126
$$ plain form
1132 156652600 159857482 165010020 171730876 178858563 184793219 188359350 189500749 188869461 186710402
1150.4 186710402 182533503 175904840 167302847 158117324 149575442 141945958 134989128 128361955
1166.7 128361955 121587865 114098132 104896381 92417777 76272130 59449367 46664000 40353641
1183 40353641 40179666 45493077 56773588 74960373 99261694 125826254 149301931 165574491
1199.3 165574491 173256382 173142046 166698352 155342609 140719846 124693125 108768366 93919672
1215.6 93919672 80612294 68953000 59060190 51085874 44904053 40175635 36726739 34399241
1232 34399241 32825146 31603411 30542295 29607035 28753271 27988596 27419660 27186655 27390622 28121699
1252.4 28121699 29607071 32288421 36612485 42797711 50531942 58851097 66563725 72796851
1268.7G2796851M426144K583094Q11875q24295k365425l805272m907325n317629m919163
1287E8478855l994700k925288j925994j026712j09505R55321K246708L552939M333672
1305.4E9585296M216119L548481L463663M502773N588621N572185M293010K299621
1321.7I3069769N76534m59291j054056j427852j547202j521349j776405k335645k650477
1340.1H0874026k541445k163075j592949j105585j017570j454406k493746m360989
1356.4F4144261o259665o098602l011498O14397K084371J629162K28018q91824j505691
1374.7E0932929k342701l145132l369041k947442j922924o62327l30109r86077j196388
1393.1C4030788r50247q69573p51864q62127j000782p70893p39873q36823p26320o72100
$$ plain form
1268.7 72796851 77222995 79806089 80617964 79793669 77428244 73622972 68715647 63398018 58478855
1287 58478855 54484155 51558867 49632873 48606161 48496656 49451977 51698685 55251624 59585296
1305.4 59585296 63801415 67349896 70813559 75316332 80904953 86477138 90770148 93069769
1321.7 93069769 93646303 93187012 92132956 90705104 89157902 87636553 85860148 83524503 80874026
1340.1 80874026 78332581 76169506 74576557 73470972 72453402 70998996 68505250 64144261
1356.4 64144261 57884596 51785994 48774496 49388893 51473264 53102426 53330444 52438620 50932929
1374.7 50932929 48590228 45445096 42076055 39128613 37205689 36543362 36213253 35227176 34030788
1393.1 34030788 33080541 32210968 31459104 30596977 29596195 28825302 28085429 27248606 26522286 25850186
1413.5B5850186o30731P9032R41294M21140j23957j23145j90444l3105j45985l55141
1433.9B5689144M15677Q74635k7152m42943l86692k19859L3132k32845p97430p43902
1454.3B4161765Q15601J685084L3947m21008O12855P99166r3149J66206J565909J795688
1474.7C1122064R69628O76695Q27201Q61872O02391O99628J197472P28555r50631j837644
1495.1C4897231j922161k758708l771996l881251k534434m28651p2902J41583J400326
1513.4B1069037L633499O164437Q754671J2235537J2020744R830453R272165P439696
1529.7I0420239O855718P883169N691000M500642Q571662R425558O336019N327865
1546.1A45011872N042642N377278N339563M606217L938422P300690R286105L159672
$$ plain form
1413.5 25850186 25219455 25298487 26239781 26660921 26536964 26413819 26223375 26190270 26044285 25689144
1433.9 25689144 26104821 26979456 26952304 26509361 26122669 25902810 25935942 25703097 24905667 24161765
1454.3 24161765 24977366 26662450 26696397 26275389 26888244 27687410 27594261 27760467 29326376 31122064
1474.7 31122064 32091692 32768387 33595588 34457460 35059851 35759479 36956951 37685506 36734875 34897231
1495.1 34897231 32975070 30216362 26444366 22563115 20028681 19600030 19527128 19668711 21069037
1513.4 21069037 24702536 30866973 39621644 51857181 63877925 73708378 82980543 90420239
1529.7 90420239 97275957 105159126 110850126 115350768 123922430 133347988 139684007 145011872
1546.1 145011872 150054514 155431792 160771355 165377572 169315994 176616684 185902789 189062461
1562.4A89062461Q07598P72700o363k298548o943509j2108148j7246454j6632602r254769
1580.7A26152366K238319J4802858K0880580J6707286O199166m453644j2533203j7998397
1597.1A51995331k1234065k2344969k0238407j3972298m570573O341442J6256638K3188032
1613.4A15421131L1753987L8990453L0694872K2459150K1261275J7073899J2389511
1627.7B90044278R616136O325752N568862Q259356P355928M541368M002392M469037
1644C40183109O872326P394016L995448O524653J1948734O942570L846258M942596
1660.3C92649710O663591O482243M614026N251527O540358N059898M983037N392492
1676.6D37636882L293186J820088K790242N142451L044724K00957p20054k068281l100812
$$ plain form
1562.4 189062461 189870059 190642759 190636396 188337848 181394339 169286191 152039737 135407135 126152366
1580.7 126152366 128390685 143193543 164074123 180781409 186980575 182526931 169993728 151995331
1597.1 151995331 130761266 108416297 88177890 74205592 69635019 75976461 92233099 115421131
1613.4 115421131 147175118 186165571 216860443 239319593 260580868 277654767 290044278
1627.7 290044278 299660414 305986166 311555028 319814384 327170312 331711680 335714072 340183109
1644 340183109 347055435 354449451 358444899 364969552 376918286 383860856 387707114 392649710
1660.3 392649710 399313301 405795544 410409570 415661097 422201455 427261353 432244390 437636882
1676.6 437636882 440930068 442750156 445540398 450682849 453727573 453928530 453208476 451140195 448039383
1695D48039383m293323n664438p385522r323329j1183649j3227105j5017063j6575843
1711.3C65369111j7296642j6423076j3189078q131265k910465K677202Q001894J1741817
1727.6C29839498J4380783J6820967K3472756K5121719J8710017J7658204J6249835
1741.9D62253779J1543214P535816M095584J223236j955092n553871q665621j1076451
1758.2D59400594j2499451j3628304j3903529j3950616j4680147j5772402j8404812
1772.5C56561333k1226436k3052603k5479197k7705104k8164833k7542264k6140019
1786.7A77250877k3679674k1086082j7393350j1650972o189622r21033M770703R418666
1803.1A10519513J2388163J4353551J5770107J6348556J5486091J4402464J4807746
$$ plain form
1695 448039383 443746060 438081622 430696100 421372771 410189122 396962017 381944954 365369111
1711.3 365369111 348072469 331649393 318460315 310329050 307418585 310095787 318097681 329839498
1727.6 329839498 344220281 361041248 384514004 409635723 428345740 446003944 462253779
1741.9 462253779 473796993 481332809 485428393 486651629 484696537 479142666 470477045 459400594
1758.2 459400594 446901143 433272839 419369310 405418694 390738547 374966145 356561333
1772.5 356561333 335334897 312282294 286803097 259097993 230933160 203390896 177250877
1786.7 177250877 153571203 132485121 115091771 103440799 97251177 96330144 101100847 110519513
1803.1 110519513 122907676 137261227 153031334 169379890 184865981 199268445 214076191
1817.3B14076191J6641438K0240784K7228266L6335230M2887270M9442172N2016706
1831.6D58868057M6296685M0598453L5173595K7975201K1632016J8745839J5940905
1845.9F65230751J1931062R526133P929385O368697N126714M047156K966225J938403
1862.2G15064526Q80003J54316J69814P26819P56085L58104r9718n94437r10700q47220
1882.6G15657592m74751m0472P72655J984895L077328M082024N200863N903959O207407
1901G42371500O347477O262004N955875N618811N388439M945397M372239M096568M061281
1919.3G89419591L755033L573120L532529L144622K638817K178132J789808J445175
1935.6H11476827J074850N83768L77059O14703P71701O93262P37071R70959J170516
$$ plain form
1817.3 214076191 230717629 250958413 278186679 314521909 357409179 406851351 458868057
1831.6 458868057 505164742 545763195 580936790 608911991 630544007 649289846 665230751
1845.9 665230751 677161813 686687946 694617331 700986028 706112742 710159898 713126123 715064526
1862.2 715064526 715944529 716098845 716268659 716995478 717751563 718109667 718009949 717415512 716504812 715657592
1882.6 715657592 715182841 715142369 715915024 717899919 720977247 725059271 730260134 736164093 742371500
1901 742371500 748718977 754980981 760936856 766555667 771944106 776889503 781261742 785358310 789419591
1919.3 789419591 793174624 796747744 800280273 803424895 806063712 808241844 810031652 811476827
1935.6 811476827 812551677 813135445 813512504 814127207 814898908 815592170 816329241 817300200 818470716
1954H18470716J278639J218319J132012J232624J423776J453638J407325J284719J050055
1972.4H29951823Q50439P54416P12454N19395K31087k384j03891k29895l38376j63078
1992.8H32181990J39773K49744K02298J62959J45495K38955L64542L96549K41042n3883
2013.2H34269464k47002j90675K0981K25127M69863Q38399J256824J418352J215338
2031.5H39276671P88689K90334j76668o40988j113475j501739j762747j882911j844168
2049.9H31432998j794219j735627j627207j514077j348496j098633p59542k47121L85642
2068.2H21693718Q98123J358032J889587K346694K609074K790511K963424L005922
2084.5H39555085K909243K787709K756298K779364K726972K555192K352178K171993
$$ plain form
1954 818470716 819749355 820967674 822099686 823332310 824756086 826209724 827617049 828901768 829951823
1972.4 829951823 830802262 831556678 832269132 832788527 833019614 833017230 832913339 832683444 832345068 832181990
1992.8 832181990 832321763 832571507 832773805 832936764 833082259 833321214 833685756 834082305 834323347 834269464
2013.2 834269464 834022462 833831787 833852768 834077895 834547758 835386157 836642981 838061333 839276671
2031.5 839276671 840065360 840355694 840179026 839538038 838424563 836922824 835160077 833277166 831432998
2049.9 831432998 829638779 827903152 826275945 824761868 823413372 822314739 821555197 821308076 821693718
2068.2 821693718 822591841 823949873 825839460 828186154 830795228 833585739 836549163 839555085
2084.5 839555085 842464328 845252037 848008335 850787699 853514671 856069863 858422041 860594034
2100.9H60594034J965285J743733J503289J204610Q94964P17222O74010O39796O68645
2119.2H70605588Q32856R92715J040280R90689R19401Q90553Q38220Q37267R15408
2137.6H78862977R53853R24051Q66532R24647J046300J082063J129746J262307J286209
2155.9H88338685J179397J105070J060367R96232R11474Q50618P70688O90222O69420
2174.3H96572173O11305N29110N10991M55916L43859K73347K02596R0957o616k2054
2194.7H99561584j2755J0311P2003Q3267M351j03712k02357l34919m73440n84244n88894
2217.1H97431195m25279k42412j55747r1017j6570O0082J12652L5048p1049q9884j42395
2239.5H96404624k72334l84450m53651m93764n49019o09338o19233o58989p47204q48352
$$ plain form
2100.9 860594034 862559319 864303052 865806341 867010951 867905915 868623137 869297147 869936943 870605588
2119.2 870605588 871438444 872431159 873471439 874462128 875381529 876272082 877110302 877947569 878862977
2137.6 878862977 879816830 880740881 881607413 882532060 883578360 884660423 885790169 887052476 888338685
2155.9 888338685 889518082 890623152 891683519 892679751 893591225 894441843 895212531 895902753 896572173
2174.3 896572173 897183478 897712588 898223579 898679495 899023354 899296701 899499297 899590254 899583638 899561584
2194.7 899561584 899548829 899559140 899631143 899714410 899718761 899615049 899412692 899077773 898604333 898020089 897431195
2217.1 897431195 897005916 896763504 896607757 896516740 896500170 896560252 896672904 896707952 896636903 896547019 896404624
2239.5 896404624 896132290 895747840 895294189 894800425 894251406 893642068 893022835 892363846 891616642 890768290
2259.9H90768290q45373o94811o36459o89089o50644n33760l45230j41382p3135o9380
2280.3H86089027j58668m97579r38654j201093j272142j167774q27611m36366j18017
2298.7H79471123J72973L41952L11196K38537K79963K52963r8944m86314n94676o40571
2319.1H79248202o30498k07782N03898R18209J003325R86100Q34643P59840Q34823
2337.4H84250760P13050L08454o49034j907945j412571P58529K850711L943742L634393
2355.8H92490089K280474J075208M28736m98772j379072j676023j806081j819014j552403
2374.2H87543142j228631q48829m51208k58028k70724l62456n15461p60794j039266
2392.5H81807745j281143j328230j147389j024008j025319j034200j122117j292288
$$ plain form
2259.9 890768290 889922917 889228106 888591647 887902558 887251914 886718154 886372924 886231542 886158407 886089027
2280.3 886089027 885930359 885432780 884494126 883293033 882020891 880853117 880025506 879589140 879471123
2298.7 879471123 879644096 879986048 880297244 880535781 880815744 881068707 880969763 880483449 879888773 879248202
2319.1 879248202 878617704 878409922 878913820 879832029 880835354 881821454 882656097 883415937 884250760
2337.4 884250760 884963810 885272264 884623230 882715285 881302714 882061243 884911954 888855696 892490089
2355.8 892490089 894770563 895845771 896274507 895775735 894396663 892720640 890914559 889095545 887543142
2374.2 887543142 886314511 885465682 885014474 884756446 884485722 884123266 883607805 882847011 881807745
2392.5 881807745 880526602 879198372 878050983 877026975 876001656 874967456 873845339 872553051
2408.8H72553051j560450j976073k295196k400696k510667k575100k348899j891375
2425.1H54994595j331687o92546j03295K99156N23150O32166O80030O40631M49478
2443.5H56091678K21431N7459m8935j75238m65750q35598j171827j539827j950264
2461.9H50183129k406716k874076l204108l439128l726959m077554m507661n024016
2478.2H20922911n594492o197810o798148p242620p437885p577479p852793q360266
2494.5G63861418r061873r835363j0716796j1565387j2014389j1791289j0664999q768141
2510.8F79443181o687105m819989l130973j312673Q01087K991378M958749O594002
2527.1F78837657P920861Q920372R479403R632230R444296Q584440O911755N162954
$$ plain form
2408.8 872553051 870992601 869016528 866721332 864320636 861809969 859234869 856885970 854994595
2425.1 854994595 853662908 852970362 852867067 853166223 853689373 854321539 855001569 855642200 856091678
2443.5 856091678 856313109 856370568 856321633 856146395 855680645 854845047 853673220 852133393 850183129
2461.9 850183129 847776413 844902337 841698229 838259101 834532142 830454588 825946927 820922911
2478.2 820922911 815328419 809130609 802332461 795089841 787651956 780074477 772221684 763861418
2494.5 763861418 754799545 744964182 734247386 722681999 710667610 698876321 688211322 679443181
2510.8 679443181 672756076 667936087 664805114 663492441 664293528 667284906 672243655 678837657
2527.1 678837657 686758518 695678890 705158293 714790523 724234819 732819259 739731014 744893968
2543.4G44893968M126549L767490L691495L725767L911018M187167M325688M215061
2559.8G76844203L878296L458679L035009K522945J956105J528680J285613J067758
2576.1G95577288Q46266O72162M49061J32621o199K68578P81596J301408J745582K075195
2596.5H03843558K310693K408803K384007K446651K593577K652466K646327K536238
2612.8H23822320K240300J937270J644611J299381J163483J378298J816869K274275
2629.1H37576807K510607K457022K245009K004743J860857J705349J357555J028299
2645.4H52746248Q05676N84305M18603K76864R8705j0491r119j9729q9824j32502j81317
2667.8H54487419l88741o05762o77944p48634q00133o49631m19378m93050q35955j085877
$$ plain form
2543.4 744893968 749020517 752788007 756479502 760205269 764116287 768303454 772629142 776844203
2559.8 776844203 780722499 784181178 787216187 789739132 791695237 793223917 794509530 795577288
2576.1 795577288 796423554 797095716 797544777 797677398 797671199 797939777 798721373 800022781 801768363 803843558
2596.5 803843558 806154251 808563054 810947061 813393712 815987289 818639755 821286082 823822320
2612.8 823822320 826062620 827999890 829644501 830943882 832107365 833485663 835302532 837576807
2629.1 837576807 840087414 842544436 844789445 846794188 848655045 850360394 851717949 852746248
2645.4 852746248 853551924 854136229 854554832 854831696 854930401 854919910 854910791 854891062 854801238 854668736 854487419
2667.8 854487419 854098678 853492916 852814972 852066338 851266205 850616574 850197196 849704146 848868191 847782314
2688.2H47782314j101494r90331r64523j002669r20653q80718j093865j408696j696885
2706.6H37722480j911699j999438k103150k253473k236783k227009k307355k057970
2722.9H20625603j499951p06553J37985L83913J18911k04324n40912q92282j299083
2741.3H16123307j771927k306581k630829k387226k028465j987458j787543j096547
2757.6H00126731k38835N37157J050770J160860J050353P42734N3107o11901n51581
2775.9H03319395l40581q46923j572072k136469k910257l553450l367841k946079l238499
2794.3G82407224l890276l775358k901196k441168k526105k741158l052234k928138
2810.6G58151591k613306l112257m106998m937411n743980o713331p672727q459329
$$ plain form
2688.2 847782314 846680820 845690489 844725966 843723297 842802644 841921926 840828061 839419365 837722480
2706.6 837722480 835810781 833811343 831708193 829454720 827217937 824990928 822683573 820625603
2722.9 820625603 819125652 818419099 818557084 818940997 819059908 818855584 818314672 817422390 816123307
2741.3 816123307 814351380 812044799 809413970 807026744 804998279 803010821 801223278 800126731
2757.6 800126731 799887896 800425053 801475823 802636683 803687036 804429770 804482877 803870976 803319395
2775.9 803319395 802978814 802131891 800559819 798423350 795513093 791959643 788591802 785645723 782407224
2794.3 782407224 778516948 774741590 771840394 769399226 766873121 764131963 761079729 758151591
2810.6 758151591 755538285 752426028 748319030 743381619 737637639 730924308 723251581 714792252
2826.9G14792252r122849r477794r276748q854806q722842q432865q150637r193659
2843.3F43560052j1278629j3212145j5015065j7671109k1601617k6201069l1006575
2857.5E07573843l5515159l8975299m0607005l8943648l2866508k3366243j2407958
2871.8B84892023j501024P719785J3486564J5419960J4729291J2718678J0432481Q712084
2888.1C66609842P801055P098645N683005L214956j93537m238397p965087j0433853
2904.4C67576629j1677802j2194514j2453049j2721211j3138652j3921410j4904171
2918.7B76565820j5408874j4976963j3387278j0564655o781161k380192J833558M912079
2935B19812334O723195P507577P303581O216452M474803J770586k576828q307978j3831556
$$ plain form
2826.9 714792252 705669403 696191609 686914861 678060055 669337213 660904348 652753711 643560052
2843.3 643560052 632281423 619069278 604054213 586383104 564781487 538580418 507573843
2857.5 507573843 472058684 433083385 392476380 353532732 320666224 297299981 284892023
2871.8 284892023 283390999 291110784 304597348 320017308 334746599 347465277 357897758 366609842
2888.1 366609842 374410897 381509542 387192547 390407503 390213966 385975569 378010482 367576629
2904.4 367576629 355898827 343704313 331251264 318530053 305391401 291469991 276565820
2918.7 276565820 261156946 246179983 232792705 222228050 215446889 213066697 214900255 219812334
2935 219812334 226535529 234043106 241346687 247563139 252037942 253808528 251231700 242923722 229092166
2953.4B29092166j7776177j9447609j8356651j4798150r605393l589108K580449Q486867
2969.7A56586394J3973012J9031450K3470000K6897937K9284388L0818581L1148851
2984C31210613K9988766K7788013K4734497K1185577J7833650J4502853J2085379J1784046
3000.3D91113394J2788624J4426887J6188026J6720950J5856266J4958739J4399946
3014.6E96452832J2858987R489119M727543j147092p442295j2974322j7238558j8977463
3030.9E65748751j6834140j0895610l281354K711176O104351P415413O222308K623260
3047.2E59814155j810193m617274m745543l024935J23023L840983O655097Q383334
3063.5E64618647R628773J1193633J3113975J4255345J4183522J3335287J2690663
$$ plain form
2953.4 229092166 211315989 191868380 173511729 158713579 149108186 145519078 148099527 156586394
2969.7 156586394 170559406 189590856 213060856 239958793 269243181 300061762 331210613
2984 331210613 361199379 388987392 413721889 434907466 452741116 467243969 479329348 491113394
3000.3 491113394 503902018 518328905 534516931 551237881 567094147 582052886 596452832
3014.6 596452832 609311819 618800938 623528481 622381389 614939094 601964772 584726214 565748751
3030.9 565748751 548914611 538019001 534737647 537448823 543553174 550968587 557190895 559814155
3047.2 559814155 558003962 553386688 548641145 545616210 545739233 549580216 556235313 564618647
3063.5 564618647 574247420 585441053 598555028 612810373 626993895 640329182 653019845
3077.8F53019845J2904943J2511193J0535419Q121729N451679K732516R65237k75075
3094.1G05967486j129270m74512K202153N540788O960929N856216M371166L503322
3110.4G32798278J544059j394093k657116j915634m07397R10282J159191Q36253R78351
3128.8G31852174J783371K335250J625419J69992l79264L38972M49180o32107j679123
3147.1G35863864k705693l504395k675534j083016p31289j094938j193046j126945
3163.5G21749008j119733j322150j583934j812637k108514k403260k570212k601325
3179.8G06227243k618253k742112k861261k793134k452075k116203k155126k317190
3196.1F86171889k335548k410293k578139k669334k720952k767206k868175l060997
$$ plain form
3077.8 653019845 665924788 678435981 688971400 697093129 702544808 705277324 706242561 705967486
3094.1 705967486 704838216 704363704 706565857 712106645 719067574 724923790 729294956 732798278
3110.4 732798278 734342337 732948244 730291128 728375494 727968097 728878379 730037570 730873823 731852174
3128.8 731852174 733635545 735970795 737596214 737766206 737386942 737725914 738175094 737542987 735863864
3147.1 735863864 733158171 729653776 726978242 725895226 725163937 724068999 722875953 721749008
3163.5 721749008 720629275 719307125 717723191 715910554 713802040 711398780 708828568 706227243
3179.8 706227243 703608990 700866878 698005617 695212483 692760408 690644205 688489079 686171889
3196.1 686171889 683836341 681426048 678847909 676178575 673457623 670690417 667822242 664761245
3212.4F64761245l065288k981961l042221k950132k822399k929032l126621l462970
3228.7F40380621m208267m542470l346681k220989k630233l263355l579616m058004
3245F12531006l924966l080785k912104l440380l563643l190398l062427l305673l440321
3263.4E82610309l531933l991723m461705l931582k921224k667070k896904l107369
3279.7E55100799l278315l446699l615319l782034m111469m139662l545999l046334
3296E26134968k908766l096879l786325m466832m201174l113329k364934k515584l055453
3314.4D96625692l317207l269554l222108l396272l606856l367871k953976k956748
3330.7D70535100l232658l491134l573298l356695l168643l050208k807975k909273
$$ plain form
3212.4 664761245 661695957 658713996 655671775 652721643 649899244 646970212 643843591 640380621
3228.7 640380621 636172354 631629884 628283203 626062214 623431981 620168626 616589010 612531006
3245 612531006 608606040 605525255 602613151 599172771 595609128 592418730 589356303 586050630 582610309
3263.4 582610309 579078376 575086653 570624948 566693366 563772142 561105072 558208168 555100799
3279.7 555100799 551822484 548375785 544760466 540978432 536866963 532727301 529181302 526134968
3296 526134968 523226202 520129323 516342998 511876166 507674992 504561663 502196729 499681145 496625692
3314.4 496625692 493308485 490038931 486816823 483420551 479813695 476445824 473491848 470535100
3330.7 470535100 467302442 463811308 460238010 456881315 453712672 450662464 447854489 444945216
3347D44945216l331601l254652k764434k642483k842366k898902k842039k951145l208369
3365.4D18209225l130406k539486k078920k180160k405852k398967k277732k190501
3381.7C99007201k166539k151877k272785k435624k226055j837879j772195k078683
3398C82065564k129167j511753j057177j310170j611650j546562j324653j044959q78215
3416.4C69651258r29326r88900r56744q36790p67410p66128p40916q15361q10117l58760
3436.8C61680806J57475K20567K4319n454J53661J63972Q6397P7129Q7946J03563J34200
3459.2C62884581L38644M56840K46882K76387O99013R92030J019895R18120Q05974
3477.6C68638366R32605J273393J334489J243650J391531J578152J658380J699447
$$ plain form
3347 444945216 441613615 438358963 435594529 432952046 430109680 427210778 424368739 421417594 418209225
3365.4 418209225 415078819 412539333 410460413 408280253 405874401 403475434 401197702 399007201
3381.7 399007201 396840662 394688785 392416000 389980376 387754321 385916442 384144247 382065564
3398 382065564 379936397 378424644 377367467 376057297 374445647 372899085 371574432 370529473 369651258
3416.4 369651258 368721932 367733032 366776288 365939498 365172088 364405960 363665044 362849683 362039566 361680806
3436.8 361680806 361838281 362058848 362083167 362077713 362231374 362395346 362481743 362558872 362646818 362750381 362884581
3459.2 362884581 363223225 363680065 363926947 364203334 364902347 365894377 366914272 367832392 368638366
3477.6 368638366 369570971 370844364 372178853 373422503 374814034 376392186 378050566 379750013
3493.9C79750013J749725J727849J769364K175450K671212K739280K750367K906382
3510.2C98239642K840877K813250L022969L241360L311157L397882L720909M189611
3526.5D24777657M485607M395932M062325L926396M268259M653275M461139M058868
3542.8D59089458M501402N544037N743980N387575N549013N578906N234510N055963
3559.1E01684844N032838N217135N950808O934703O866157O561100O907046P167161
3575.4E52321792P245958P147610O751120O558358Q041978J0641873J0388792Q507192
3591.8F17604673Q752227R362995Q690358Q456468Q695960Q152604P828713Q153796
3608.1F85697794P648528O633937O047845N776286N791008N334199M344821L851533
$$ plain form
3493.9 379750013 381499738 383227587 384996951 387172401 389843613 392582893 395333260 398239642
3510.2 398239642 401080519 403893769 406916738 410158098 413469255 416867137 420588046 424777657
3526.5 424777657 429263264 433659196 437721521 441647917 445916176 450569451 455030590 459089458
3542.8 459089458 463590860 469134897 474878877 480266452 485815465 491394371 496628881 501684844
3559.1 501684844 506717682 511934817 517885625 524820328 531686485 538247585 545154631 552321792
3575.4 552321792 559567750 566715360 573466480 580024838 588066816 598708689 609097481 617604673
3591.8 617604673 626356900 635719895 644410253 652866721 661562681 669715285 677543998 685697794
3608.1 685697794 693346322 699980259 706028104 711804390 717595398 722929597 727274418 731125951
3624.4G31125951M153848M788219L936649K563178K477110K682209K549886K256871
3640.7G56533921K029478K009690K182484K132237K094209K439439K349615J497269
3657G73268342R43422J466632J847387J378417Q96334L74913p42673p45833J152038
3675.4G79838979L111243L431082K647877J706779J111507P54953R76324J370847J120866
3693.7G96070457R86993J185655J165450R04560O78122P34508Q51631O30618L1888
3712.1H03239882q9169K63513K90393R4414k12192m30286l62456j18137o5088n78999
3732.5H02031875j083672p28727J57237Q85666J040578L06189R0718P24852K47955
3750.9H03672671p10904m17173J05738P4923j06155n0486P630K7120P6652J7046j3172
$$ plain form
3624.4 731125951 735279799 740068018 744004667 746567845 749044955 751727164 754277050 756533921
3640.7 756533921 758563399 760573089 762755573 764887810 766982019 769421458 771771073 773268342
3657 773268342 774211764 775678396 777525783 778904200 779800534 780175447 779432774 778686941 779838979
3675.4 779838979 782950222 786381304 789029181 790735960 791847467 792602420 793578744 794949591 796070457
3693.7 796070457 797057450 798243105 799408555 800313115 800991237 801725745 802577376 803207994 803239882
3712.1 803239882 803150713 803414226 803704619 803799033 803586841 803156555 802794099 802675962 802610874 802031875
3732.5 802031875 800948203 800219476 800376713 801262379 802302957 802609146 802699864 803424716 803672671
3750.9 803672671 802961767 802544594 802650332 802725255 802619100 802568614 802576244 802603364 802680016 802697062 802683890
3773.3H02683890k4319q7321j59621p6234J86741K53678K3484j61648q8990J3828j51753
3795.7H02411735k99156j50919m41193m14014K57373K5630m81904l73721j28269m14908
3816.1G99990654p13170m00185k89679o7830J19507n4538k82585n54264n32925k77996
3836.5G96936989l23832k62678K6643o9141k88904k55108r5009k96593r52304q38339
3856.9G93581724m74810m67718n10037o73771q21829q28206q23498n16772k35319j86444
3877.3G88043320l69251n49972k39133p6712j46925l4809o8426j60754k05338m80533
3897.7G85711467q63373p61092k05457J23203J24335m4584l33846n59866m16041L5704
3918.1G82810450L11255L04341O5744j88410j33932P8321K09749K75492K07424j09255
$$ plain form
3773.3 802683890 802659571 802572250 802412629 802336395 802523136 802776814 802800298 802638650 802549660 802563488 802411735
3795.7 802411735 802112579 801961660 801520467 801106453 801363826 801389456 800907552 800533831 800405562 799990654
3816.1 799990654 799277484 798877299 798587620 798519790 798639297 798584759 798302174 797747910 797214985 796936989
3836.5 796936989 796613157 796350479 796377122 796307981 796019077 795763969 795668960 795372367 794420063 793581724
3856.9 793581724 793106914 792639196 792129159 791455388 790633559 789805353 788981855 788465083 788229764 788043320
3877.3 788043320 787674069 787124097 786884964 786808252 786661327 786626518 786558092 786397338 786192000 785711467
3897.7 785711467 784848094 784087002 783881545 784004748 784129083 784084499 783750653 783190787 782774746 782810450
3918.1 782810450 783121705 783426046 783491790 783303380 783169448 783247769 783457518 783733010 783940434 783831179
3938.5G83831179l32773k66730j62244k40922l60847k14100j69217m80652p34091p43747
3958.9G80125856o86645p15494p45058o45459n86033p86483q33869n30660l55900k29835
3979.3G74010420K1577J86681J78695R4235J23501K13861K41459L26037M42148
3997.6G75838614
$$ plain form
3938.5 783831179 783498406 783231676 783069432 782828510 782467663 782253563 782084346 781603694 780869603 780125856
3958.9 780125856 779439211 778723717 777978659 777333200 776747167 775960684 775126815 774596155 774240255 774010420
3979.3 774010420 774031997 774218678 774397373 774491608 774615109 774828970 775070429 775396466 775838614
3997.6 775838614
##END=$$ End of the data block
