##TITLE=Amostra 5 $$ Begin of the data block
##JCAMP-DX=5.00 $$ ACD/SpecManager v 10.08
##SPECTROMETER/DATA SYSTEM=Alpha
##DATE=19 Sep 2014 13:06:10
##DATA TYPE=INFRARED SPECTRUM
##DATA CLASS=XYDATA
##ORIGIN=
##OWNER=
##NPOINTS=1765
##FIRSTX=399.76428223
##LASTX=3997.64306641
##MAXX=3997.64306641
##MINX=399.76428223
##MAXY=0.87008917
##MINY=0.35196280
##XFACTOR=1.0000000000
##YFACTOR=1.000000000000000e-9
##FIRSTY=0.84116501
##DELTAX=2.03961372
##XUNITS=1/CM
##YUNITS=ARBITRARY UNITS
##XYDATA=(X++(Y..Y))
399.8H41165006J7464p88688j064241j04070Q93652K38061j097083j060664J34408
$$ 841165006 841182470 840393782 839329541 839225471 840119123 840357184 839260101 838199437 838333845
418.1H38333845L98696j044333j683891o00457j98961k119422l468752j456379J395702
$$ 838333845 838732541 837688208 836004317 835403860 835204899 833085477 829616725 828160346 829556048
436.5H29556048J576543M7445m45247M47750P47085l08096j043618l22223N65648j52349
$$ 829556048 831132591 831180036 830734789 831182539 831929624 831621528 830577910 830255687 830821335 830668986
456.9H30668986j519442j069963J96874M1187j388848k145350j343190n61595j333356
$$ 830668986 829149544 828079581 828276455 828317642 826928794 824783444 823440254 822878659 821545303
475.2H21545303k294481j500130m530l84271k905011n679011q733869j5203237k3017109
$$ 821545303 819250822 817750692 817746162 817361891 814456880 808777869 800044000 784840763 761823654
493.6G61823654j8892646K077163K1332621K3206592J3996124O472111L925085K868831
$$ 761823654 742931008 745008171 766340792 789547384 803543508 810015619 813940704 816809535
509.9H16809535R59694q75532q49426N16891P43866o59108j238167K50101J543760
$$ 816809535 817769229 816893697 816044271 816561162 817305028 816645920 815407753 815657854 817201614
528.3H17201614O94454o26862j75297J264989J248717l25560j032770J72079J131952
$$ 817201614 817896068 817269206 817093909 818358898 819607615 819282055 818249285 818421364 819553316
546.6H19553316p5162j719057j248181K46405o199j721799k085566n18680L02434j038432
$$ 819553316 819478154 817759097 816510916 816757321 816751122 815029323 812943757 812425077 812727511 811689079
567H11689079k382338j668573l06070o55531k166331k336800r99034o01172k026677
$$ 811689079 809306741 807638168 807332098 806676567 804510236 802173436 801174402 800573230 798546553
585.4G98546553l118754k380788j361013k137601m217803n506218n976975p901192
$$ 798546553 795427799 793047011 791685998 789548397 785330594 779824376 773847401 765946209
601.7G65946209j2380361j7751932j9443751j0560035P944643K1621287K1180511J3439416
$$ 765946209 753565848 735813916 716370165 705810130 713754773 735376060 756556571 769995987
618G69995987O554008J895666p68721j341403j160323k069950l594280l838956k643287
$$ 769995987 776549995 778445661 777676940 776335537 775175214 773105264 769510984 765672028 763028741
636.4G63028741j738966j945555j928925m60208J598180K613842K691150L289401M876852
$$ 763028741 761289775 759344220 757415295 756955087 758553267 761167109 763858259 767147660 772024512
654.7G72024512N938709N475044M574836M545271M553378M318416M293978L561139
$$ 772024512 777963221 783438265 788013101 792558372 797111750 801430166 805724144 809285283
671H09285283L385067L527165K612233J397431J331806J999616J802922M33206o48796
$$ 809285283 812670350 816197515 818809748 820207179 821538985 823538601 825341523 825774729 825125933
689.4H25125933o73056q97229k567768n135059p228434r043157j1936784j5312314
$$ 825125933 824452877 823555648 820987880 815852821 808624387 799581230 787644446 772332132
705.7G72332132j6071379j1960805m148721L693401Q715749J0735452J0829866Q864939
$$ 772332132 756260753 744299948 740151227 743844628 752560377 763295829 774125695 782990634
722G82990634M808546m40479o714642j1699259p457078P471621J9365967J9290030
$$ 782990634 787799180 787358701 780644059 768944800 761487722 768959343 788325310 807615340
738.3H07615340J3325453P966518M528582L052592K844513K625406J823484J121402
$$ 807615340 820940793 828907311 833435893 836488485 839332998 841958404 843781888 844903290
754.7H44903290J156867J346111R45866K85506J74523O65367R28878M78030q3387j2279
$$ 844903290 846060157 847406268 848352134 848637640 848812163 849477530 850406408 850884438 850801051 850788772
775.1H50788772L13461l9578j100003k097190k850175m550814q815587j6128182k0992696
$$ 850788772 851102233 851062655 849962652 847865462 845015287 840464473 831648886 815520704 794528008
793.4G94528008j1247874J0250926K1717727J6883374Q454203L129185m38750l409207
$$ 794528008 783280134 793531060 815248787 832132161 840586364 843715549 843276799 839867592
809.7H39867592n555570p365763j0612548j6102075j9857347j2585938P919073K5730371
$$ 839867592 834312022 826946259 816333711 800231636 780374289 767788351 775707424 801437795
826H01437795K6507378J7068743R459258N559086K835691Q91388N03719J108646J025319
$$ 801437795 827945173 845013916 854473174 860032260 862867951 863759339 864263058 865371704 866397023
844.4H66397023p8678o42955M4644P24911K33353o78778o16312J85072K21372q48591
$$ 866397023 866318345 865675390 865720034 866444945 866678298 865999520 865383208 865568280 865789652 864941061
864.8H64941061j608611j435995k049863n159497q655727o338775L001332R962916
$$ 864941061 863332450 861896455 859846592 854687095 846031368 839692593 842693925 852656841
881.1H52656841Q500934M056871K033234J690626Q61048l29375m77374L75391P20977
$$ 852656841 861157775 865214646 867247880 868938506 869799554 869470179 868992805 869368196 870089173
899.5H70089173l0160p07328k97248M14848J36435p96378j011967l09468O438o61314
$$ 870089173 870059013 869351685 869054437 869469285 869605720 868809342 867797375 867487907 867494345 866833031
919.9H66833031j248002q46207j27912k56538j034260j242935n82934j76251p10368
$$ 866833031 865585029 864738822 864610910 864354372 863320112 862077177 861494243 861317992 860607624
938.2H60607624j365423j212359p10010r65774k033234k967536l359199l923118n009174
$$ 860607624 859242201 858029842 857319832 856354058 854320824 851353288 847994089 844070971 839061797
956.6H39061797n294383l212631l22342j115679n757869n276799M839122J3325811
$$ 839061797 833767414 830554783 830232441 829116762 823358893 818082094 822921216 836247027
972.9H36247027J1565089N462766J604199K74241l35634j237511k133548k575219k970517
$$ 836247027 847812116 853274882 854879081 855153322 854817688 853580177 851446629 848871410 845900893
991.3H45900893l755510l801763j604378J385391K075970O4433k815426n324960p116973
$$ 845900893 842145383 838343620 836739242 838124633 840200603 840265036 837449610 832124650 825007677
1009.6H25007677o838918k700567L360748O728888O085634L574073J179755k53677
$$ 825007677 818168759 815468192 818828940 825557828 831643462 835217535 836397290 836143613
1025.9H36143613q15332j227737k132117l439844m743576n715132n215585k278388
$$ 836143613 835328281 834100544 831968427 828528583 823785007 818069875 812854290 810575902
1042.2H10575902O09994j20937m082859q636713j1320829j0222733p032752m903138
$$ 810575902 811185896 811064959 806982100 798345387 787024558 776801825 769769073 764865935
1058.6G64865935q39234Q066059J5423357J5475690J0789574N853176K808273J661062
$$ 764865935 764026701 772092760 787516117 802991807 813781381 819634557 822442830 824103892
1074.9H24103892J056135l8684j406133k411246l019154l326416k388299P95066M742146
$$ 824103892 825160027 825121343 823715210 821303964 818284810 814958394 812570095 813365161 818107307
1093.2H18107307O320715M712105K051294M45544N8651j62005p41482j233816j204014
$$ 818107307 824428022 829140127 831191421 831636965 831695616 831533611 830792129 829558313 828354299
1111.6H28354299r21190r71377j378774j502693j132965r13024j355708j974046k073228
$$ 828354299 827433109 826461732 825082958 823580265 822447300 821534276 820178568 818204522 816131294
1129.9H16131294k056718k865493m837454p581234r560644p681549r23932N820394
$$ 816131294 814074576 811209083 806371629 798790395 789229751 781548202 780624270 786444664
1146.3G86444664P334590M446924O52969j268566K28584L247440M325687K988160J128912
$$ 786444664 793779254 798226178 798879147 797610581 797839165 801086605 805412292 808400452 809529364
1164.6H09529364N3704k92480p19547j648844k593934k777457j957417m97401J042366
$$ 809529364 809583068 809290588 808571041 806922197 804328263 801550806 799593389 799095988 800138354
1183H00138354K210439K762436K443254J295150O9439m42862m33445o84917j361132
$$ 800138354 802348793 805111229 807554483 808849633 808919072 808476210 808042765 807357848 805996716
1201.3H05996716j858652j863122j926899k649128l757656m056811k396166M32551
$$ 805996716 804138064 802274942 800348043 797698915 793941259 789884448 787488282 787920833
1217.7G87920833J803577J068830p2956j135468k644539m256964n209684n240441m142523
$$ 787920833 789724410 790793240 790720284 789584816 786940277 782683313 777473629 772233188 768090665
1236G68090665j369238K364696M439950L515481R86994j327634k678454l373683m418194
$$ 768090665 766721427 769086123 773526073 777041554 778028548 776700914 774022460 770648777 766230583
1254.4G66230583o475448q532584p709980k728343J960933J659453j935899n207360
$$ 766230583 759755135 751222551 743512571 740784228 742745161 744404614 742468715 737261355
1270.7G37261355p512868j0077178j4836192k3375571l1965256k4967849O673575L6576628
$$ 737261355 729748487 719671309 704835117 681459546 649494290 624526441 631200016 667776644
1287F67776644L5567224J4986217j267254o799996n445003l705979m899144p502437
$$ 667776644 703343868 718330085 717062831 710262835 704817832 701111853 696212709 688710272
1303.3F88710272j0337174j3150572j4788330j5787780j8235326k0894826j9137144
$$ 688710272 678373098 665222526 650434196 634646416 616411090 595516264 576379120
1317.6E76379120r179055P536590K3485780L1353414K9543936K1919548J3262749O248415
$$ 576379120 567200065 574736655 598222435 629575849 659119785 681039333 694302082 700550497
1333.9G00550497J546502o89507m58538M72128m38809l336013o687283r487689j2151122
$$ 700550497 702096999 701407492 700948954 701421082 700982273 697646260 690958977 681471288 669320166
1352.3F69320166j5967309k0556212k1076023j1058152Q723020K2806585J8987179
$$ 669320166 653352857 632796645 611720622 600662470 609385490 632192075 651179254
1366.6F51179254M392028j1302471k2920549k4862290r516656J4393151K6909113J8938243
$$ 651179254 655571282 644268811 621348262 596485972 586969316 601362467 628271580 647209823
1382.9F47209823p79688k1771252l5630465l4462988k1744550k352416J6776383K9456615
$$ 647209823 646430135 624658883 589028418 554565430 532820880 530468464 547244847 576701462
1399.2E76701462L2236576K7102054K0321369J2367427N242825j36018m397512p614374
$$ 576701462 608938038 636040092 656361461 668728888 673971713 673835695 669438183 661823809
1415.5F61823809j1234999j5977919j7613768j8340230k0190239k1349728k4160028
$$ 661823809 650588810 634610891 616997123 598656893 578466654 557116926 532956898
1429.8E32956898k6567340k4427533j7455339q936793q443355o975323L907263K176583
$$ 532956898 506389558 481962025 464506686 455569893 447126538 440151215 444058478 446235061
1446.1D46235061k1841973l6202014k6639938r588331Q639544K4762631K7622193K8080999
$$ 446235061 424393088 388191074 361551136 351962805 360602349 385364980 412987173 441068172
1462.4D41068172L1710715K8986483J6929984J190007j4747441j0364145J2714535
$$ 441068172 472778887 501765370 518695354 519885361 505137920 494773775 507488310
1476.7E07488310K4724543K4255515K2611320K1244227J8909395J6070366J2831807
$$ 507488310 532212853 556468368 579079688 600323915 619233310 635303676 648135483
1491F48135483R824634R227574J0218858R562552P603884O105483N497992M493475
$$ 648135483 657960117 667187691 677406549 686969101 694572985 700678468 706176460 710669935
1507.3G10669935J700461k69592j415074k835810m478753o329119r353638j1630833
$$ 710669935 712370396 712100804 710685730 707849920 703371167 697042048 687688410 676057577
1523.6F76057577j3150394j6032696j7399489j9218565k2625446k0404994j7900229
$$ 676057577 662907183 646874487 629474998 610256433 587630987 567225993 549325764
1537.9E49325764k4334192k9380083k8430045k8582841k7144104k4299741j8412471
$$ 549325764 524991572 495611489 467181444 438598603 411454499 387154758 368742287
1552.2C68742287j0658234l130794O136090J5236974J5423446J6742468J9262672K1007836
$$ 368742287 358084053 354953259 361089349 376326323 391749769 408492237 427754909 448762745
1568.5D48762745K2129178J8821299J6844481J8095553J5303671J2337148J2424291
$$ 448762745 470891923 489713222 506557703 524653256 539956927 552294075 564718366
1582.8E64718366J2718498J2784362J2599707J2105584J1187077J0140121Q948147
$$ 564718366 577436864 590221226 602820933 614926517 626113594 636253715 645201862
1597F45201862P734299O609618N430818M211366L005564J698137J41143j291215l235996
$$ 645201862 652936161 659545779 664976597 669187963 672193527 673891664 674032807 672741592 669505596
1615.4F69505596n892813o895065q087635j1749447j5029609j8025398k0608306j8959940
$$ 669505596 663612783 656717718 648630083 636880636 621851027 603825629 583217323 564257383
1631.7E64257383j5351295j0070503r9718P694840R761631P744194N892872Q064330
$$ 564257383 548906088 538835585 538735867 546430707 556192338 563936532 569829404 577893734
1648E77893734J2632310K3607493L5604894K5296330J7179132J5852511J4804959J2447000
$$ 577893734 590526044 614133537 649738431 675034761 692213893 708066404 722871363 735318363
1664.3G35318363R357333Q275926P887065O431938N750477N546808M777909M552304
$$ 735318363 744675696 752951622 760838687 767270625 773021102 778567910 783345819 787898123
1680.7G87898123M713893M656553L468037K746463K647042K196253J584172J149118
$$ 787898123 792612016 797268569 800736606 803483069 806130111 808326364 809910536 811059654
1697H11059654K082884L464818K984822K066910J827479J741528J797438J819312J768768
$$ 811059654 813142538 816607356 819592178 821659088 823486567 825228095 827025533 828844845 830613613
1715.3H30613613J619816J211643R99212J045168J286685J507759J626790J521587
$$ 830613613 832233429 833445072 834444284 835489452 836776137 838283896 839910686 841432273
1731.7H41432273J305044J100361J129330J172721R59516Q86619R71496Q93175N09322
$$ 841432273 842737317 843837678 844967008 846139729 847099245 847985864 848957360 849850535 850359857
1750H50359857L35217O53505J027107J065254R04620Q30412Q49307Q95202Q19504P26104
$$ 850359857 850695074 851348579 852375686 853440940 854345560 855175972 856025279 856920481 857739985 858466089
1770.4H58466089O09755M69685L66092L08573L21388M19915M11689K49922K49923L59594
$$ 858466089 859075844 859545529 859911621 860220194 860541582 860961497 861373186 861623108 861873031 862232625
1790.8H62232625L48449K22147J85311K72750M22121M24146K65479J71185K76625M24266
$$ 862232625 862581074 862803221 862988532 863261282 863683403 864107549 864373028 864544213 864820838 865245104
1811.2H65245104L31104J17540N0306K26975L68237K20239k8312J0550J53482K3067
$$ 865245104 865576208 865693748 865744054 865971029 866339266 866559505 866531193 866541743 866695225 866718292
1831.6H66718292j77741j78516M5657K60652J80721k09928l82304j48415o9440k36273
$$ 866718292 866540551 866362035 866407692 866668344 866849065 866639137 866256833 866108418 866038978 865802705
1852H65802705l04460o6459J60038M3929j69695m4524K85089K64167j21772k16544
$$ 865802705 865498245 865431786 865591824 865635753 865466058 865421534 865706623 865970790 865849018 865632474
1872.4H65632474P5698K96414J69933j05023j35899O4015J41144o1750k16365J4067
$$ 865632474 865708172 866004586 866174519 866069496 865933597 865997612 866138756 866077006 865860641 865874708
1892.8H65874708L01242K39312j848k2768J59144K02596j5855k27570j65940K8909
$$ 865874708 866175950 866415262 866413414 866390646 866549790 866752386 866736531 866508961 866343021 866371930
1913.2H66371930K6703k14458l27289j43707l5286j89364l20494j85728O4015P7129
$$ 866371930 866398633 866184175 865856886 865713179 865677893 865488529 865168035 864982307 865046322 865123451
1933.6H65123451j75298k85208j16944m3273k79844n21004m54307k17914j84238l83437
$$ 865123451 864948153 864662945 864546001 864502728 864222884 863701880 863247573 863029659 862845421 862461984
1954H62461984m92573l68058k16365l24547n32926m83393k42055j63555l10600l93510
$$ 862461984 861969411 861601353 861384988 861060441 860527515 860044122 859802067 859638512 859327912 858934402
1974.4H58934402k77876j80245l17991n24401n16296l40879k95460n01394p15733o61969
$$ 858934402 858656526 858476281 858158290 857633889 857117593 856776714 856481254 855979860 855264127 854602158
1994.8H54602158n29051o17802q04782q36789o88553o14107p52151q69751p50005n50449
$$ 854602158 854073107 853455305 852650523 851813734 851125181 850511074 849758923 848889172 848139167 847588718
2015.2H47588718n36025o51776o49512m82500m30167o00814p37191o50584m62592l82721
$$ 847588718 847052693 846400917 845751405 845268905 844838738 844237924 843500733 842850149 842387557 842004836
2035.6H42004836m05789l77655k87056l11136n03779o89625p21932p02619p72655q80480
$$ 842004836 841599047 841221392 840934336 840623200 840119421 839429796 838707864 838005245 837232590 836352110
2056H36352110q90911p94410p39336q28445r55284r48489q78632q61943q72254q56817
$$ 836352110 835461199 834666789 833927453 833099008 832143724 831195235 830316603 829454660 828582406 827725589
2076.4H27725589q11159q10325r08435j043260j123548j114130j058459j059949j104772
$$ 827725589 826914430 826104105 825195670 824152410 823028862 821914732 820856273 819796324 818691552
2094.7H18691552j097143j038611r87947r55224r32336r01103q53240q67069r51707
$$ 818691552 817594409 816555798 815567851 814612627 813680291 812779188 811925948 811058879 810107172
2113.1H10107172j015723j010120r92298j057923j190007j268744j254499j195491
$$ 810107172 809091449 808081329 807089031 806031108 804841101 803572357 802317858 801122367
2129.4H01122367j123726j064956r70006p70986n11050k85209r3937J49429M57943
$$ 801122367 799998641 798933685 797963679 797192693 796681643 796396434 796302497 796451926 796909869
2147.7G96909869P06732Q16047Q42929Q90434R82165J014650R90450J066447J268148
$$ 796909869 797616601 798432648 799275577 800166011 801148176 802162826 803153276 804219723 805487871
2166.1H05487871J457930J547038J590550J687110J796126J763940J556873J360178
$$ 805487871 806945801 808492839 810083389 811770499 813566625 815330565 816887438 818247616
2182.4H18247616J333654J361430J237035J027524R62317J016319R60708P42435N45502
$$ 818247616 819581270 820942700 822179735 823207259 824169576 825185895 826146603 826889038 827434540
2200.8H27434540N28633N46992L70383J01328J5796J28507J51038l9756j91927j26064
$$ 827434540 827963173 828510165 828880548 828981876 828997672 829126179 829277217 829237461 829045534 828919470
2221.2H28919470j7225j01150l50356m74691l23832j66595k51472l94285l02493p9215
$$ 828919470 828902245 828801095 828450739 827976048 827652216 827485621 827234149 826839864 826537371 826458156
2241.6H26458156o5684k84195m04298k77520j65343l37481o38664o64056m31418l70920
$$ 826458156 826392472 826108277 825703979 825426459 825261116 824923635 824284971 823620915 823189497 822818577
2262H22818577n89966p45655o12914m24624m99904p04407o41287l06308r8705k01762
$$ 822818577 822228611 821482956 820870042 820445418 819945514 819241107 818599820 818293512 818194807 817993045
2282.3H17993045l32713k60294j81138l80457p37309q40545o37829n32687p13467q80361
$$ 817993045 817660332 817400038 817218900 816838443 816101134 815260589 814622760 814090073 813376606 812496245
2302.7H12496245q09968o74128p19905r10640r52184p59304o73711r10997j146615
$$ 812496245 811686277 811012149 810292244 809381604 808429420 807670116 806996405 806085408 804938793
2321.1H04938793j034915p33376p08699j019239j113415p96616n83172p80642j109004
$$ 804938793 803903878 803170502 802461803 801442564 800329149 799532533 798949361 798168719 797059715
2339.5G97059715j105964p62344m34398m14789q29697j408517j727879j724184j593828
$$ 797059715 795953751 795191407 794757009 794342220 793512523 792104006 790376127 788651943 787058115
2357.8G87058115j254499p53522m68671n28932n22554k22742L159j64390m86433n72682
$$ 787058115 785803616 785050094 784581423 784052491 783529937 783307195 783310354 783145964 782659531 782086849
2378.2G82086849m94897n88596q66115j080334j067460r09686q59141r40740r20475
$$ 782086849 781591952 781003356 780137241 779056907 777989447 777079761 776220620 775279880 774359405
2396.6G74359405p56025o68705p97391r76562r79126r12130r98497j190662j253128
$$ 774359405 773603380 772934675 772137284 771160722 770181596 769269466 768270969 767080307 765827179
2414.9G65827179j137197j065135j173496j316071j296639j172960j165092j311898
$$ 765827179 764689982 763624847 762451351 761135280 759838641 758665681 757500589 756188691
2431.2G56188691j439154j447857j436949j505017j570225j492738j295507j188100
$$ 756188691 754749537 753301680 751864731 750359714 748789489 747296751 746001244 744813144
2447.6G44813144j288056j421333j443803j455128j588762j789450j865387j779855
$$ 744813144 743525088 742103755 740659952 739204824 737616062 735826612 733961225 732181370
2463.9G32181370j691878j680433j635850j447201j171231r46402q03650o83486n61714
$$ 732181370 730489492 728809059 727173209 725726008 724554777 723608375 722804725 722121239 721559525
2482.2G21559525m88997n18739n84007n94019n77271o17743p51316r13382j014292
$$ 721559525 721070528 720551789 719967782 719373763 718796492 718178749 717427433 716514051 715499759
2500.6G15499759j096309j203894j305938j383066j405835j410187j448094j455188
$$ 715499759 714403450 713199556 711893618 710510552 709104717 707694530 706246436 704791248
2516.9G04791248j356721j158178r16898o89030n45978n61417o74963p80761q43048
$$ 704791248 703434527 702276349 701359451 700670421 700124443 699563026 698888063 698107302 697264254
2535.3F97264254q32379p63833o75977n69880m74155m61638n47528o57081p81179r86099
$$ 697264254 696431875 695668042 694992065 694422185 693948030 693486392 692938864 692281783 691500604 690514505
2555.6F90514505j216829j358092j397192j361132j267254j126349r00448o13629l95239
$$ 690514505 689297676 687939584 686542392 685181260 683914006 682787657 681887209 681273580 680878341
2574F80878341k59101p4804J87039L87729M74631N69344P05838P79450P07924N43178
$$ 680878341 680619240 680544436 680731475 681119204 681593835 682163179 682869017 683648467 684356391 684899569
2594.4F84899569M46617N02885O15775O64234O81222P31408P42257O00159L68595K44975
$$ 684899569 685346186 685849071 686464846 687129080 687810302 688541710 689283967 689884126 690252721 690497696
2614.8F90497696K87593L38733K02179r6381l47972m80830o03795p17819o86526m78030
$$ 690497696 690785289 691124022 691326201 691229820 690881848 690401018 689797223 689079404 688392878 687914848
2635.2F87914848k90572l38197n04196n45084n06759o12557q81910j040220r03786
$$ 687914848 687624276 687286079 686781883 686236799 685730040 685117483 684235573 683195353 682291567
2653.5F82291567o32345m60208l74973k29001o0081o8784k44558k89619k5987L40461
$$ 682291567 681659222 681199014 680824041 680595040 680534959 680466175 680221617 679931998 679906011 680246472
2673.9F80246472N08964M97401N43416P25805Q80898Q76545Q65877J046836J262308
$$ 680246472 680755436 681252837 681796253 682522058 683402956 684279501 685145378 686192214 687454522
2692.3F87454522J222014R45211O81281N16533K52724k10702o62565r15111j056969
$$ 687454522 688676536 689621747 690303028 690819561 691072285 690861583 690199018 689283907 688226938
2710.7F88226938j299500j690984k033293k176702k270520k475440k620638k464294
$$ 688226938 686927438 685236454 683203161 681026459 678755939 676280499 673659861 671195567
2727F71195567k061189j661896j392842j126110p96855o15358p74562j176834j462758
$$ 671195567 669134378 667472482 666079640 664953530 664156675 663541317 662766755 661589921 660127163
2745.3F60127163j447797j394510j497090j549661j401246j235246j258076j413405
$$ 660127163 658679366 657284856 655787766 654238105 652836859 651601613 650343537 648930132
2761.6F48930132j456678j273691j061797j025737j030743q32021m77731k19286j31368
$$ 648930132 647473454 646199763 645137966 644112229 643081486 642249465 641771734 641552448 641421080
2780F41421080j4961K50161M96685N39005M11093K85447J95145l7372m87923q75593
$$ 641421080 641406119 641656280 642152965 642691970 643103063 643388510 643583655 643546283 643058360 642182767
2800.4F42182767r28878q01802p37369o92547n24520k67387j20818k37465m99368p14421
$$ 642182767 641253889 640452087 639714718 639022171 638497651 638230264 638109446 637871981 637372613 636658192
2820.8F36658192j009226j626432k519846l444791m354477n512535p097245q955598
$$ 636658192 635648966 634022534 631502688 628057897 623703420 618190885 611093640 602138042
2837.1F02138042j1015117j3227462j4878750j4772654j2613594j0057092r024799
$$ 602138042 591122925 577895463 563016713 548244059 535630465 525573373 516548574
2851.4E16548574q696675n777777J719177J1243701J7306447J7184019J3161958Q755743
$$ 516548574 507851899 502074122 503793299 515037000 532343447 549527466 562689424 571445167
2867.7E71445167N649567M158556L829122L640711K910435J757622O57201m3631m25160
$$ 571445167 577094734 581253290 585082412 588723123 591633558 593391180 594048381 594004750 593579590
2886.1E93579590r38296j808047k670586l079474l118635l334343m044235m858017
$$ 593579590 592641294 590833247 588162661 585083187 581964552 578630209 574585974 569727957
2902.4E69727957n246937n354762n763233o647408p366955o474495l081739Q30889
$$ 569727957 564481020 559126258 553363025 546715617 539348662 532874167 529792428 530623317
2918.7E30623317K047837L69846k044141m062831n763650p247925q579135r608001
$$ 530623317 532671154 533041000 530996859 526934028 521170378 513922453 505343318 495735317
2935D95735317r255677o747633l573060j317978J469761O863445J3356566J7091126
$$ 495735317 486479640 479732007 476158947 474840969 476310730 483174175 496530741 513621867
2951.3E13621867J6364336J2775480Q844734O190180N350054N859375O557345O601691
$$ 513621867 529986203 542761683 551606417 557796597 563146651 569006026 575563371 582165062
2967.6E82165062N965889M993796L826261K446890J259744J032472K091586L604472
$$ 582165062 588130951 593124747 596951008 599397898 600657642 601690114 603781700 607386172
2984F07386172M152477L342926K022743R31263K51115O2883J99794M11272O64831Q71062
$$ 607386172 611538649 614881575 616904318 617835581 618086696 618149579 618349373 618760645 619425476 620296538
3004.4F20296538R84907J120329J264810J261473J118422J045763J142025J285374
$$ 620296538 621281445 622401774 623666584 624928057 626046479 627092242 628234267 629519641
3020.7F29519641J412094J493275J498342J543402J633347J672387J619339J542329
$$ 629519641 630931735 632425010 633923352 635466754 637100101 638772488 640391827 641934156
3037F41934156J558006J546264J385748J188696J135230J288235J456916J529634J615942
$$ 641934156 643492162 645038426 646424174 647612870 648748100 650036335 651493251 653022885 654638827
3055.3F54638827J681566J668215J649856J671792J715660J698076J593769J522958
$$ 654638827 656320393 657988608 659638464 661310256 663025916 664723992 666317761 667840719
3071.7F67840719J533628J559198J532137J458883J427532J440107J431406J406252
$$ 667840719 669374347 670933545 672465682 673924565 675352097 676792204 678223610 679629862
3088F79629862J396478J426279J482010J505554J497149J523137J597405J668453J682818
$$ 679629862 681026340 682452619 683934629 685440183 686937332 688460469 690057874 691726327 693409145
3106.3F93409145J694083J749635J777053J787841J831651J879096J931846J987040
$$ 693409145 695103228 696852863 698629916 700417757 702249408 704128504 706060350 708047390
3122.6G08047390J970708J881957J797438J749516J735329J692176J585484J499951
$$ 708047390 710018098 711900055 713697493 715447009 717182338 718874514 720459998 721959949
3139G21959949J479566J455307J380324J280963J196921J164139J151919J096487J019537
$$ 721959949 723439515 724894822 726275146 727556109 728753030 729917169 731069088 732165575 733185112
3157.3G33185112R65059R29594Q99673Q49843P72416P33912P26462O55413N45084N15223
$$ 733185112 734150171 735079765 735979438 736829281 737601697 738335609 739062071 739717484 740262568 740777791
3177.7G40777791N63442N67258N32627N48720O03318O22273N69582M93884M66585M75287
$$ 740777791 741341233 741908491 742441118 742989838 743593156 744215429 744785011 745278895 745745480 746220767
3198.1G46220767M50135L74555L07501L11315L29256K72572J83761J60217J94371J83582
$$ 746220767 746670902 747045457 747352958 747664273 747993529 748266101 748449862 748610079 748804450 748988032
3218.5G48988032Q9586n603k0683J4306K9802L4630K504j18673k16425k42591k70426
$$ 748988032 749077618 749072015 749051332 749065638 749095440 749130070 749132574 749013901 748797476 748554885 748284459
3240.9G48284459k64704k63453l92496o14107p33256o69241o42479q22425j026392
$$ 748284459 748019755 747756302 747363806 746749699 746016443 745347202 744704723 743882298 742855906
3259.3G42855906j097261j127661j235306j405060j487255j479864j536012j634598
$$ 742855906 741758645 740630984 739395678 737990618 736503363 735023499 733487487 731852889
3275.6G31852889j727641j814305j882017k008915k202749k345145k419949k572417
$$ 731852889 730125248 728310943 726428926 724420011 722217262 719872117 717452168 714879751
3291.9G14879751k894819l253758l517508l758490m087925m532397n168199o032765
$$ 714879751 711984932 708731174 705213666 701455176 697367251 692834854 687666655 681633890
3308.2F81633890p027030q169175r560525j1247218j3311386j5832841j8783212k1986902
$$ 681633890 674606860 666437685 656877160 645629942 632318556 616485715 597702503 575715601
3324.6E75715601k5101840k7381122k7768374k5422185j9816190j1229903j326024
$$ 575715601 550613761 523232639 495464265 470042080 450225890 438995987 437669963
3338.8D37669963P875442J5018761J9349724K1029890K0751595J8978239J6499698
$$ 437669963 445545405 460564166 479913890 500943780 521695375 540673614 557173312
3353.1E57173312J4278888J2455047J0695517Q971810P539213O503045N513370M275859
$$ 557173312 571452200 583907247 594602764 603574574 611113787 617616832 623130202 627406061
3369.4F27406061L070712K402127K199769J952409J605630J322449J138031J037359
$$ 627406061 630476773 632878900 635078669 637031078 638636708 639959157 641097188 642134547
3385.7F42134547J005471J048207Q69632M31359K69294N17487O54638K81930j17064
$$ 642134547 643140018 644188225 645057857 645489216 645758510 646275997 646930635 647212565 647095501
3404.1F47095501P987K51472K88547K86161K54393K18570L02851M08292M53830N41329
$$ 647095501 647103488 647354960 647643507 647929668 648184061 648402631 648705482 649113774 649567604 650108933
3424.5F50108933O86050P89046P47860P57754Q94486Q00550N38946N35369P59780R68456
$$ 650108933 650794983 651584029 652331889 653089643 653984129 654784679 655323625 655858994 656618774 657587230
3444.9F57587230J104415J165986J219570J271904J306295J394093J483739J441836
$$ 657587230 658691645 659857631 661077201 662349105 663655400 665049493 666533232 667975068
3461.2F67975068J449883J711667J871049J538158J094520J113593J440823J725495
$$ 667975068 669424951 671136618 673007667 674545825 675640345 676753938 678194761 679920256
3477.5F79920256J724184J438737J365661J560033J567483J455903J548349J713872
$$ 679920256 681644440 683083177 684448838 686008871 687576354 689032257 690580606 692294478
3493.8F92294478J739920J643598J617551J665234J516819J343370J438856J664757
$$ 692294478 694034398 695677996 697295547 698960781 700477600 701820970 703259826 704924583
3510.2G04924583J887441J908362J701772J618266J779139J975835J896441J683295
$$ 704924583 706812024 708720386 710422158 712040424 713819563 715795398 717691839 719375134
3526.5G19375134J694917J791120J859545K007366K023458J864314J950443K171099
$$ 719375134 721070051 722861171 724720716 726728082 728751540 730615854 732566297 734737396
3542.8G34737396K082825J745582J638829J820743J915276J929105K005398K089322
$$ 734737396 736820221 738565803 740204632 742025375 743940651 745869756 747875154 749964476
3559.1G49964476K141475K104104K085268K229154K264381K126455K117634K270162
$$ 749964476 752105951 754210055 756295323 758524477 760788858 762915313 765032947 767303109
3575.4G67303109K389848K479136K636552K745927K651810K423048K328694K373398
$$ 767303109 769692957 772172093 774808645 777554572 780206382 782629430 784958124 787331522
3591.7G87331522K469599K593219K629399K552569K496362K461076K358913K327681
$$ 787331522 789801121 792394340 795023739 797576308 800072670 802533746 804892659 807220340
3608.1H07220340K346635K318978K272248K083481J965344K017855J873791J689375
$$ 807220340 809566975 811885953 814158201 816241682 818207026 820224881 822098672 823788047
3624.4H23788047J623869J655042J676798J460075J277924J242459J251518J257837
$$ 823788047 825411916 827066958 828743756 830203831 831481755 832724214 833975732 835233569
3640.7H35233569J269043J265704J203716J120389R08494O07967N34594P13408P65085
$$ 835233569 836502612 837768316 838972032 840092421 841000915 841608882 842143476 842856884 843621969
3659H43621969N08070K90752L66151N12183N18083M58062L20911J29819N7042J21415
$$ 843621969 844130039 844420791 844786942 845299125 845817208 846275270 846596181 846726000 846783042 846904457
3679.4H46904457K71856N00083P30336Q42095N06818M1961J30177M04060M63605L71396
$$ 846904457 847176313 847676396 848406732 849248827 849755645 849797606 849927783 850331843 850795448 851166844
3699.8H51166844K60413K30253L03805L73125K99692Q8513k7240j192L0280M6968O8784
$$ 851166844 851427257 851657510 851961315 852334440 852634132 852722645 852695405 852694213 852724493 852771461 852840245
3722.3H52840245L8028q941O4969K18928L16918K57373J75058J89007J15215o3955
$$ 852840245 852878273 852869332 852934301 853153229 853470147 853727520 853902578 854091585 854206800 854142845
3742.7H54142845p5221J23858J65999R8884K4498j4604J9014N6982M3095j2279M053
$$ 854142845 854067624 854191482 854357481 854456365 854480863 854466259 854485273 854542255 854585350 854573071 854577124
3765.1H54577124R9182P6711n1558q1062K8372J78933J51992p5936k08855j73152n6505
$$ 854577124 854676306 854753017 854701459 854620397 854648769 854827702 854979694 854903758 854694903 854521751 854465246
3787.5H54465246N9903R6321O1989Q7976J71960P0750p3671k7537n2333j17839l1888
$$ 854465246 854525149 854621470 854683459 854771435 854943395 855014145 854940474 854912937 854860604 854742765 854710877
3810H54710877N4777L4391K4915M3631j13189k54751j09970Q5771J24037K7299J4484
$$ 854710877 854765654 854800045 854824960 854868591 854755402 854500651 854390681 854476452 854600489 854627788 854642272
3832.4H54642272J12057K5153k13444k49803j03653J5855M5419O6638J9073k07722
$$ 854642272 854754329 854779482 854566038 854316235 854212582 854228437 854273856 854340494 854359567 854151845
3852.8H54151845k52485p5281m6790l9160k6345k6465k6762n6446j1027O2943O6638
$$ 854151845 853899360 853824079 853777289 853738129 853711784 853685319 853658557 853602111 853591084 853654027 853720665
3875.2H53720665R894l0338O8843J46091K7537j38282j32800o0618q1121n9724K4616
$$ 853720665 853730559 853700221 853769064 853915155 853942692 853804410 853671610 853610992 853529871 853470147 853494763
3897.7H53494763J3948q2672j48892j54853j49667j17779k7418J5974l4273p9572n6386
$$ 853494763 853508711 853426039 853277147 853122294 852972627 852854848 852827430 852843404 852809131 852729559 852673173
3920.1H52673173k2829k6106m7446o8485r0600r5367o6757m3214p2896j55628j71363
$$ 852673173 852650344 852624238 852576792 852508307 852417707 852322340 852255583 852212369 852139473 851983845 851812482
3942.5H51812482o1154K8669j2338r3877o5565J4782N7637Q2195P8976L0160l9398
$$ 851812482 851751328 851779997 851767659 851673782 851608217 851622999 851680636 851762831 851841807 851871967 851832569
3965H51832569n8711j7166k5988j17778j66893j75477k14040k11537j94370k85328
$$ 851832569 851773858 851756692 851730704 851612926 851446033 851270556 851056516 850844979 850650609 850365281
3985.4H50365281l61323k89500k11597k01940j61529o6757
$$ 850365281 850003958 849714458 849502861 849300921 849139392 849072635
3997.6H49072635
$$ 849072635
##END=$$ End of the data block
