##TITLE=Amostra 5 $$ Begin of the data block
##JCAMP-DX=5.00 $$ ACD/SpecManager v 10.08
##SPECTROMETER/DATA SYSTEM=Alpha
##DATE=23 Aug 2016 09:05:00
##DATA TYPE=INFRARED SPECTRUM
##DATA CLASS=XYDATA
##ORIGIN=
##OWNER=
##NPOINTS=1667
##FIRSTX=599.65820312
##LASTX=3997.72216797
##MAXX=3997.72216797
##MINX=599.65820312
##MAXY=1.05405402
##MINY=0.00093052
##XFACTOR=1.0000000000
##YFACTOR=0.000000010000000
##FIRSTY=0.81689614
##DELTAX=2.03965425
##XUNITS=1/CM
##YUNITS=ARBITRARY UNITS
##XYDATA=(X++(Y..Y))
599.7 81689614 82325578 83003515 84244049 86074704 88044953 89652443 90726942 91415507 91945624
618 91945624 92459613 92974788 93429768 93770021 93965811 93986684 93763518 92956042 91273147 89758211
638.4 89758211 89968812 91581357 93087578 93777281 93797421 93584347 93573886 93899691 94294775 94384283
658.8 94384283 93994707 93305522 92723387 92603457 93156803 93784416 94198245 94516152 94845343 95254081
679.2 95254081 95646375 95911324 96048802 96073645 95981145 95812982 95648891 95510334 95274878 94755805
699.6 94755805 93757647 92128801 89683515 85719085 79630691 73871022 72995657 77268362 82484001
718 82484001 85550654 85722893 83406264 79972786 77762043 78094989 79224777 78898150 77945030
736.3 77945030 78686237 81005639 82657993 82443476 80877012 78807545 76728767 74780297 72977918
754.7 72977918 71501064 70604169 70255595 70052278 69494987 68374753 66978472 65884084 65764415
773 65764415 67364836 71103871 76271087 81148517 84343183 85593981 85345989 84116596 82318181
791.4 82318181 80240196 77965635 75324756 71986526 67786986 63103271 58797973 55669892 53876024
809.7 53876024 52825111 51518333 48877981 44028699 36738983 27882099 19274065 12677364 8787732
828.1 8787732 7202929 7198256 8244127 10025956 12330198 15012206 18019088 21377018 25179097
846.5 25179097 29519969 33997682 37834549 40547526 41721788 41041952 38959026 36697087 35333148
864.8 35333148 34725180 33584771 31110322 28261125 26826632 27804267 30826047 34826282 39844936
883.2 39844936 46829066 54745001 60989553 64563119 66131204 66270882 65025860 62255746 58078271
901.5 58078271 53253073 48880917 45463136 42498052 39376616 36583501 35641122 37960863 43739629
919.9 43739629 51512694 58832401 63865620 66368741 67210245 67344439 67331487 67447686 67846698
938.2 67846698 68565357 69494486 70424694 71137428 71459168 71285671 70637298 69644332 68445355 67138296
958.6 67138296 65811807 64562047 63422489 62360340 61501426 61285895 62165964 64082313 66354126
977 66354126 68180025 69161391 69383317 69160843 68756849 68282998 67749035 67147398 66493636 65773875
997.4 65773875 64850414 63469541 61181283 56997502 50161982 42735729 38722554 38824406 39992189
1015.8 39992189 39611703 37036458 32865530 28065351 23300636 18898559 15114503 12182301 10247450
1034.1 10247450 9389247 9674725 11217935 14138602 18410131 23704955 29413801 34851784 39492485
1052.5 39492485 43101898 45732117 47590804 48871374 49636140 49787989 49156049 47655836 45488429
1070.8 45488429 43265492 41791272 41500321 42068824 42625779 42617449 42614403 43699309 45938385 48253983
1091.2 48253983 49708349 50093597 49516734 48038998 45696050 42814082 40269932 39041269 39289770
1109.6 39289770 40166721 40601754 40103152 39018777 38207665 38176209 38539165 38522229 37841234 36944294
1130 36944294 36526060 36993030 38338077 40276381 42381519 44216564 45539936 46434397 47148159
1148.3 47148159 47777015 48155379 48130393 47958106 48230526 49248317 50652003 51721084 51814073 50529653
1168.7 50529653 47621846 42788458 35648677 26469049 17048174 9913362 6285831 5709180 7495605
1187.1 7495605 11546668 17835212 25576866 33177993 39139870 42842123 44440219 44334000 42835811
1205.4 42835811 40158522 36523426 32214025 27542070 22789295 18219993 14111894 10690726
1221.8 10690726 8035697 6084970 4712704 3781858 3166684 2762035 2472129 2219729 1961021
1240.1 1961021 1696497 1467088 1314783 1263556 1321347 1504159 1884480 2634939 3997498 6128905
1260.5 6128905 8904768 11904173 14622366 16724829 18155038 19019951 19430864 19424252 18948923
1278.9 18948923 17935586 16430707 14657442 12937984 11530839 10524039 9875260 9525076 9487905
1297.2 9487905 9871510 10812455 12348985 14302181 16286398 18004975 19625588 21577795 23901436
1315.6 23901436 26147547 27841008 28813827 29211572 29282635 29207048 29028073 28704861 28157151 27264267
1336 27264267 25941426 24324583 22778253 21597280 20902322 20682231 20756520 20809194 20470840 19334736
1356.4 19334736 17255867 14904219 13628908 14110728 15517934 16736145 17248790 17118984 16557190
1374.7 16557190 15631419 14295250 12655151 11166153 10297588 10089532 10139889 10042258 9732712 9306321
1395.1 9306321 8849140 8375143 7870775 7320723 6712835 6098152 5523030 5032580 4684275 4490924
1415.5 4490924 4426667 4448350 4450945 4376954 4252120 4127279 4082438 4150131 4280232 4450063 4613744
1438 4613744 4661110 4603336 4482487 4302829 4068111 3811703 3588717 3443120 3468554 3693355 3930718
1460.4 3930718 4137912 4392234 4667880 4899598 5182772 5658699 6244822 6769496 7216953 7610124
1480.8 7610124 7985429 8330165 8616059 8783045 8707792 8308572 7499640 6184620 4562706 3031992
1501.2 3031992 1807893 872642 262997 93052 198790 611645 1765507 4041459 7422646
1519.6 7422646 11820789 16049010 19408821 22329640 24705729 26748979 28790715 30466813 31840065
1537.9 31840065 33573109 35365215 36763683 37999681 39137521 40235242 41267005 42190698 42990378
1556.3 42990378 43927664 44995657 45597970 45889828 46005157 45784172 45003432 43523747 40827706
1574.6 40827706 36396903 32110471 29846725 30448443 34101743 38953415 42490140 43563694 42418551
1593 42418551 39617139 35606483 30731979 25321493 20081800 16187656 14681563 16069530 20031528
1611.3 20031528 25495854 32142991 39548957 45334628 49534696 53252572 56186002 58319968
1627.7 58319968 59978467 61173546 62120223 63143724 64083487 64819330 65488374 66144800 66915786
1646 66915786 67764109 68411326 69136024 70175397 70952964 71515298 72079504 72693408 73280197 73738128
1666.4 73738128 74179465 74688882 75133193 75544262 75972021 76303548 76539111 76785213 77168030 77506781
1686.8 77506781 77704591 77841395 77875745 77769113 77523917 77093375 76405954 75537288 74320722 72583556
1707.2 72583556 70394403 67735010 64649272 61254954 57826811 55272400 54029673 53782725 54391742
1725.6 54391742 55732632 57630712 60009629 63362455 67188042 70415962 73610020 76672870
1741.9 76672870 79125530 81044120 82503730 83641654 84517276 85081661 85440892 85745621 86051321
1760.2 86051321 86418962 86809236 87169290 87557489 88002211 88510239 89009130 89408791 89720124 89945632
1780.6 89945632 90023577 89863789 89336801 88268048 86576676 84709972 83440131 82829529 82778305
1799 82778305 83486086 84870225 86442012 87825888 88905257 89715332 90312797 90751284 91094047
1817.3 91094047 91388184 91645920 91892862 92181319 92498654 92837387 93187821 93474257 93680966 93845016
1837.7 93845016 93964303 94028252 94089973 94193059 94297481 94379961 94431067 94442940 94431055 94392455 94316393
1860.2 94316393 94190812 94003838 93757886 93502080 93312871 93172908 93016416 92822558 92592490 92337751
1880.6 92337751 92106676 91945654 91863275 91868198 91997856 92245126 92600721 93078953 93626732 94183916
1901 94183916 94728220 95241141 95702499 96116078 96487975 96808648 97074342 97309870 97542799 97764724
1921.4 97764724 97987950 98219979 98431945 98610848 98757446 98867893 98943657 98991740 99016792 99048746
1941.8 99048746 99129105 99247098 99368435 99493527 99635464 99797106 99966991 100120127 100237334 100322437
1962.2 100322437 100386524 100433767 100471890 100492895 100482070 100446510 100403810 100361240 100316739 100265205 100200570
1984.6 100200570 100124097 100039637 99957067 99903166 99889940 99896181 99915868 99948925 99983937 100020552 100052941 100069582
2009.1 100069582 100055182 99997830 99904883 99796313 99693328 99608606 99547356 99515569 99519271 99544817 99563813
2031.5 99563813 99554592 99507415 99422425 99302858 99150425 98963350 98747420 98524463 98313713 98119849
2051.9 98119849 97942346 97782832 97644031 97525108 97431988 97385389 97406042 97494841 97639090 97834885
2072.3 97834885 98082304 98373497 98688340 99011725 99338168 99648839 99932796 100199604 100456774 100700343
2092.7 100700343 100920773 101114094 101289141 101451790 101592934 101706922 101793444 101851726 101884604 101905227
2113.1 101905227 101933122 101978314 102046323 102141714 102258801 102388346 102521634 102647913 102757800 102852118
2133.5 102852118 102945054 103038836 103123927 103198588 103268290 103344440 103427994 103509939 103589809 103673494 103759015
2155.9 103759015 103838563 103912675 103987789 104064596 104139829 104207742 104265618 104317772 104364228 104406095 104448891
2178.4 104448891 104488659 104517448 104541135 104565752 104585516 104593730 104591191 104587758 104588532 104592526 104603672 104623854 104640532
2204.9 104640532 104646564 104646838 104637218 104609764 104567671 104525554 104491031 104461944 104437876 104419374 104401648 104387069
2229.3 104387069 104383993 104385078 104382753 104375196 104358876 104331434 104290593 104236758 104169476 104087889 104000580 103912854
2253.8 103912854 103815472 103711796 103616583 103536093 103476763 103437972 103408408 103388393 103384233 103391659 103406119 103419709
2278.3 103419709 103415966 103383577 103318012 103223145 103121901 103042138 102998424 103002906 103058183 103143096 103238475 103335226
2302.8 103335226 103423369 103499162 103561723 103604949 103618956 103602874 103571391 103533328 103500950 103515637 103593338
2325.2 103593338 103692830 103780556 103853476 103915441 103976464 104040241 104088676 104112172 104094219 104013300 103940880
2347.6 103940880 103985727 104195714 104525912 104853940 105108678 105298066 105405402 105377996 105257511 105105364
2368 105105364 104936957 104776001 104641998 104538071 104460037 104406559 104375923 104353023 104320002 104265141 104180038
2390.5 104180038 104068661 103944230 103825819 103731465 103652930 103575623 103500915 103425813 103342259 103236556 103098297
2412.9 103098297 102943611 102787352 102624094 102455378 102307117 102206862 102160740 102163506 102206159 102279067
2433.3 102279067 102368248 102456510 102541268 102626133 102709651 102787387 102850223 102900803 102946544 102977085 102987301
2455.7 102987301 102979684 102941430 102855504 102718437 102543414 102350175 102144611 101923406 101685989 101429105
2476.1 101429105 101151216 100849950 100514889 100140953 99747550 99361116 98979455 98581177 98157251 97708333
2496.5 97708333 97219950 96671027 96058923 95402396 94740206 94126236 93605494 93191135 92873675 92641634
2516.9 92641634 92499912 92475235 92584985 92815834 93140465 93534946 93987358 94489032 95023489 95568663
2537.3 95568663 96083581 96512818 96847689 97131431 97395200 97650492 97909445 98184156 98477000 98776209
2557.7 98776209 99063468 99325132 99561465 99772310 99947184 100086272 100202310 100298572 100377977 100439596
2578.1 100439596 100471890 100478351 100465417 100438845 100422812 100439441 100491083 100574327 100690615 100831604 100977254
2600.5 100977254 101122165 101280844 101465416 101673722 101891541 102102447 102303588 102494550 102661097 102800131
2620.9 102800131 102928495 103058660 103196871 103350151 103510487 103655457 103781450 103901160 104021049 104137051
2641.3 104137051 104235268 104314947 104382217 104433239 104473007 104508567 104537106 104555619 104563844 104568338 104571497 104560447
2665.8 104560447 104536080 104504216 104457176 104400861 104348540 104304898 104281902 104287028 104291475 104265726 104215050 104160547
2690.3 104160547 104115355 104071021 104021037 103975105 103931296 103872061 103787994 103677785 103542686 103395462 103246617
2712.7 103246617 103091764 102929926 102755475 102573538 102414370 102291191 102236640 102275133 102344453 102381074
2733.1 102381074 102370095 102317917 102236378 102110839 101917517 101652670 101354361 101092339 100885165 100706840
2753.5 100706840 100571573 100527000 100596106 100766730 100990653 101214230 101426148 101612556 101719153 101745176
2773.9 101745176 101791406 101878786 101908040 101847792 101719642 101500487 101205552 100934458 100717008 100462306
2794.3 100462306 100124609 99800640 99583620 99419349 99235332 99027437 98806334 98612672 98437172 98183179
2814.7 98183179 97807580 97316760 96691811 95915717 95000261 93971771 92881060 91843796 90992796
2833.1 90992796 90367800 89909172 89609051 89433867 89157200 88595021 87757856 86675113 85253179
2851.4 85253179 83344078 80872720 77797371 74109900 69878495 65243936 60551649 56403744
2867.7 56403744 53397048 51893419 51997119 53474605 55735004 58146244 60289824 61937970 63066196
2886.1 63066196 63831908 64427686 64915878 65197212 65152067 64694691 63751864 62367958 60727388 58997762
2906.5 58997762 57247758 55487025 53709149 51887912 49960548 47875899 45686570 43566075
2922.8 43566075 41751465 40454331 39836824 39988908 40805787 42040014 43462008 44865578 46058950
2941.1 46058950 46929967 47426116 47420827 46675891 44986248 42393044 39166844 35669261 32322958
2959.5 32322958 29541603 27640235 26791880 27027476 28276658 30404827 33245510 36623335 40315682
2977.9 40315682 44086811 47766098 51171511 54100692 56439036 58143872 59277302 60020387 60530865
2996.2 60530865 61039889 61847866 63093275 64801639 66908294 69192213 71448445 73646104 75795192
3014.6 75795192 77763724 79337978 80351681 80669826 80255854 79200584 77621394 75777674 74091989
3032.9 74091989 72975981 72586280 72699475 73021579 73370123 73540622 73340720 72737437 71939951 71253175
3053.3 71253175 70873582 70942658 71518981 72498900 73758453 75233978 76920605 78808481 80784309
3071.7 80784309 82708383 84504461 86188185 87836087 89388621 90694398 91729331 92467040 92887598
3090 92887598 93098927 93175268 93175966 93271166 93670326 94429153 95327765 96089202 96673286 97161752 97455221
3112.5 97455221 97443449 97302693 97247475 97346622 97580975 97849190 98091990 98349291 98689771 99096197
3132.9 99096197 99432325 99613971 99740368 99951214 100189710 100326741 100355530 100267255 100085461 100005794
3153.3 100005794 100126135 100302744 100443327 100574732 100705111 100824249 100920618 100979662 101002681 101001489
3173.7 101001489 100983965 100958085 100938129 100925934 100903165 100867474 100839663 100851858 100911152 100985444 101053333
3196.1 101053333 101111674 101159799 101203239 101237023 101251781 101262343 101275444 101279485 101276219 101259911 101235390 101235402
3220.6 101235402 101245177 101220238 101158726 101065958 100890136 100675213 100628507 100740612 100796545 100755525 100667000
3243 100667000 100525665 100409603 100408220 100427723 100365531 100276971 100249612 100258839 100234032 100172818 100080144 99922734
3267.5 99922734 99715316 99592799 99611926 99667561 99688834 99667919 99616915 99548596 99464864 99355584 99192148
3289.9 99192148 99020886 98928720 98907280 98907417 98864353 98701686 98447567 98252839 98225272 98300564 98346657
3312.3 98346657 98312438 98237729 98162413 98081750 97961694 97796178 97669154 97612226 97540319 97418988 97256231
3334.8 97256231 97049940 96870530 96771276 96702838 96620482 96484494 96265852 96064335 95969427 95897859 95759481
3357.2 95759481 95569026 95380038 95192021 94935673 94637668 94440079 94379359 94323838 94180095 93988180
3377.6 93988180 93798465 93625373 93454307 93260622 93014914 92689764 92381561 92209798 92080528 91822124
3398 91822124 91486323 91278052 91195738 91052854 90812427 90564495 90347838 90168744 90001887 89792508
3418.4 89792508 89554226 89339328 89132893 88893569 88642114 88421071 88195086 87943316 87763178 87699449
3438.8 87699449 87651724 87532318 87352800 87171406 87021405 86880279 86724275 86562490 86379713 86168045
3459.2 86168045 85994357 85851401 85633695 85380071 85246110 85244054 85229319 85125828 84965706 84806961
3479.6 84806961 84720302 84674323 84599388 84529352 84491026 84444469 84372371 84309489 84274876 84246796 84224939 84256947
3504.1 84256947 84334677 84412915 84499180 84587389 84677875 84796256 84934282 85062075 85177416 85331404 85556060
3526.5 85556060 85818493 86077678 86306709 86508363 86726356 86974341 87208503 87407422 87616849 87908047
3546.9 87908047 88253695 88569462 88867676 89163828 89426816 89661485 89893740 90119076 90330970 90600812
3567.3 90600812 90964127 91339731 91688615 92028517 92357445 92662293 92946148 93213505 93517715 93953645
3587.7 93953645 94446915 94855493 95228922 95623338 95987952 96318811 96647060 96944004 97197825 97446418
3608.1 97446418 97689724 97907180 98118496 98308051 98457235 98618567 98799866 98933262 98981977 99027276
3628.5 99027276 99156946 99283373 99371856 99461383 99541020 99589056 99616295 99626255 99608767 99609131 99729544 99913681
3653 99913681 100033212 100088394 100146568 100237978 100333238 100374460 100354111 100305879 100227392 100129783 100149775 100362241
3677.4 100362241 100620425 100838387 100986671 101043320 101050138 101124299 101280940 101404202 101484370 101566565 101640403
3699.9 101640403 101707029 101780057 101839125 101879203 101902699 101918364 101953197 101993823 102004635 101984727 101945662
3722.3 101945662 101893580 101868117 101877558 101857972 101765096 101645052 101606429 101661921 101724648 101757669 101782417
3744.7 101782417 101789618 101766896 101745522 101724458 101696885 101678884 101672685 101661122 101618731 101571560 101561379 101580369
3769.2 101580369 101602924 101599443 101562786 101523268 101520896 101557362 101592541 101616919 101626515 101611471 101603580 101607978
3793.7 101607978 101602829 101593018 101577127 101552272 101532376 101528740 101527250 101502657 101458764 101411760 101364708 101298440
3818.2 101298440 101228726 101209044 101218939 101218235 101209688 101186705 101141226 101075625 101017022 100992501 100989914 101001978
3842.6 101001978 101020241 101020527 100987875 100928533 100897288 100914228 100898182 100850618 100799799 100747502 100698686 100635755
3867.1 100635755 100553322 100494015 100470138 100470471 100457573 100389290 100320709 100289929 100287378 100317800 100318539 100281882
3891.6 100281882 100267482 100245225 100165343 100050855 99973959 99977666 100019300 100048041 100068367 100071883 100028872 99974740
3916.1 99974740 99979270 100048339 100126719 100170922 100204742 100241184 100255525 100272846 100328434 100390542 100406468 100380242
3940.5 100380242 100348401 100316393 100265014 100206804 100178659 100157666 100098813 100009322 99918598 99844044 99788707
3963 99788707 99749666 99717396 99669462 99603075 99546748 99516106 99505758 99515325 99557137 99617571 99662441 99700511
3987.4 99700511 99746644 99788940 99826604 99867922 99910831
3997.6 99910831
##END=$$ End of the data block
