##TITLE=Amostra 4 $$ Begin of the data block
##JCAMP-DX=5.00 $$ ACD/SpecManager v 10.08
##SPECTROMETER/DATA SYSTEM=Alpha
##DATE=19 Sep 2014 13:06:10
##DATA TYPE=INFRARED SPECTRUM
##DATA CLASS=XYDATA
##ORIGIN=
##OWNER=
##NPOINTS=1765
##FIRSTX=399.76428223
##LASTX=3997.64306641
##MAXX=3997.64306641
##MINX=399.76428223
##MAXY=0.85687071
##MINY=0.33410293
##XFACTOR=1.0000000000
##YFACTOR=1.000000000000000e-9
##FIRSTY=0.82910055
##DELTAX=2.03961372
##XUNITS=1/CM
##YUNITS=ARBITRARY UNITS
##XYDATA=(X++(Y..Y))
399.8 829100549 830596864 831935346 831743896 830365181 829508245 829821706 829924762 828397930 826116383
418.1 826116383 825838804 826768041 825951219 823549747 821655214 820445538 818385661 815854490 815266550
436.5 815266550 817249358 819504797 819781721 818558156 818198085 819162548 819535613 818180382 816577613
454.8 816577613 816550791 817169130 816130579 813840568 812487185 812421083 811613083 808642805 805018961
473.2 805018961 803097188 802397847 801034689 798636973 796361268 794074059 788591802 776139379
489.5 776139379 754594207 727143049 708105862 712639272 736825526 763850987 783321500 794327736
505.8 794327736 799098551 800527215 801645935 803067029 803210914 801755786 800653994 801213920 802327156
524.2 802327156 802356303 801621854 801823616 803242087 804244578 803848028 803262591 803842485 804890096
542.5 804890096 804757535 803426206 802423537 802375257 802205205 800777972 798620343 797259927 796862423
560.9 796862423 795944035 793767571 791451156 790091217 789139807 787357867 784696579 782365501 780914724
579.3 780914724 779289663 776462853 773085117 770369411 767934024 764424205 759526551 754002213
595.6 754002213 747996867 739974558 728308320 713067114 694745719 675529182 665070415 674364567
611.9 674364567 699385643 724273682 739531994 745948911 747289240 746529341 745198488 743122280
628.2 743122280 739593208 735177398 731325865 728482723 725881696 723201573 721393049 721521020 723426521
646.6 723426521 726047933 729170024 733579934 739569843 746084750 752034903 757666469 763603568
662.9 763603568 768542171 771682620 775930047 781757176 786932588 791081369 793789446 795438409
679.2 795438409 797349095 799860954 801695943 801881671 801019013 800056815 798509717 794751763 788013518
697.5 788013518 778946817 767738998 753327310 735703826 718091309 705647290 701988041 706885815
713.9 706885815 717226088 729719281 742431402 753303945 759675741 759526253 751592875 738029659
730.2 738029659 729684830 738218665 760030866 782219708 798584938 809309185 815545738 819148481
746.5 819148481 822254419 825536609 828076839 829373002 830346644 831896484 833524048 834140718 833836854
764.9 833836854 833883941 834849536 835798323 835736334 835081756 834900618 834992588 833972275 831061304 826574922
785.3 826574922 820245445 809527516 790510833 765771627 752122045 763098538 787847102 808088064
801.6 808088064 818929851 823405266 823790669 820367634 813150585 802744925 788832843 769692063
817.9 769692063 747235894 733666003 743815184 775054753 808031797 829430461 840190887
832.2 840190887 845921040 849663675 851700544 852053940 851916075 852427602 853206456 853190601 852360487
850.5 852360487 851856828 852287352 852744281 852155328 850929141 850228310 850075424 849193692 846573770
868.9 846573770 842102051 835228384 825644493 818220317 820793211 832634270 844908178 852071106
885.2 852071106 854600906 855109870 855675161 856573343 856870711 856249094 855596900 855764925 856260896 855949223
905.6 855949223 854859591 854098976 854085863 853927076 852843106 851425409 850769937 850727439 850159764 848769844
926 848769844 847479343 846976697 846650422 845525205 843791842 842484772 841817737 840814710 838699698
944.3 838699698 835946918 833345890 830470681 826067924 819805622 812929094 807366312 804569125
960.7 804569125 803881407 801350892 794121563 788779795 795460880 811419606 825393438 833052814
977 833052814 836199880 836298704 834340096 831757605 829265833 826084435 821279526 815509021 811281204
995.3 811281204 810934901 813493133 815320790 814369082 810901105 804889858 796037734 787015080 783719122
1013.7 783719122 788877189 798080504 805345297 808968544 810428441 810883284 810043097 807532310 803895116
1032 803895116 799717247 794479251 787496328 780715346 778190374 780112505 780982077 775946796 765002847
1050.4 765002847 751703560 740481555 732721508 726903737 725910962 735725939 754220605 772198379
1066.7 772198379 784092665 790681481 794753671 797559738 798727036 798054874 796139538 793386638
1083 793386638 789471745 784654498 781378806 782952130 789573252 797334790 802458465 804575682 805217445
1101.4 805217445 805200338 804374576 802815139 801211774 800028205 798920870 797363162 795486867 793932319
1119.8 793932319 792827606 791496396 789376438 786769271 784276664 781646013 777759790 771571875
1136.1 771571875 762626231 751937032 743742883 743315935 750451446 759093463 764057815 764387012
1152.4 764387012 762681663 763064921 766887009 771552742 774463594 775277555 774803400 773761332 772201955
1170.7 772201955 769747555 766373873 762773454 760026217 759097099 760375619 763358235 766915023
1187.1 766915023 769850135 771431267 771631062 770963430 769965112 768714666 766960204 764636874 761963367
1205.4 761963367 758986712 755399346 750962734 746353388 743559182 743954003 745960355 746988237
1221.7 746988237 746307969 744151354 740422606 735106051 728735030 722507715 718365371 718334258 722433746
1240.1 722433746 727658868 730768383 730948687 728919029 725344896 720552266 714573741 707086265
1256.4 707086265 698162019 690120578 686641991 687382042 687470198 683564126 676211596 667551517 658519804
1274.8 658519804 646452308 626151264 597629189 577134013 587850928 626046181 660693526
1289 660693526 673483133 670414329 662923694 656956077 651976049 645443320 636676252 625562310
1305.4 625562310 612086952 597617269 582924306 566569567 548278153 532166302 525798917
1319.6 525798917 535225928 559494019 590910733 620278478 642051041 655161858 660832703 660893023
1336 660893023 657932401 655147731 653537691 650745988 644586980 635318995 624405324 612259686
1352.3 612259686 597373247 578718185 560287416 551974714 562392712 585390806 603680491
1366.6 603680491 607185483 595401466 573061764 550134003 542700291 557779372 583762705 600676894
1382.9 600676894 597546995 574553728 540177226 508692026 489801526 488676071 504648685 532287419
1399.2 532287419 562901139 588910401 608555555 620582819 625477910 624786854 619652569 611192107
1415.5 611192107 599281788 583348691 566374779 548895597 529950142 510270655 488405675
1429.8 488405675 464812815 443487287 428749204 421690404 414823055 409114331 412412643 413353533
1446.1 413353533 393632293 362807721 341128498 334102929 342493087 364761025 389405847 414218426
1462.4 414218426 442261070 468173593 483129680 483190805 468051493 456081212 464599341 485035747
1478.7 485035747 507285833 529805422 551204264 569432855 583773971 594390929 602319837
1493 602319837 610227883 620173514 630801558 639974833 647248209 653678119 660175800 664191484
1509.3 664191484 665090203 663889110 660655797 655464888 648181260 637816906 625672758 612372220
1525.6 612372220 596415520 579255402 560562134 539372981 520682514 503933907 481433332
1539.9 481433332 455623627 431464344 407323390 384343714 363756627 348142415 338903219
1554.2 338903219 335617006 339776874 352094501 365084946 379105002 395241678 413070530 432393998
1570.5 432393998 449273825 464615911 481693864 496769518 509117424 521598101 534462750
1584.8 534462750 547356248 560064375 572469771 584229112 595114768 604840636 613318861 620713770
1601.1 620713770 626996994 631877244 635182858 637008727 637264967 635767341 631910801 625666857
1617.4 625666857 618901908 610925794 599377215 584674478 567013562 546990991 528491318 513038576
1633.7 513038576 502374113 501357019 507688940 515734017 521659970 525739431 532193780 543053746
1650.1 543053746 564056516 597715735 623314798 641314745 657995641 673912048 687790155
1664.3 687790155 698347032 707710326 717111707 724942803 731846809 738834560 744866490 749853134
1680.7 749853134 754525959 760159135 765511096 769648671 773230910 775860429 777695298 779354811
1697 779354811 781797111 785788655 789580107 792410791 795255840 798013449 800397396 802362740 804110587
1715.3 804110587 806299686 808911979 811168611 813020408 814881444 816728473 818399251 819652796
1731.7 819652796 820939839 822766304 824421644 825803816 827132106 828320503 829282880 830056071 830762684
1750 830762684 831699610 832830369 834107041 835460186 836640775 837838709 839168251 840366304 841237307
1768.4 841237307 841765523 842413366 843573511 844672263 845354795 845818877 846348107 846988916 847579360
1786.7 847579360 847869098 847837269 848090708 848831236 849457800 849776924 850187540 850894213 851645887 852161467
1807.1 852161467 852411568 852716565 853245854 853745639 853996098 854148567 854372084 854623079 854779840 854709446
1827.5 854709446 854555428 854716957 855041087 855120242 855044961 855040610 855016232 854839206 854672730 854560018
1847.9 854560018 854487479 854497731 854433596 854231477 854074717 854166031 854401052 854441941 854159415 853951871
1868.3 853951871 854268074 854771078 855000257 855062604 855239809 855510831 855629742 855488837 855246127 855129957
1888.7 855129957 855245829 855414927 855513990 855739415 856162906 856546998 856650710 856535137 856452465 856479526
1909.1 856479526 856463432 856255054 855919182 855709493 855732679 855687797 855425298 855192184 855126083 855112374
1929.5 855112374 855009139 854844093 854761600 854766428 854617298 854152858 853614211 853275180 853048801 852710187
1949.9 852710187 852207959 851728320 851415575 851133943 850672603 850038469 849435747 848988712 848657012 848306298
1970.3 848306298 847913325 847632647 847447872 847121060 846541584 845874488 845311105 844842911 844279945 843500137
1990.7 843500137 842694938 842053056 841399312 840509236 839448631 838427961 837522447 836594522 835553169
2009 835553169 834536970 833715320 833024859 832272053 831409514 830580950 829931319 829355836 828619242 827699363
2029.4 827699363 826854646 826268196 825811148 825292468 824719191 824230611 823815882 823250592 822397530 821413457
2049.8 821413457 820490241 819568992 818482339 817266524 816123188 815132380 814146101 812967718 811669588
2068.2 811669588 810497701 809480250 808416605 807213902 806004822 804915726 803842962 802576661
2084.5 802576661 801121235 799699128 798439026 797203302 795811534 794327438 792979658 791828036
2100.8 791828036 790710270 789523721 788383424 787390947 786421418 785293877 783994853 782690287 781484187
2119.2 781484187 780256271 778850198 777322948 775879025 774577796 773283601 771948874 770768940
2135.5 770768940 769947231 769461215 769176185 769074202 769275725 769865155 770732880 771683633 772664249 773757935
2155.9 773757935 774988949 776249707 777484894 778826654 780418813 782218575 784100950 786037326
2172.2 786037326 788078547 790207386 792268395 794119298 795798361 797434211 799033999 800495028
2188.5 800495028 801781118 802967191 804127395 805237472 806198061 806972563 807627141 808185816 808589160
2206.9 808589160 808796227 808862507 808893025 808911741 808865845 808737040 808560431 808368325 808143318 807820857
2227.3 807820857 807382107 806907117 806489289 806133270 805786133 805450976 805171669 804935277 804647923 804265797
2247.7 804265797 803824902 803348422 802835584 802234948 801544785 800838590 800137997 799408376 798628569 797841132
2268.1 797841132 797102571 796410382 795748174 795151711 794682205 794371128 794157088 793889642 793465912 792886019
2288.5 792886019 792164981 791312456 790344596 789301813 788275123 787271142 786178768 784918070 783513486
2306.8 783513486 782043159 780591190 779214919 777833164 776278734 774514675 772698283 771044016
2323.1 771044016 769580722 768070817 766430318 764975786 763852298 762761593 761495948 760127544
2339.5 760127544 758893371 758226991 758592308 759204865 758341372 755447328 751570284 748115957 745567143
2357.8 745567143 743959546 743169904 743045390 743463695 744236588 745217860 746281803 747261107 748081028
2376.2 748081028 748716354 749080300 749067724 748645902 747861028 746838689 745742798 744694591 743721545
2394.5 743721545 742795408 741890311 740989923 740080953 739110231 738029063 736839056 735588133 734335303
2412.9 734335303 733072042 731781602 730489016 729188323 727845371 726457953 725056052 723649323
2429.2 723649323 722204626 720693946 719102621 717448890 715790868 714168191 712606490 711121082
2445.5 711121082 709705055 708316624 706861198 705283344 703628242 701908410 700078785 698178887
2461.8 698178887 696281254 694418669 692651212 691034257 689577997 688318312 687303960 686508000
2478.1 686508000 685839891 685230255 684645534 684058905 683456242 682827890 682169557 681470156 680700779 679820061
2498.5 679820061 678776860 677553654 676215172 674831569 673404515 671938419 670444429 668937564
2514.9 668937564 667474627 666103423 664870918 663875937 663164198 662623167 662064672 661367893 660562277
2533.2 660562277 659742832 658938408 658154309 657429278 656805992 656283379 655797362 655255198 654576063 653722405
2553.6 653722405 652672172 651411891 649986386 648496568 647048116 645724833 644602358 643718064
2569.9 643718064 643058062 642633438 642455041 642468393 642630756 642958999 643481970 644181430 644973993 645793736
2590.3 645793736 646594822 647304654 647885680 648398876 648965299 649655938 650464714 651295364 652029097 652625442
2610.7 652625442 653057933 653347254 653595984 653855681 654037714 653977036 653594315 652973115 652255952 651550293
2631.1 651550293 650941789 650450110 650032699 649653494 649273217 648822427 648255587 647580981 646800041 645936966
2651.5 645936966 645085335 644360781 643876672 643658519 643577993 643473983 643290043 643085480 642953694 642973840
2671.9 642973840 643180788 643567681 644132614 644826412 645555317 646311581 647201896 648277342 649447858
2690.3 649447858 650617599 651749790 652794778 653654873 654201269 654350936 654120207 653566897 652723193
2708.6 652723193 651587605 650141835 648391664 646365166 644082487 641596794 639017463 636473298
2724.9 636473298 634081006 631920457 630081892 628658295 627625644 626833737 626106381 625265598 624154270
2743.3 624154270 622756839 621196568 619586170 617995441 616491437 615089953 613742650 612392843
2759.6 612392843 611023486 609680712 608424723 607283711 606246889 605320692 604587555 604094803 603820324
2778 603820324 603779793 603977501 604330301 604749441 605218768 605721474 606159210 606389761 606300831 605859578
2798.4 605859578 605132937 604280531 603461802 602751911 602179170 601738989 601414859 601181269 600949883 600583732
2818.8 600583732 599927127 598821163 597096026 594612122 591260195 586872935 581264496 574261308
2835.1 574261308 565635085 555071354 542458057 528494239 514820039 503049314 493319303 484456927
2851.4 484456927 476300031 471361071 473518252 484352857 500761747 517210245 529967904 538426578
2867.7 538426578 543835461 547949553 551887989 555579841 558387995 559978962 560547113 560523272 560145140
2886.1 560145140 559289992 557729900 555466652 552754462 549843132 546718895 543091357 538787067
2902.4 538787067 534020066 529039383 523729861 517737985 511151791 505410850 502840519 503918409
2918.7 503918409 506041527 506365538 504165471 499892980 493892580 486338258 477415919 467666090
2935 467666090 458634406 452277422 449013501 447951466 449623346 456302851 468815804 484660685
2951.3 484660685 499906838 511976063 520475745 526467800 531570196 537107408 543365896 549764633
2967.6 549764633 555612743 560507119 564250886 566694677 567984402 568977177 570947349 574398518
2984 574398518 578412354 581642807 583550334 584393203 584666729 584817827 585031152 585349679 585922003
3002.3 585922003 586798012 587828398 588925898 590097904 591273963 592396319 593498707 594624221
3018.6 594624221 595855534 597286284 598842323 600352168 601837933 603453457 605215013 606939197
3034.9 606939197 608503342 610015333 611541033 612978637 614242911 615392327 616635084 618080080
3051.3 618080080 619640529 621272862 622958899 624681830 626471162 628277659 630025327 631712019
3067.6 631712019 633372009 635020137 636600018 638109267 639648378 641236722 642814517 644330680
3083.9 644330680 645781994 647241592 648762882 650302231 651802421 653283060 654806018 656431913
3100.2 656431913 658152640 659890354 661649644 663502157 665422082 667301893 669153869 671109855
3116.5 671109855 673197091 675340354 677494168 679635227 681743503 683803558 685795188 687723875
3132.8 687723875 689610422 691445768 693220556 694927096 696555674 698132038 699676096 701140046
3149.2 701140046 702505410 703847706 705180943 706446588 707635105 708781719 709905863 710993111
3165.5 710993111 712030351 713004112 713893235 714713812 715513349 716290712 717024624 717755377 718538046
3183.8 718538046 719353676 720162272 720953286 721704245 722409844 723085105 723734558 724346817 724917173 725453496
3204.2 725453496 725930393 726360917 726792693 727202237 727539420 727804005 728030860 728246689 728448808 728596866
3224.6 728596866 728686273 728787303 728937209 729051232 728998423 728826821 728667855 728492677 728234589 727889180
3245 727889180 727447987 726876140 726173759 725378633 724480689 723452806 722305536 721041858 719642282
3263.4 719642282 718112528 716471553 714730263 712873757 710907280 708892584 706838548 704676926
3279.7 704676926 702330410 699784160 697087705 694234848 691193998 687946200 684442878 680645883
3296 680645883 676519871 671997547 667045534 661654532 655639470 648697853 640666783 631444633 620828092
3314.4 620828092 608541310 594303906 577855408 559000552 537670851 514050901 488977611
3328.6 488977611 464198679 442009419 424933881 415254384 413951904 420424491 433037847 449552715
3345 449552715 467847794 486359358 503790379 519361258 533145189 545449197 556351662 565804660
3361.3 565804660 573891819 580938816 587076128 592129886 596088290 599339306 602295697 605007946
3377.6 605007946 607395291 609460831 611289561 612990856 614650548 616294563 617704868 618658185
3393.9 618658185 619417846 620433986 621595919 622321904 622581601 622950971 623572111 624173641 624688625
3412.3 624688625 625183463 625693798 626303077 627022862 627785325 628615856 629566967 630596101 631558120
3430.6 631558120 632515073 633615077 634652376 635438979 636174798 637102187 638258338 639566541 640926600
3449 640926600 642306447 643730879 645237029 646833122 648479283 650098383 651754260 653626323 655605435
3467.3 655605435 657316267 658660054 659991503 661575913 663391888 665212750 666790187 668279886
3483.6 668279886 669934094 671638787 673286200 674986482 676763773 678559244 680312693 682030499
3500 682030499 683774710 685434043 686949372 688524127 690299511 692261219 694218278 695989013 697688580
3518.3 697688580 699529111 701571107 703550756 705293179 707033932 708936393 710956335 713079512
3534.6 713079512 715205312 717209995 719237804 721361220 723403335 725245535 727052093 729017138
3551 729017138 731094480 733198881 735306561 737428308 739562213 741560459 743479609 745811224 748532295
3569.3 748532295 751077473 753409207 755784452 758275986 760876954 763529181 766059339 768426716
3585.6 768426716 770913303 773641348 776289046 778823495 781465173 784209669 786916733 789569676
3601.9 789569676 792109787 794428408 796781063 799318850 801777542 804048777 806078136 808066189
3618.3 808066189 810309112 812451422 814094961 815306962 816793382 818965495 821008027 822691202
3634.6 822691202 824237168 825712740 827080786 828209877 828993738 829569042 830553174 832109988 833357990
3652.9 833357990 834187508 835180461 836271763 836999714 837358892 837517142 837511003 837591290 837903023 837997854
3673.3 837997854 838083982 838699520 839478493 840158761 840704024 841030300 841283560 841658652 842167318 842784703
3693.7 842784703 843366265 843726873 843899071 844122887 844488263 844736457 844691515 844610155 845015526 845731854
3714.1 845731854 846080482 845950902 845647395 845461965 845467746 845563114 845578194 845416605 845204711 845277011
3734.5 845277011 845898330 846664608 846861422 846457124 846166790 846237659 846227288 846477151 847184420 847705603
3754.9 847705603 847856879 847950876 848176479 848324835 848290145 848214626 848261535 848501623 848686099 848620057
3775.3 848620057 848518074 848582745 848644555 848560750 848509073 848607123 848750889 848766267 848520339 848187566 847963393
3797.7 847963393 847772121 847799301 848017693 848112166 848314047 848616660 848579347 848175526 847848833 847678244
3818.1 847678244 847447872 847486734 847794116 848053336 848184049 848076224 847840428 847673953 847487450 847351730
3838.5 847351730 847509861 847841740 848153830 848261714 847900033 846987903 846171856 846478641 847190380 847420096
3858.9 847420096 847219765 846916676 846772075 846651137 846526563 846658885 846992373 847361326 847548723 847473443
3879.3 847473443 847398341 847388744 847434819 847504854 847409844 847304046 847408116 847447038 847161889 846734703 846466601
3901.8 846466601 846489549 846766055 847014487 847065985 847016931 846899748 846729994 846638620 846614778 846565604 846520722
3924.2 846520722 846490443 846406817 846285582 846233547 846272349 846268296 846119702 845889568 845720649 845647216 845579147
3946.6 845579147 845483482 845427394 845474601 845567048 845639527 845713198 845780075 845820785 845846534 845838308 845783234 845699668
3971.1 845699668 845566928 845385194 845189273 844958961 844677985 844378114 844019771 843554139 843091428 842731774
3991.5 842731774 842448413 842289925 842281580
3997.6 842281580
##END=$$ End of the data block
