##TITLE=Amostra 4 $$ Begin of the data block
##JCAMP-DX=5.00 $$ ACD/SpecManager v 10.08
##SPECTROMETER/DATA SYSTEM=Alpha
##DATE=23 Aug 2016 09:05:00
##DATA TYPE=INFRARED SPECTRUM
##DATA CLASS=XYDATA
##ORIGIN=
##OWNER=
##NPOINTS=1667
##FIRSTX=599.65820312
##LASTX=3997.72216797
##MAXX=3997.72216797
##MINX=599.65820312
##MAXY=0.44516391
##MINY=0.05816809
##XFACTOR=1.0000000000
##YFACTOR=1.000000000000000e-9
##FIRSTY=0.10091151
##DELTAX=2.03965425
##XUNITS=1/CM
##YUNITS=ARBITRARY UNITS
##XYDATA=(X++(Y..Y))
599.7 100911506 100083463 99340260 98884791 98630697 98268703 97759135 97312570 97000815 96831560 96616261
620.1 96616261 96056603 95370598 94903030 94443157 93818955 93156576 92488170 91990046 91894932 92007495
640.5 92007495 91996789 91679335 91175817 90949833 90976670 90848580 90649217 90555087 90439916 90344302 89994155
662.9 89994155 89073032 89071847 90792611 91139354 90595797 90488307 90638675 90699568 90663083 90726972 90801589
685.3 90801589 90680853 90399735 90128496 90277180 91406792 93525425 95865726 97709149 98970093
703.7 98970093 99650100 99544711 98864496 98518200 99521175 101883024 104669645 107013561 108419195
722 108419195 108884558 109073035 109925769 111831002 114237219 116333209 118097827 120277695 123088308
740.4 123088308 125669822 127429515 128567547 129197583 129305199 129147962 128933102 128713816 128586575
758.8 128586575 128565878 128485441 127979338 126872748 125267461 123295091 121343538 120171338 120613314
777.1 120613314 123089492 127172545 131651387 135247886 137330830 137837321 136961043 135398835 134186000
795.5 134186000 134198815 135924697 139249057 143878639 149873316 157439426 166275963 175208971 182434738
813.8 182434738 185789570 183106929 173303455 157504514 139144287 122819327 112048641 107653238
830.1 107653238 108503975 113036454 119700186 127224237 135100335 143360883 151805863 160400093 169672444
848.5 169672444 178901717 186289698 190871119 191839725 188664466 182592228 176252276 171721667 168687955
866.9 168687955 164938956 159233734 153130069 149451211 149816528 153714612 159317970 166566968 177161008
885.2 177161008 189616144 199693501 205629751 208360508 208716080 206733257 202296957 195642486
901.5 195642486 187808484 180404022 174272358 168809608 163189039 158122972 155866653 158474311
917.8 158474311 166016012 175984100 184778869 190165043 192120314 191887692 190744936 189441934 188279048
936.2 188279048 187362999 186702698 186167523 185495928 184431911 182970822 181228846 179163694 176689938
954.6 176689938 173921853 171041861 168060705 165020481 162038758 159122869 156369060 154176921
970.9 154176921 152975529 152737200 152842015 152526885 151414722 149698302 147787690 145778984 143601865
989.2 143601865 141279787 138927311 136668622 134450912 132111236 129483730 126343191 122158453
1005.6 122158453 116502181 110730909 107314505 106418476 105889440 104225159 101344772 97602583 93447722
1023.9 93447722 89322858 85395105 81842855 78952774 76948054 76089531 76485112 77952899 80190361
1042.3 80190361 82802184 85286662 87244965 88550366 89226753 89343674 89032620 88456176 87712117
1060.6 87712117 86817436 85809126 84704958 83471835 82181588 80992185 80006570 79308718 78944825
1079 78944825 78808524 78800589 79042435 79702005 80690317 81685953 82494900 83145753 83699666 84175229
1099.4 84175229 84480375 84593028 84751293 85279472 86298496 87594710 88823371 89774065 90495929
1117.7 90495929 91234453 92180490 93192063 93935631 94347805 94637252 95034167 95707446 96664466 97726636
1138.1 97726636 98680437 99402621 99850200 100088410 100355618 100790463 101298310 101812772 102269195 102459699
1158.5 102459699 102291860 102003969 101772144 101424851 100675501 99306263 97091109 93676455 88751905
1176.9 88751905 82740180 77300131 74426167 75032346 78748249 84595472 91444902 98199703 103973307
1195.2 103973307 108245157 110961653 112371065 112735391 112222411 110859856 108626917 105649859 102117464
1213.6 102117464 98142408 93862720 89504898 85335888 81610709 78491755 75996801 74104935
1229.9 74104935 72792634 71937792 71321078 70646703 69761723 68863779 68189055 67891821 68230741 69359630
1250.3 69359630 71323656 74411012 79058662 85460842 93253300 101430058 108844608 114747465
1266.6 114747465 118938327 121753074 123728089 125083521 125626057 125062212 123265482 120428801 117045894
1285 117045894 113657556 110604621 108103536 106236644 104995087 104602844 105417460 107620388 111060798
1303.3 111060798 115163013 119030304 122013927 124517947 127454877 130837217 133961648 136233166
1319.7 136233166 137447417 137852192 137785017 137447283 136864647 135983407 134718552 133005396 130929619
1338 130929619 128642514 126423597 124701366 123784602 123693220 124112017 124411359 123816721 121560894
1356.4 121560894 117537349 113412373 111990027 113961913 117117763 119439349 120170087 119701274 118526891
1374.7 118526891 116620407 113910884 110646278 107756793 106404133 106761336 107420795 107212007 106583737
1393.1 106583737 105940036 105123580 104120843 102828190 101356395 99920332 98318607 96577071 95122635
1411.4 95122635 94146825 93647413 93992397 94992742 95335871 95036037 94586946 94247393 94524935 95131546
1431.8 95131546 95738076 96949913 98192096 98289512 97835816 97153328 96152648 94876043 93356475
1450.2 93356475 91867693 91082089 92279181 94729804 95893979 96677400 98245837 99817514 100724794
1468.6 100724794 102220789 105340719 108629271 110773049 112271562 113563716 114658400 115324497
1484.9 115324497 115539968 115168266 113590285 110555619 106270105 100311838 92404209 83313532 74327700
1503.2 74327700 66435717 60646389 58168091 59951887 67432076 82147993 102991633 125340104
1519.6 125340104 147120163 163998216 175041690 183569282 189962715 195351660 200762182 204845265
1535.9 204845265 208234593 213130146 217907876 221226037 224038705 226518929 228937954 231270269
1552.2 231270269 233255923 235009223 237721726 240391135 240903929 240619346 239972159 238482878 235381603
1570.5 235381603 230234131 222209185 209935293 197874635 191416755 193270236 203464657 216227576
1586.9 216227576 224653274 226088151 221568286 212687001 200571671 186038777 169844300 154009521
1603.2 154009521 142371297 138731658 144962460 159451857 177979499 199406192 222282425 239328116
1619.5 239328116 251408905 262187392 270696640 276946932 281830311 285284847 288253546 291922361
1635.8 291922361 295248926 297629058 299741119 301888853 304561168 307261527 309076905 311637849
1652.1 311637849 315448850 317804962 319391936 321202457 323313951 325204879 326501638 327810466
1668.4 327810466 329290837 330426097 331525534 332636595 333301783 333704710 334514499 336244583 337881148
1686.8 337881148 339204252 340633780 341916233 343304694 344802111 346315801 348203719 349527925
1703.1 349527925 350347400 351201594 351712048 351668119 351201177 350593507 349945784 348959506 347354621 345024288
1723.5 345024288 341919363 337952793 333154529 328040004 322969049 319118589 317380637 317642987
1739.8 317642987 320164770 324890703 331445038 339345336 348378360 357371211 364526868 370148212
1756.2 370148212 374722004 378145337 380938053 383056432 384408534 385364681 386267334 387276828 388126999
1774.5 388126999 388610542 388822854 388729334 388042659 386395693 383275986 378032058 370430708 362310410
1792.9 362310410 356703430 353862941 353338033 355817556 361078799 367356181 373148531 377837926
1809.2 377837926 381403387 384038717 386080682 387864709 389499903 390938252 392377585 394120574
1825.5 394120574 396046191 398142636 400324672 402115256 403414190 404376179 404942304 405033559 404881686
1843.9 404881686 404618561 403977334 402804852 401103228 398930132 396410614 393645257 390818894 388079166
1862.2 388079166 385466784 383031905 381062835 379903913 379302830 378807038 378259808 377699852 377243966
1880.6 377243966 377052426 377161413 377538085 378308386 379695594 381594598 383898526 386615247 389542967
1898.9 389542967 392545193 395577848 398601025 401553094 404451191 407248288 409695715 411701441
1915.2 411701441 413470924 415077239 416369766 417480826 418538183 419400156 420010209 420429379 420704544
1933.6 420704544 420892775 420992047 420976222 420988590 421178579 421492249 421825349 422227621 422747523 423263997
1954 423263997 423685879 423988581 424105316 424007267 423703045 423236787 422760099 422300011 421764016 421226114
1974.4 421226114 420800805 420456737 420135081 419810057 419411153 418904781 418333590 417780697 417379498 417167068
1994.8 417167068 417070627 417075604 417200863 417431086 417737067 418188632 418841332 419504672 420000553 420331597
2015.2 420331597 420567155 420755744 420862168 420938134 421126276 421444446 421825111 422242522 422665089 423084468
2035.6 423084468 423525155 423908293 424123287 424170405 424110413 423986524 423797101 423546582 423332691 423181564
2056 423181564 422990382 422799230 422768325 422922790 423235506 423736691 424424469 425283372 426274240 427341849
2076.4 427341849 428445399 429551005 430684924 431843102 432906121 433844745 434722483 435512364 436240315
2094.7 436240315 436946005 437589228 438136935 438557953 438851476 439080268 439280272 439389229 439445674 439552397
2115.1 439552397 439661443 439728022 439845026 440094829 440426797 440730155 440957904 441110313 441181183 441239178
2135.5 441239178 441359013 441539496 441732645 441878974 442002237 442155182 442330211 442558229 442891687 443237633
2155.9 443237633 443483710 443675995 443896353 444113046 444282234 444429576 444581211 444723934 444805771 444851071
2176.3 444851071 444934994 445026189 445071042 445116758 445163906 445162743 445143372 445099264 444993228 444853008 444704652
2198.8 444704652 444547385 444434196 444368273 444239676 444019556 443765849 443504542 443224341 442907810 442560524
2219.1 442560524 442227304 441985726 441830337 441650748 441454440 441305012 441146582 440983564 440863580 440714538
2239.5 440714538 440502882 440270901 440006882 439709306 439399481 439087570 438761413 438384384 437999994 437650800
2259.9 437650800 437362015 437201291 437104762 436983228 436834127 436682135 436632454 436693609 436761886 436781466
2280.3 436781466 436699390 436464667 436071962 435615867 435225189 434961468 434867710 434934646 435074568 435198247
2300.7 435198247 435262382 435291886 435272157 435160309 434994042 434778601 434456497 434030950 433621556 433323443
2321.1 433323443 433102906 432947516 432901710 433009565 433234245 433354616 433277398 433166891 433040410 432885259
2341.5 432885259 432723612 432529449 432434350 432513982 432750314 433092773 433421284 433620930 433793992 434085935
2361.9 434085935 434240341 434095234 433776677 433437824 433245957 433193237 433189243 433274448 433474332 433696747
2382.3 433696747 433833271 433848023 433728009 433440149 433010966 432531506 432082832 431692600 431335390 430989534
2402.7 430989534 430648655 430308193 429945350 429450065 428785086 428077251 427416593 426799029 426167041 425544828
2423.1 425544828 425045520 424747616 424644798 424631327 424664259 424784631 424986094 425187349 425297827 425345957
2443.5 425345957 425423712 425480425 425440490 425359190 425252825 425098062 424874693 424529910 424031854 423392504
2463.9 423392504 422645718 421797961 420841217 419786602 418684006 417556971 416312665 414855778 413193583
2482.3 413193583 411396086 409524232 407609433 405668437 403634489 401448667 399133861 396595895
2498.6 396595895 393708348 390546501 387242109 383861274 380563349 377577394 375033647 372967511
2514.9 372967511 371344924 370154500 369582891 369789302 370629251 371913552 373568773 375544041 377765536
2533.2 377765536 380111217 382460624 384678036 386543363 387933791 389000714 389932364 390831023 391791016
2551.6 391791016 392813534 393870234 394994050 396136135 397169173 398036331 398739368 399278075 399616003
2570 399616003 399778992 399883300 399938345 399886340 399766892 399653107 399538845 399414569 399354309 399425119 399593055
2592.4 399593055 399834782 400222033 400729239 401224077 401661575 402075917 402494967 402973652 403538078 404120326
2612.8 404120326 404687405 405163974 405452013 405574262 405592233 405635595 405849308 406245202 406717271 407153279
2633.2 407153279 407533914 407950103 408434063 408854306 409128755 409296453 409399033 409455150 409449726 409388930
2653.6 409388930 409339815 409283072 409160882 409008890 408816725 408575535 408350050 408071190 407658219 407236844
2674 407236844 406852216 406417698 406051099 405858040 405665338 405367047 404988289 404561371 404197812 403876781
2694.4 403876781 403505087 403143227 402800292 402366489 401820213 401240557 400620818 399928808 399201572 398462504
2714.8 398462504 397715509 396930337 396133155 395399243 394760787 394386619 394337565 394302309 394133389 393901050
2735.2 393901050 393546343 393035471 392324030 391345799 390172482 388990164 387965649 387112409 386389405
2753.5 386389405 385787934 385347366 385181665 385351151 385713965 386083424 386383116 386540920 386397392 385952622
2773.9 385952622 385583669 385359198 384918481 384231240 383378714 382210255 380816162 379538149 378363252
2792.3 378363252 376992285 375368357 373851866 372694671 371622950 370435536 369165152 367787510
2808.6 367787510 366402090 365035892 363458395 361529261 359255105 356529772 353234679 349495411
2824.9 349495411 345460564 341204107 336922288 332815647 328837007 324715078 320367575 315596759
2841.2 315596759 309720576 302456319 294341534 286124259 278247178 270985872 264597178 258862942
2857.5 258862942 253097177 246542528 238755986 230273575 222637340 217454866 215653583 217449695
2873.8 217449695 222163975 228141755 233781278 238315985 241546959 243571028 244678691 245254681
2890.2 245254681 245433748 244956627 243583366 241119474 237306848 232236579 226464540 220502496 214435235
2908.5 214435235 208139718 201621041 194951132 188198015 181497753 175167918 169828728 166094378
2924.8 166094378 164242253 164502993 166997522 171296179 176696256 182546929 188193947 193121150
2941.1 193121150 197092757 200047910 201693371 201323852 198449999 193313003 186446890 178550929
2957.5 178550929 170752928 164263487 160063550 158809185 160772592 165823251 173440829 182981387
2973.8 182981387 193830818 205250487 216528162 227220297 236854658 244872183 251033545 255397141
2990.1 255397141 258389324 260669976 262543082 264536381 267503649 271685779 276959449 283141494
3006.4 283141494 289634138 295812160 301667124 307320893 312342197 316067368 318056315 318009377 315976202
3024.8 315976202 312392473 307630986 302390039 297860026 295161933 294545650 295121819 296027064 296855718
3043.1 296855718 297131598 296433568 294676661 292390436 290470541 289529979 289938450 291783899 294704676
3061.5 294704676 298332691 302539736 307306230 312519670 317796350 322768062 327307522 331446707
3077.8 331446707 335347772 338876337 341663659 343749255 345165133 345767558 345744848 345403641 345042378
3096.2 345042378 345044315 345776081 347347885 349227309 350696772 351674646 352403909 352643251 352087200
3114.5 352087200 351203918 350623369 350510627 350688159 350901127 351128846 351475477 351990610 352563381 352923840
3134.9 352923840 352887124 352707714 352804542 352980971 352862060 352486908 351794153 350839496 350276440 350276887
3155.3 350276887 350246996 350080043 349987358 349855065 349636704 349382520 349063456 348679155 348217875 347706705
3175.7 347706705 347181112 346619457 346079320 345598310 345099181 344596386 344223499 343911290 343526989 343130201
3196.1 343130201 342720747 342305362 341957033 341592461 341132820 340664953 340211123 339693695 339170814 338655829
3216.5 338655829 338086963 337585837 337151825 336577415 335858643 335113525 334194630 333112657 332369626
3234.8 332369626 332045227 331683457 331105024 330323219 329421580 328728378 328287750 327745944 327013612 326291084
3255.2 326291084 325728893 325219542 324570596 323843241 323107123 322233498 321243703 320427269 319887221 319429815
3275.6 319429815 318879008 318270028 317769051 317346036 316792637 316054910 315230697 314438909 313744009 313132107
3296 313132107 312620461 312099457 311332643 310320526 309397578 308924645 308773667 308429599 307761699 307055086
3316.4 307055086 306460083 305938542 305351526 304660559 304065555 303650081 303276360 302771479 302047431 301272064
3336.8 301272064 300665110 300160825 299677432 299256116 298736364 297939807 297142446 296617806 296164900 295646936
3357.2 295646936 295134246 294553846 293788821 292892665 292096943 291612118 291321516 290886998 290282398 289748043
3377.6 289748043 289290905 288713962 288032681 287459671 286994457 286427975 285746098 285151631 284642816 284046173
3398 284046173 283495218 283194214 282914549 282371134 281728387 281230092 280826092 280475408 280096203 279620081
3418.4 279620081 279209197 278883904 278595626 278288782 277884752 277480066 277179271 276947618 276666731 276372313
3438.8 276372313 276192605 276080340 275941849 275755256 275534123 275439203 275440276 275260121 275022328 274944663
3459.2 274944663 274961293 274952650 274814248 274692178 274834305 275151014 275371045 275436431 275482535 275645941
3479.6 275645941 275911927 276083201 276198477 276495039 276920855 277208090 277267724 277368486 277697653 278044760
3500 278044760 278319418 278756738 279375374 279909611 280345023 280890882 281517446 282059312 282579184 283219755
3520.4 283219755 283969253 284773707 285615027 286541760 287555784 288488925 289310366 290137678 290972084
3538.7 290972084 291781723 292607933 293564439 294700623 295840532 296858460 297858775 298863292 299815238
3557.1 299815238 300715536 301597983 302479655 303340912 304381758 305743784 307227075 308664769 310005933
3575.4 310005933 311268866 312462330 313483626 314302921 315322548 316951513 318771482 320315629
3591.8 320315629 321725905 323069543 324319959 325516075 326622337 327620685 328527659 329422891 330417365
3610.1 330417365 331402451 332170755 332788914 333528459 334428221 335187942 335663676 336133420 337015718 338039964
3630.5 338039964 338670403 339155108 339728951 340272993 340700001 340990454 341239661 341728240 342454165 343026698
3650.9 343026698 343478471 344041944 344597310 344984978 345334113 345695972 345953107 346077591 346050203 345685899
3671.3 345685899 345388860 346023083 347309887 348278135 348852873 349156231 349314988 349649817 350259542
3689.7 350259542 350636005 350634187 350598037 350641698 350670159 350635082 350599319 350678504 350909352 351183981 351199478
3712.1 351199478 350954711 350771308 350628644 350390792 350150585 349990606 349766225 349493355 349263132 349024385
3732.5 349024385 348866940 348727614 348367393 347979724 347948045 348058164 347823739 347699076 347808391 347497940
3752.9 347497940 346917331 346589863 346489280 346247882 345764041 345324576 345125467 345069200 344979286 344754428
3773.3 344754428 344408244 344118357 343967736 343825251 343707800 343619913 343421400 343145788 342857391 342511237
3793.7 342511237 342186660 342029810 342072278 341896415 341360003 341084212 340935946 340482950 340034217 339877993
3814.1 339877993 339679211 339206934 338937968 338866174 338654697 338365674 338039428 337652624 337238431 336921602
3834.5 336921602 336827576 336850464 336890459 336892158 336524904 335757613 335038483 334894180 335398108 335481524 334885061
3856.9 334885061 334375829 334040016 333706737 333350629 333029181 332812726 332654119 332453787 332182020 331916988
3877.3 331916988 331724793 331516504 331322491 331147790 330934167 330700070 330329359 329849422 329422563 329071850
3897.7 329071850 328779280 328611434 328583390 328456044 328252763 328177243 328099281 327872723 327551693 327231318
3918.1 327231318 327047646 326951683 326833934 326800436 326858908 326864541 326775700 326629788 326420456 326191783 325999022
3940.5 325999022 325748414 325437963 325119555 324784845 324532598 324313551 323948473 323441684 322997898 322748333
3960.9 322748333 322569132 322342724 322039217 321735919 321504772 321264088 320962816 320633471 320462584 320584357
3981.3 320584357 320759684 320657849 320326924 320102602 320129454 320200622 320069373 319816917
3997.6 319816917
##END=$$ End of the data block
