##TITLE=Amostra 3 $$ Begin of the data block
##JCAMP-DX=5.00 $$ ACD/SpecManager v 10.08
##SPECTROMETER/DATA SYSTEM=Alpha
##DATE=23 Aug 2016 09:05:00
##DATA TYPE=INFRARED SPECTRUM
##DATA CLASS=XYDATA
##ORIGIN=
##OWNER=
##NPOINTS=1667
##FIRSTX=599.65820312
##LASTX=3997.72216797
##MAXX=3997.72216797
##MINX=599.65820312
##MAXY=1.08277190
##MINY=0.18032229
##XFACTOR=1.0000000000
##YFACTOR=0.000000010000000
##FIRSTY=0.93566203
##DELTAX=2.03965425
##XUNITS=1/CM
##YUNITS=ARBITRARY UNITS
##XYDATA=(X++(Y..Y))
599.7I3566203L25805L47769O27882R00888R47619P67213N50365M03077L07232K90054
620.1I9034107L10743K85613K20978J59502R5714k0838l36212q16786p46566J21271
640.5I8307526P96700P38054L94982J27602k7728n1201K7872P8225K4008j18362k36810
662.9A00060868k25961o2603L45785M85360L01040J50370J25504J94227K19608J98173
683.3A01792371J82450J47891R9814N8198M4549O9046Q3041P7164P4172O4492M2975
705.7A02736163K9409O723m8220j28579k62999m96853q18372j150220j370925j197636
726.1I7298491m33648K44409j05124j023037j013398K91330J403546J107955q476r55379
746.5I6806669j484412j695525j724762j624245j314818q32481l86315j65212k21968
$$ y = [93566203, 93892008, 94239777, 94867659, 95768547, 96716166, 97483379, 98033744, 98436821, 98744053, 99034107, 99344850, 99630463, 99851441, 100010943, 100106657, 100085819, 99749607, 98932821, 98186255, 98307526, 99104226, 99842280, 100237262, 100364864, 100337136, 100285935, 100313807, 100392032, 100416040, 100297678, 100060868, 99834907, 99772304, 100118089, 100603449, 100904489, 101054859, 101180363, 101374590, 101594198, 101792371, 101974821, 102122712, 102222526, 102280724, 102325273, 102394319, 102477360, 102554524, 102628696, 102693188, 102736163, 102765572, 102772295, 102724075, 102595496, 102332497, 101835644, 101017272, 99867052, 98496127, 97298491, 96864843, 97109252, 97004128, 95981091, 94967693, 95259023, 96662569, 97770524, 97762048, 96806669, 95322257, 93626732, 91901970, 90277725, 88962907, 88130426, 87744111, 87578899, 87356931]
764.9H7356931m14008n05602l44307J81753J135158K296180L015476K740854J711238
783.2I7173673O13862j88434p15500j036620j198274j317358j555765k004713k541470
801.6H7229401k848673k665198k002394j193523p34884r56762j936084l598440n669260
819.9F5624183p522392q279070p357872n034139k269414Q6554J727975K760002L354198
838.3D3090025L643593L810167M032463M270112M267312L870058L155380K262789J251012
856.7G3652911K34926l80492n8157J295102L039396M285604M546469L907853K828908
875I3352520J783973J007009N03975J82229o1267k73788m67557o79231r44227j323133
895.4I3080503j886398k622455l322971l589606l212822k565121k281636k359462j955211
$$ y = [87356931, 86942923, 86437321, 86093014, 86274767, 87409925, 89706105, 92721581, 95462435, 97173673, 97787535, 97599101, 96883601, 95846981, 94648707, 93331349, 91775584, 89770871, 87229401, 84380728, 81715530, 79713136, 78519613, 77784729, 76827967, 74891883, 71293443, 65624183, 58101791, 49822721, 42464849, 37430710, 35161296, 35247850, 36975825, 39735827, 43090025, 46733618, 50543785, 54576248, 58846360, 63113672, 66983730, 70139110, 72401899, 73652911, 73887837, 73507345, 73449188, 74744290, 77783686, 82069290, 86615759, 90523612, 93352520, 95136493, 96143502, 96647477, 96829706, 96768439, 96494651, 96027094, 95347863, 94403636, 93080503, 91194105, 88571650, 85248679, 81659073, 78446251, 75881130, 73599494, 71240032, 69284821]
913.8F9284821l34430K254760M676527N694717M917115L088361J342738L02517q8972
932.1I1138154j18017L2008K63327M82559O14840O13749M78745K63083O318k29490
952.5I3545276l79312m61131n23198n80967o27744o82580p49195o84541k80625M29195
972.9H9005178J079166J290596J016503N13906Q5318j35184k06768k49070l20393m06927
993.3I1672325m70692n33676o84696r83906j578069k891695m773277n140329k567458
1011.7G2048527M40210J082957k58803k118904l598845m403609m712015m717136m399708
1030D9362674l656700k466380r14321Q62026K687627M324457N516208O054401N884719
1048.4F7654711N156505M148477L137076K282846J637489J192552Q73297N55057J49381
$$ y = [69284821, 68950391, 71205151, 75881678, 81576395, 86493510, 89581871, 90924609, 91227126, 91138154, 91020137, 91052145, 91315472, 91798031, 92412871, 93026620, 93505365, 93768448, 93774766, 93545276, 93165964, 92704833, 92181635, 91600668, 90972924, 90290344, 89541149, 88856608, 88575983, 89005178, 90084344, 91374940, 92391443, 92905349, 92990667, 92855483, 92648715, 92399645, 92079252, 91672325, 91201633, 90667957, 89983261, 88999355, 87421286, 84529591, 79756314, 74615985, 72048527, 72488737, 73571694, 73312891, 71193987, 67595142, 63191533, 58479518, 53762382, 49362674, 45705974, 43239594, 42325273, 43187299, 45874926, 50199383, 55715591, 61769992, 67654711, 72811216, 76959693, 80096769, 82379615, 84017104, 85209656, 86082953, 86638010, 86787391]
1066.7H6787391l42411q25256j109261j040518p43341n83160q17615j182878r48918
1085.1G9194033P9334J033509J112193N07068k17098q33767j393575j931661k212012
1103.5G5338024j801205o13296P37906J462149J333028P14428K22224L04871P35182
1121.8G8433311P91657J89793n68265q24004l81088M87601J361645J902240J940823
1140.2H3333713J537800R73653N78803M70704M56405K61736j12933l05307N555O41429
1160.6H7841558J066244Q93265J13124j069814k523560m380780o923395r827000j1471194
1178.9E3718448j0064504n796850o46305L840104P250032R354076R710538Q262694
1195.2G5628233N747604L180302J131337l84771j584930k638596l579050m353911m936784
$$ y = [86787391, 86444980, 85619724, 84510463, 83469945, 82726604, 82143444, 81325829, 80142951, 79194033, 79273367, 80306876, 81419069, 81926137, 81709039, 80875272, 79481697, 77550036, 75338024, 73536819, 72923523, 73661429, 75123578, 76456606, 77171034, 77393258, 77698129, 78433311, 79224968, 79414761, 78846496, 78022492, 77641404, 78129005, 79490650, 81392890, 83333713, 84871513, 85845166, 86423969, 86894673, 87351078, 87612814, 87499881, 87194574, 87200129, 87841558, 88907802, 89801067, 89914191, 88844377, 86320817, 81940037, 75016642, 65189642, 53718448, 43653944, 37857094, 37210789, 41050893, 48300925, 57655001, 67365539, 75628233, 81375837, 84556139, 85687476, 85302705, 83717775, 81079179, 77500129, 73146218, 68209434]
1213.6F8209434n354423n594611n577564n244950m645696l902510l128761k385700
1229.9C2375219j716467j184267q61162p80526q77926r94655r30449n97206p1171N31158
1250.3B4892548J206028K122891L474933N186188O754923P490298P084781N842096
1266.6F4054686M348022L101003K242726J590890Q78179o7479j224267k335847l044963
1285F9542950l178316k859563k374988j892919j341378n45890N72581J894593L115165
1303.3F2932235L808987L684431L026915K719569L171993L706371L575349K797926
1319.7H9423776J835715J061678N43625J87301q9347l27522n72467q87322j292086
1338H9883351j618719j561707j068759k81650N91892J196873J217175M43196j287508
$$ y = [68209434, 62855011, 57260400, 51682836, 46437886, 41792190, 37889680, 34760919, 32375219, 30658752, 29474485, 28613323, 27832797, 26954871, 25960216, 25029767, 24432561, 24361390, 24892548, 26098576, 28221467, 31696400, 36882588, 43637511, 51127809, 58212590, 64054686, 68402708, 71503711, 73746437, 75337327, 76215506, 76148027, 74923760, 72587913, 69542950, 66364634, 63505071, 61130083, 59237164, 57895786, 57349896, 57922477, 59817070, 62932235, 66741222, 70425653, 73452568, 76172137, 79344130, 83050501, 86625850, 89423776, 91259491, 92321169, 92864794, 93052095, 92962748, 92635226, 92062759, 91175437, 89883351, 88264632, 86702925, 85634166, 85352516, 85944408, 87141281, 88358456, 88801652, 87514144]
1356.4H7514144l468948m213518j693464K629948M927170M471642K791148J284576
1372.7I4242698L09694o21468j930308l147167k973014j033032J410794K617907K185262
1391.1I1061366J371008Q13198M19652R6262j72633m56935q05944j175195j516027
1409.4H9634752j470750o94239M07874J243109J521372R16869q2684q87066j127738
1427.8H9461499n85973M37337J028508Q74836J56039p43795j533425k205586k893198
1446.1H3996242l629625l797847l208988k222932j058131K78234R98527J030397R27031
1464.5G3312908P54810O22159Q09801J370793J681364J364899Q74376M82499L29316
1482.8H1602925K02137k38263j179153k351433l272623m807115p339632q994609q995062
$$ y = [87514144, 84045196, 79831678, 78138214, 80768162, 85695332, 90166974, 92958122, 94242698, 94552392, 93930924, 92000616, 88853449, 85880435, 84847403, 86258197, 88876104, 91061366, 92432374, 93245572, 93665224, 93761486, 93588853, 93131918, 92325974, 91150779, 89634752, 88164002, 87469763, 87877637, 89120746, 90642118, 91558987, 91476303, 90589237, 89461499, 88875526, 89312863, 90341371, 91216207, 91372246, 90628451, 89095026, 86889440, 83996242, 80366617, 76568770, 73359782, 71136850, 70078719, 70356953, 71355480, 72385877, 73312908, 74067718, 74689877, 75499678, 76870471, 78551835, 79916734, 80791110, 81273609, 81602925, 81805062, 81566799, 80387646, 78036213, 74763590, 69956475, 62616843, 53622234, 44627172]
1501.2D4627172q174587p919374p266555l234427Q15239M330633Q562442J2124467
1517.5D3865010J2772402J1978591R123933N838400M197735K952576K108925J745993
1533.8I4583565J304632Q92246Q22383P50345N77963M53132L21490J89072J07509M7695
1554.2A00050032j9216q3024J3560N7924j48678m01687p67517j286281j791614k978492
1574.6I2645007m922527m837280k778173J58847L341156M541725L190452Q15046j238549
1593I0915704k801830m104155n360025o562096p019711n741304k631479J401037M781174
1611.3F2877315O284088O845284O848663M990285L337259K702766K014220J371783
1627.7I7271663R94325O76351M34834L72267M01324L55363K83873K27785K21884K97654
$$ y = [44627172, 36452585, 28533211, 21266656, 18032229, 18847468, 23178101, 31740543, 43865010, 56637412, 68616003, 77739936, 83578336, 87776071, 90728647, 92837572, 94583565, 95888197, 96780443, 97602826, 98353171, 98931134, 99384266, 99705756, 99894828, 100002337, 100050032, 100030816, 99947792, 99961352, 100019276, 99870598, 99468911, 98701394, 97415113, 95623499, 92645007, 87722480, 82885200, 80107027, 80265874, 83607030, 88148755, 91339207, 92154253, 90915704, 88113874, 84009719, 78649694, 72087598, 65067887, 59326583, 56695104, 58096141, 62877315, 69161403, 76006687, 82855350, 87845635, 91182894, 93885660, 95899880, 97271663, 98265988, 98942339, 99377173, 99749440, 100150764, 100506127, 100790000, 101017785, 101239669, 101537323]
1648.1A01537323K87831K33793L20792L69537K91038K11811J82056J80078J38402R6535
1668.4A03849196J29688J60837J50919J53923J37115P1394P439P2551J75702J55914
1688.8A05064678J17398O1154m351j0717M232N7983J02806O8128N8318N6040J2040
1711.3A05587709m3023q1217o6221K3318O0117K6870k444l6264p0703r8240r0945J5378
1735.8A05224335L9470l4248n8139m1508n0295q3828q8632k8145j1504p0024q4722
1758.2A04712760n0139m423M3750L2449J8370L9208Q2886J44100J47522J04964Q5032
1780.6A05356479Q8930Q5616Q8537O3979K5606O2955J12581Q7428N0080M7147P0262
1803.1A06139600P9513N4765K3448J5557K5499K1219O807K253r394k7334k3163k0337
$$ y = [101537323, 101825154, 102058947, 102379739, 102749276, 103040314, 103252125, 103434181, 103614259, 103752661, 103849196, 103978884, 104139721, 104290640, 104444563, 104581678, 104653072, 104660511, 104733062, 104908764, 105064678, 105182076, 105243230, 105238879, 105228162, 105232394, 105290377, 105393183, 105461311, 105519629, 105575669, 105587709, 105544686, 105463469, 105397248, 105420566, 105480683, 105507553, 105505109, 105468845, 105398142, 105299902, 105208957, 105224335, 105263805, 105229557, 105171418, 105129910, 105079615, 104995787, 104907155, 104879010, 104867506, 104797482, 104712760, 104662621, 104658198, 104701948, 104734397, 104752767, 104791975, 104874861, 105018961, 105166483, 105271447, 105356479, 105445409, 105531025, 105619562, 105683541, 105709147, 105772102, 105884683, 105972111, 106022191, 106069338, 106139600, 106219113, 106273878, 106297326, 106312883, 106338382, 106359601, 106366408, 106368661, 106359267, 106331933, 106308770, 106288433]
1827.5A06288433l1829q881K062l5107o1071o5660q7404r8241n1403j5127j9193l7491
1852A05779088n6696p1633r1887j09744j28233j58894j98567k10309j54496j02031
1872.4A04496598j17171j52540j76751j86932j70219j34802j03689p6711r918O7699
1892.8A03435564J21641J77384K14636K23768K26116K16520J88291J63770J49118J29617
1913.2A05246425R1457N7447O2644P4864Q0919R3389Q2087N3811L5417K6238K2793
1935.6A05927491Q011k0158k6667O914M0817M7267M7051N1582N6899N8186N4789M8577
1960.1A06300759L2819R89j9979j1850q702k5809l9101l7646l7122m5311n1808n8353
1984.6A05998886o8152p0811o6423m8435k0146q726o450l182l732k122N73l171k3091
$$ y = [106288433, 106256604, 106247723, 106249785, 106214678, 106153607, 106087947, 106000543, 105902302, 105850899, 105835772, 105816579, 105779088, 105722392, 105650759, 105558872, 105449128, 105320895, 105162001, 104963434, 104753125, 104598629, 104496598, 104379427, 104226887, 104050136, 103863204, 103692985, 103558183, 103454494, 103377783, 103367865, 103435564, 103557205, 103734589, 103949225, 104172993, 104399109, 104615629, 104803920, 104967690, 105116808, 105246425, 105337882, 105395329, 105457973, 105532837, 105613756, 105707145, 105789232, 105843043, 105878460, 105904698, 105927491, 105935502, 105915344, 105888677, 105895591, 105936408, 105983675, 106030726, 106082308, 106139207, 106197393, 106252182, 106300759, 106333578, 106334567, 106314588, 106302738, 106294036, 106268227, 106229126, 106191480, 106154358, 106109047, 106057239, 105998886, 105930734, 105859923, 105793500, 105745065, 105724919, 105716193, 105709743, 105706561, 105702829, 105700707, 105701280, 105698109, 105675018]
2011.1A05675018n5278p1227o0237m7242m3833m2630l4392j4436j979n304j2196k6655
2035.6A05259609n1868p2741q5175r8527j11294j13129j05608j03652j00827q5497
2056A04331291p6199p3516n6184k9206J514L5715O1977Q1432J01006J20449J33634
2078.4A04631913J38485J40023J34373J21403J11079J09613J10018J00160Q0943O5958
2098.8A05743968N5814M3130L7813L7861K7943J3745R572J7524K4223K8575M1151N8067
2123.3A06139386P0023P1681O8271O0511M9889M8768N1177M7922M0007L1399L2223
2145.7A06711257L5953K9278K4319K5761K1791J6451J9777K6572K7346K8670K9361
2168.2A06996536K1041J4543J5235J3495J0383P641K539K921R489J0550o91j4723j1849
$$ y = [105675018, 105619740, 105548513, 105488276, 105441034, 105397201, 105354571, 105320179, 105305743, 105303764, 105298460, 105286264, 105259609, 105207741, 105135000, 105049825, 104951298, 104840004, 104726875, 104621267, 104517615, 104416788, 104331291, 104255092, 104181576, 104125392, 104096186, 104097700, 104133415, 104195392, 104276824, 104377830, 104498279, 104631913, 104770398, 104910421, 105044794, 105166197, 105277276, 105386889, 105496907, 105597067, 105678010, 105743968, 105799782, 105842912, 105880725, 105918586, 105946529, 105960274, 105969846, 105987370, 106011593, 106040168, 106081319, 106139386, 106209409, 106281090, 106349361, 106409872, 106459761, 106508529, 106559706, 106607628, 106647635, 106679034, 106711257, 106747210, 106776488, 106800807, 106826568, 106848359, 106864810, 106884587, 106911159, 106938505, 106967175, 106996536, 107017577, 107032120, 107047355, 107060850, 107071233, 107078874, 107081413, 107084334, 107093823, 107104373, 107103682, 107088959, 107077110]
2194.7A07077110N007P176Q94Q500Q106l946l016j79j3852k5010k2590j8978j6749
2221.2A07002473j5497j2112j1277j5283j1504k896K515Q82q738j3089j8942l4583
2245.7A06861949m1139l7313l6025m1783n0354n1140m2761l5619l3153k9134k1649
2268.1A06441879j3661q297j943P701J3530P617n233k2113m3762n7471o1083n5217
2292.6A06201947k9016N830K3174K5880K2197R620%N72K194j1349m1985o5005o8724
2319.1A06075335n8353k5213J3006M196k9600j1730L8731M2474J0240n722L243Q547
2343.6A06065154K9659P3064Q1145P9620J06705J30009J38867J43719J18708N2047
2364A07018697j3554l9983n0795m6813l3176k5058l529K5058L5119K7919J0550j9169
$$ y = [107077110, 107082117, 107089293, 107090187, 107098687, 107106793, 107102847, 107099831, 107099652, 107085800, 107060790, 107038200, 107019222, 107002473, 106986976, 106974864, 106963587, 106948304, 106936800, 106933904, 106936419, 106937301, 106928563, 106915474, 106896532, 106861949, 106820810, 106783497, 106747472, 106705689, 106655335, 106604195, 106561434, 106525815, 106492662, 106463528, 106441879, 106428218, 106419921, 106417978, 106425679, 106439209, 106446826, 106441593, 106419480, 106375718, 106318247, 106257164, 106201947, 106172931, 106178761, 106201935, 106227815, 106250012, 106259632, 106259632, 106260204, 106262398, 106251049, 106209064, 106144059, 106075335, 106016982, 105991769, 106004775, 106008971, 105979371, 105967641, 106006372, 106048846, 106059086, 106053364, 106056607, 106065154, 106094813, 106167877, 106249022, 106328642, 106435347, 106565356, 106704223, 106847942, 106966650, 107018697, 107005143, 106965160, 106914365, 106867552, 106834376, 106809318, 106805789, 106830847, 106865966, 106893885, 106904435, 106885266]
2388.4A06885266m8423o1738o2096n4979m6850m5860m4620l5822l1221l3986m1771
2410.9A06377900n5182o2895o2156o3848o9392o2120l6395p796J6451L5667M9341O0356
2435.3A06119931O5744O4659N9128N4764N3776M8589M7207N0771M6063L5739K1827
2457.8A06668198P03j4758j9860l3069m9567n3334m2224k6774j9479j7774k2173k7728
2482.3A06342161j9765j657J0586J9443L2913M2403M8447N4872N6207N4252M6897K7347
2506.7A06714106Q785l862k2304m1163o0690q3076r5773j03486j13511j18399j10662
2529.2A05969965q8667o7664n1760k1446J1265J3280P761K8491M9960N2762N2286N6767
2553.6A06013000O5255P5400P9811P6377P1347O6781O1488N5707N1689M5418L3570
$$ y = [106885266, 106836843, 106775105, 106713009, 106658030, 106611180, 106565320, 106520700, 106484878, 106453657, 106419671, 106377900, 106322718, 106259823, 106197667, 106133819, 106064427, 106002307, 105965912, 105958116, 105974567, 106010234, 106059575, 106119931, 106185675, 106250334, 106309462, 106364226, 106418002, 106466591, 106513798, 106564569, 106610632, 106646371, 106668198, 106668901, 106654143, 106634283, 106601214, 106551647, 106498313, 106456089, 106429315, 106409836, 106392062, 106369889, 106342161, 106322396, 106320739, 106331325, 106350768, 106383681, 106426084, 106474531, 106529403, 106585610, 106639862, 106686759, 106714106, 106722891, 106719029, 106696725, 106655562, 106594872, 106511796, 106416023, 106312537, 106199026, 106080627, 105969965, 105881298, 105813634, 105761874, 105740428, 105751693, 105764973, 105772734, 105801225, 105851185, 105903947, 105956233, 106013000, 106078255, 106153655, 106233466, 106309843, 106381190, 106447971, 106509459, 106565166, 106616855, 106662273, 106695843]
2576.1A06695843J7965L385n150j7345l3724l8934k5224m828M172J1408K2340K2721
2600.5A06652629K1613L1006M0484M1473L7563M3106N7542N9104M3488K9194K5940
2623A07083142K2614J8465J6368N066j0383j4186r787m554M387Q774M756k467q261
2649.5A07113934k242L851k253r263j2541j1599r334j4496j9705k2924l1233l3497
2674A06948698k6226k1077q011J1063M602j2958j9074k3699k0444j5497k2614l2497
2698.4A06762266m0293m8852n8233o8355p5161p2432o6185o3252o1345o4147o4635
2720.9A06079376n9402n7054l6204k718J622j5438l1865m8756o9475r5165j21331j43636
2745.4A05399954j50931j37198j17206r8002p1359k9814L1245R6690J31131J33192
$$ y = [106695843, 106713808, 106717193, 106712043, 106694698, 106660974, 106622040, 106596816, 106591988, 106596160, 106607568, 106629908, 106652629, 106674242, 106705248, 106745732, 106787205, 106824768, 106867874, 106925416, 106984520, 107028008, 107057202, 107083142, 107105756, 107124221, 107140589, 107145655, 107135272, 107121086, 107111299, 107106745, 107111132, 107119906, 107124662, 107122195, 107113934, 107111692, 107115543, 107113290, 107104027, 107091486, 107079887, 107070553, 107056057, 107036352, 107013428, 106982195, 106948698, 106922472, 106901395, 106893384, 106904447, 106909049, 106896091, 106877017, 106853318, 106832874, 106817377, 106794763, 106762266, 106721973, 106673121, 106614888, 106546533, 106471372, 106398940, 106332755, 106269503, 106208158, 106144011, 106079376, 106019974, 105962920, 105926716, 105923998, 105925620, 105910182, 105878317, 105829561, 105760086, 105664921, 105543590, 105399954, 105249023, 105111825, 104994619, 104896617, 104825258, 104795444, 104826689, 104923379, 105054510, 105187702]
2765.7A05187702J26064J05953O0070K0003L1531N0569J6391l1936o2800j05297j48225
2788.2A05250025j52827j39951j54889j86527j84452j49489j32167j37281j46771j57106
2808.6A03708565j47378j38951j68025k19166k87450l76117m69005n42557n81718n82814
2829A00195384n33068m32509l16662k28470j71370j61910k57021m34029o10089p60800
2849.4I6289456r19652j111281j329851j586104j887017k197176k451808k524352k238583
2867.7H0043632j548481o33455K50596R24427J296103J359975J205867R52322P06112
2886.1H4557098N52595N02842M67211L48515J36310j51474m96107q18664j031971j131779
2906.5H2934576j170557j188612j200623j224929j289111j382423j430529j352096
$$ y = [105187702, 105313766, 105419719, 105479789, 105499792, 105531323, 105581892, 105598283, 105566347, 105503547, 105398250, 105250025, 105097198, 104957247, 104802358, 104615831, 104431379, 104281890, 104149723, 104012442, 103865671, 103708565, 103561187, 103422236, 103254211, 103035045, 102747595, 102371478, 101902473, 101359916, 100778198, 100195384, 99662316, 99229807, 98913145, 98684675, 98513305, 98351395, 98094374, 97660345, 97050256, 96289456, 95369804, 94258523, 92928672, 91342568, 89455551, 87258375, 84806567, 82282215, 80043632, 78495151, 77861696, 78112292, 79036719, 80332822, 81692797, 82898664, 83850986, 84557098, 85109693, 85612535, 86079746, 86428261, 86564571, 86413097, 85916990, 85098326, 84066355, 82934576, 81764019, 80575407, 79374784, 78149855, 76860744, 75478321, 74047792, 72695696]
2922.8G2695696j118904p46715k71672K32065O51180Q98403R81492R58610Q68886P43097
2943.2G5892138N88698L39138q9520o80578j330983j940680k386844k532953k307141
2961.5F5551275j734734r19735J8156R29647J668006K196211K531070K659797K606559
2979.9G5506252K426094K131516J732933J284790Q41409M73958K54977J69563K45703
2998.3H5067195M95457P95937J082879J313877J374102J288277J237237J260114J199651
3016.6I5114726R66877O17885J84262k55078o12712r19533j094025j011193o78033
3035I2313176k57140J3763J05154J06520O812j88255l81660m55636l77941j94383P4130
3057.4I0764540L72500O11531P70718Q75676R67270J049858J079005J048261R85754
$$ y = [72695696, 71576792, 70830077, 70558405, 70790470, 71441650, 72340053, 73321545, 74280155, 75149041, 75892138, 76480836, 76819974, 76730454, 76049876, 74718893, 72778213, 70391369, 67858416, 65551275, 63816541, 62896806, 62914962, 63844609, 65512615, 67708826, 70239896, 72899693, 75506252, 77932346, 80063862, 81796795, 83081585, 83922994, 84396952, 84651929, 84821492, 85067195, 85562652, 86358589, 87441468, 88755345, 90129447, 91417724, 92654961, 93915075, 95114726, 96081603, 96699488, 96883750, 96628672, 96015960, 95096427, 94002402, 92991209, 92313176, 92056036, 92069799, 92174953, 92281473, 92288285, 92100030, 91718370, 91262734, 90884793, 90690410, 90764540, 91137040, 91748571, 92519289, 93394965, 94362235, 95412093, 96491098, 97539359, 98525113]
3075.8I8525113R20015Q70443P87246O47724N07974L62862K11620R5928K4616J2422
3096.2A02965963P8797K24388L80075M23312L61621K99776K41411J24287j0907n7316
3116.6A05031407j6058N4145R8789R9444J06991J42479J86264K04635J69790J02436
3136.9A06180322P2789J05954J16896P0334K3460k4676o0487p665Q0371J05488R7525
3159.4A06760311Q5831O7341N8890M2974Q083j4639k0659k3389j8394q297q261j0276
3183.9A06919515m220q3J8751M6158M6969L9327M6611N9008O0594M2820K8134K9313
3208.3A07332897K5916J1921L255o080k2090k0909j3423k4819m9532q1026j29736j42181
3232.8A06884193m6026M1365J1790l5119m7493o9392n6350l242k885m1414m1556m279
$$ y = [98525113, 99445128, 100315571, 101102817, 101750541, 102258515, 102621377, 102832997, 102928925, 102953541, 102965963, 103044760, 103269148, 103649223, 104072535, 104434156, 104733932, 104975343, 105099630, 105088723, 105031407, 105015349, 105069494, 105168283, 105267727, 105374718, 105517197, 105703461, 105908096, 106077886, 106180322, 106253111, 106359065, 106475961, 106546295, 106569755, 106545079, 106484592, 106476927, 106557298, 106662786, 106760311, 106846142, 106913483, 106972373, 107015347, 107023430, 107008791, 106988132, 106964743, 106946349, 106938052, 106929791, 106919515, 106915295, 106915212, 106933963, 106980121, 107027090, 107066417, 107113028, 107172036, 107232630, 107275450, 107303584, 107332897, 107358813, 107370734, 107373989, 107367909, 107345819, 107324910, 107311487, 107286668, 107237136, 107156110, 107026374, 106884193, 106838167, 106879532, 106891322, 106856203, 106808710, 106739318, 106682968, 106679726, 106676841, 106635427, 106593871, 106589592]
3257.3A06589592P164k1482l7586m3535p5877r4617m6098J2160J8918O80j3173k0814
3281.8A06275332l4022m6659n9342q5843q2862m0734j5068j0657k1220o9749j22011
3304.2A05687165j02687k4056L0172J3745l9351n5588l3939l3354o8724r7168p7605
3326.6A05198610m0949m1604p0476r9838j14143r9420p1514n2500m3309p0834j28853
3349.1A04365170j23262o1167m6110p7486j03223j10686j15192j39511j55532j16503
3369.5A03316498o3133o9607j05464j08946r7024r1004j00077j18947j39665j72675
3389.9A02249956j63734r6190q3351j55103j81258j17183p0726r7955j28746j16861
3410.2A01038849j07777j09052j06645j27041j40524j16468j09124j32835j36590j22273
$$ y = [106589592, 106596756, 106575274, 106537688, 106494153, 106418276, 106323659, 106277561, 106289721, 106308639, 106309319, 106296146, 106275332, 106241310, 106194651, 106135309, 106049466, 105966604, 105925870, 105910802, 105900145, 105878925, 105809176, 105687165, 105584478, 105560422, 105590594, 105604339, 105564988, 105509400, 105475461, 105442107, 105373383, 105276215, 105198610, 105157661, 105116057, 105045581, 104945743, 104831600, 104732180, 104660666, 104608166, 104564857, 104494023, 104365170, 104241908, 104180741, 104134631, 104057145, 103953922, 103843236, 103728044, 103588533, 103433001, 103316498, 103253365, 103183758, 103078294, 102969348, 102872324, 102781320, 102681243, 102562296, 102422631, 102249956, 102086222, 101990032, 101906681, 101751578, 101570320, 101453137, 101382411, 101284456, 101155710, 101038849, 100931072, 100822020, 100715375, 100588334, 100447810, 100331342, 100222218, 100089383, 99952793, 99830520]
3430.6I9830520j25491j24860r2656o2775o2329q1468j05410j06037p6991o0028o7210
3453.1I8865265p6390q7821r0015o7657n1427o9124q0025m1103Q46r751l8338l9017
3477.6I8215443k3288o741m858k2250j8752J5986K3246p993k1440n817Q386K4820O0707
3504.1I8237449P8249O2799O7228R2179J00136R8550J01006R4861P9954R1093J31429
3526.5I9234933J63346J70011J44314J18661J36936J63728J44291R7847J00708J74510
3546.9A00649285K15340J87337J77849J81377J49178J12224J20663J34671R4855J01209
3567.3A02123988J99914K39980K03931J85394J87231J59955J26755J17373J28436J96553
3587.7A03869510K61306K22373J74177J83082J86324J70219J71995J64890J30892J11282
$$ y = [99830520, 99705029, 99580169, 99487513, 99424738, 99362409, 99280941, 99175531, 99069494, 98992503, 98932475, 98865265, 98788875, 98701054, 98611039, 98543382, 98491955, 98422831, 98342806, 98301703, 98302549, 98292798, 98254460, 98215443, 98192155, 98185414, 98180556, 98158306, 98139554, 98155540, 98178786, 98170793, 98149353, 98143536, 98151922, 98176742, 98237449, 98315698, 98378497, 98445725, 98537904, 98638040, 98736590, 98837596, 98932457, 99012411, 99103504, 99234933, 99398279, 99568290, 99712604, 99831265, 99968201, 100131929, 100276220, 100374067, 100474775, 100649285, 100864625, 101051962, 101229811, 101411188, 101560366, 101672590, 101793253, 101927924, 102022779, 102123988, 102323902, 102563882, 102767813, 102953207, 103140438, 103300393, 103427148, 103544521, 103672957, 103869510, 104130816, 104353189, 104527366, 104710448, 104896772, 105066991, 105238986, 105403876, 105534768, 105646050]
3608.1A05646050J17576J24288J28352J04142N9402P5149J14071P4912r692j6725R1862
3630.5A06509387J24419P8190O7925O5696M0686L1591J0919m9328m6921Q8358J54412
3653A07075334R2184M7135N4777O5720O6638M3988R656o783N353J0371J7083P3528
3677.4A07554984J13392J07551Q1527K3293l0744J4210R2101Q1182M8208M0567K7537
3699.9A08153808J2732K6369L1662k194l3045j3387L8529M9376J3340k1637m1210m3035
3724.3A08171308j1873J9979l087p3123j05059k7526O8426O1131o759l1996K837J2481
3748.8A08076739r06J860J6570J9968J4245Q106j2099k6524j5295n209J2958K9897
3773.3A08120310P391k1457j1897J7309K4318J9968J1754j526k062j896j2707j7083
$$ y = [105646050, 105763626, 105887914, 106016266, 106120408, 106179810, 106254959, 106369030, 106443942, 106434250, 106417525, 106509387, 106633806, 106711996, 106779921, 106845617, 106886303, 106917894, 106928813, 106879485, 106832564, 106920922, 107075334, 107167518, 107214653, 107269430, 107335150, 107401788, 107445776, 107455432, 107448649, 107454002, 107464373, 107481456, 107554984, 107668376, 107775927, 107857454, 107880747, 107850003, 107864213, 107956314, 108037496, 108085704, 108126271, 108153808, 108166540, 108192909, 108224571, 108222377, 108189332, 108175945, 108214474, 108263850, 108277190, 108255553, 108214343, 108171308, 108159435, 108179414, 108176327, 108103204, 107998145, 107970619, 108039045, 108100176, 108093417, 108061421, 108064258, 108076739, 108075833, 108077693, 108094263, 108114231, 108128476, 108136582, 108124483, 108097959, 108082664, 108077455, 108090413, 108120310, 108127701, 108106244, 108094347, 108111656, 108135974, 108155942, 108167696, 108166170, 108164108, 108162212, 108149505, 108132422]
3797.8A08132422q011j0669l624J7083j634k5737k5225k6750l0577k9540l2699j3710
3822.2A07941329K9767L7515J7810j168j8180l7169n7161m2617J4329M0972L5810L8374
3846.7A07999611K2614k3329n2321k2245L445j19o878k1398k3794j9324m0829m0412
3871.2A07775021J1158M3141J3364m4704n4812k4617l57K6452J4412n316K0480J0908
3895.7A07785130n4968q8417n3668o80L8219N5432N2953L4213r287m0185n162N1034
3920.1A07764614N7971K7812J4066K0206J6177J6034L5262L6096K468j2910m995j1969
3944.6A07960832k8777k7847j3805k2113l7682m5717m4811k7752j2147o247j4829l5989
3969.1A07643116m7625k5713O258P034M482K6083L4165J9944J6833J6582J7321K3031
$$ y = [108132422, 108124411, 108113742, 108110118, 108127201, 108125567, 108099830, 108074605, 108047855, 108017278, 107987738, 107955039, 107941329, 107971096, 108008611, 108026421, 108025253, 108007073, 107969904, 107912743, 107870126, 107884455, 107925427, 107961237, 107999611, 108022225, 107998896, 107946575, 107924330, 107927775, 107927656, 107920778, 107899380, 107875586, 107856262, 107815433, 107775021, 107786179, 107829320, 107842684, 107797980, 107743168, 107718551, 107718194, 107744646, 107759058, 107753742, 107774222, 107785130, 107730162, 107641745, 107588077, 107587397, 107625616, 107681048, 107734001, 107768214, 107758927, 107718742, 107713580, 107764614, 107822585, 107850397, 107864463, 107884669, 107900846, 107916880, 107952142, 107988238, 107990706, 107977796, 107972801, 107960832, 107932055, 107904208, 107890403, 107868290, 107830608, 107784891, 107740080, 107712328, 107700181, 107693934, 107679105, 107643116, 107595491, 107569778, 107576036, 107583070, 107587552, 107613635, 107647800, 107667744, 107684577, 107701159, 107718480, 107741511]
3993.6A07741511K5630L1340
3997.6A07798481
$$ y = [107741511, 107767141, 107798481]
##END=$$ End of the data block
