##TITLE=Amostra 2 ppt $$ Begin of the data block
##JCAMP-DX=5.00 $$ ACD/SpecManager v 10.08
##SPECTROMETER/DATA SYSTEM=Alpha
##DATE=22 Sep 2014 15:27:48
##DATA TYPE=INFRARED SPECTRUM
##DATA CLASS=XYDATA
##ORIGIN=
##OWNER=
##NPOINTS=1765
##FIRSTX=399.76428223
##LASTX=3997.64306641
##MAXX=3997.64306641
##MINX=399.76428223
##MAXY=0.82730645
##MINY=0.21558322
##XFACTOR=1.0000000000
##YFACTOR=1.000000000000000e-9
##FIRSTY=0.78490961
##DELTAX=2.03961372
##XUNITS=1/CM
##YUNITS=ARBITRARY UNITS
##XYDATA=(X++(Y..Y))
399.8G84909606k095699n63979J153290K53796n96225N18262O24955p80165j053810
418.1G82370031m74870j501441k735138k054513j091003k430082l614664j559555N05686
436.5G67414451k96891o73592Q45015J061976n52833q85487M62651N58317j034677
454.8G66898930j578867q35836j354873k956450k989352j735985j658023k540409k839029
473.2G48410106k939403l195227j724004J180410J537204j759052n427778q869648
489.5G27212608j5224576k1699846j6923368J047015J6590596J8989264J3814271Q840322
505.8G32646286M640639O45042q04007L88503J501202J735032K243519K482891J269162
524.2G46748269q7381K29299R28283J52409p18653O4075P80940j74046q13543J09136
$$ plain form
399.8 784909606 782813907 782249928 783403218 783657014 783060789 783579051 784204006 783423841 782370031
418.1 782370031 781895161 780393720 777658582 775604069 774513066 772082984 768468320 766908765 767414451
436.5 767414451 767117560 766443968 767288983 768350959 767798126 766912639 767375290 767933607 766898930
454.8 766898930 765320063 764484227 763129354 760172904 757183552 755447567 753789544 751249135 748410106
473.2 748410106 745470703 742275476 740551472 741731882 743269086 741510034 736082256 727212608
489.5 727212608 711988032 690288186 673364818 674411833 691002429 709991693 723805964 732646286
505.8 732646286 737286925 737931967 737127960 737516463 739017665 740752697 742996216 745479107 746748269
524.2 746748269 746660888 746890187 747818470 747970879 747252226 747316301 748097241 747923195 747109652 747218788
544.6G47218788L81946r72032j674772q83698p19488j892090k309858j452744j450599
562.9G36245453k487301k479434j653553k090275l214776l118217k609313l404021
579.3G15188563m667640m714310m540145n708456p234633q035124q771956r573579
595.6F61942720q909404p338047p929146j0483802j2010157j0532498k632439J1028051
611.9F13135278K0109177J8356085J1338591N707324L279507K626836J219511j149594
628.2F74622715k129853j146436p29144j738906k193570j845479k327382l076196j723647
646.6F57712102J530051M212856N742789P482350Q804321Q364916P177472O640017
662.9G07666874N731463M805088M849315M265845L455818K322673J312733J488745
$$ plain form
544.6 747218788 747600734 746628702 744953930 744070232 743350744 741458654 739148796 737696052 736245453
562.9 736245453 733758152 731278718 729625165 727534890 724320114 721201897 718592584 715188563
579.3 715188563 710520923 705806613 701266468 695558012 688323379 680288255 671516299 661942720
595.6 661942720 653033316 645695269 637766123 627282321 615272164 604739666 602107227 613135278
611.9 613135278 633244455 651600540 662939131 668646455 671925962 674552798 675772309 674622715
628.2 674622715 672492862 671346426 670617282 668878376 666684806 664839327 662511945 659435749 657712102
646.6 657712102 659242153 663455009 669197798 676680148 685484469 693849385 701026857 707666874
662.9 707666874 713398337 718203425 723052740 727318585 730774403 733097076 734409809 735898554
679.2G35898554J447082J96397p32422n70535j038730k849579m355431n010426o412148
697.5G16572762q790911j0603428j1886179j3536930j3941527j0471403l556311L390908
713.9F47176981P884264R816825R477318O355166J973212r92894l342450o165802l923715
732.2F68258905O852150J7237842J9013882J5251875J1234045P953525M992366L008782
748.5G53803372K688885K964258K350867J448214J521945J857579J373947R93132J680672
766.9G70682871K288521J760721J067340J133085J084089J15692r25898j360476j996994
785.3G73848951l429115n301118q541882j3176739j2426257k156914R425879J4395297
801.6G52638102J2620508P294595J972616k365470o214201r644807j3723433j9609212
$$ plain form
679.2 735898554 737345636 737542033 736809611 736239076 735200346 732350767 727995336 722984910 716572762
697.5 716572762 707781851 697178423 685292244 671755314 657813787 647342384 643786073 647176981
713.9 647176981 655061245 664878070 674355388 680710554 682683766 681690872 678348422 672182620 668258905
732.2 668258905 675111055 692348897 711362779 726614654 737848699 745802224 750794590 753803372
748.5 753803372 756492257 759456515 761807382 763255596 764777541 766635120 768009067 769002199 770682871
766.9 770682871 772971392 774732113 775799453 776932538 778016627 778132319 777206421 775845945 773848951
785.3 773848951 770419836 765118718 756576836 743400097 730973840 728816926 738242805 752638102
801.6 752638102 765258610 772553205 774525821 772160351 765946150 756301343 742577910 722968698
817.9G22968698k2393704j0943592J4090419L2277942L0859828J9915819J1223555
832.2G97998965O190836L285051K153456J934588J398206O35385N55217R48072P46608
850.5H15846384J96099K98679P18116M63963j08063j19627K4855n19454j579344k812207
870.9H12409401m938603p678449o754756P65682Q574843R351194N593896K792537J487672
889.3H21603417M04358k02775k4914P2360n21303j247048k125621l794968m302561
907.6H09860945k094388n16355k058626m434406m031420l39448K552688K633452K284765
926H03857207K177596J255751k1577o74724r79543j640558k312303k087772j268864
944.3G98305213j208305k169192l293872m442274n811215o261170m406154j080334
$$ plain form
817.9 722968698 700574994 689631402 703721821 735999763 766859591 786775410 797998965
832.2 797998965 804189801 807474852 809628308 811562896 812961102 813596487 814151704 815099776 815846384
850.5 815846384 816042483 816341162 817059278 817523241 817415178 817295551 817320406 816800952 815221608 812409401
870.9 812409401 807470798 799792349 793037593 793803275 802378118 811729312 817323208 820115745 821603417
889.3 821603417 822007775 821805000 821780086 821852446 821331143 820084095 817958474 814163506 809860945
907.6 809860945 807766557 807250202 805191576 800757170 796725750 796386302 798938990 801572442 803857207
926 803857207 806034803 807290554 807268977 806594253 805614710 803974152 801661849 799574077 798305213
944.3 798305213 797096908 794927716 791633844 787191570 781380355 775119185 770713031 769632697
960.7G69632697P44522j292944n736530n896270K109348J0663510J1645555P196307
977G89066195K462149n35726j923979k684176l519237m249036m332244l575266k104878
995.3G68603802k52486R65775M15205j655340m083097o188988p651925p213772l373861
1013.7G39565313K414226O430984P121682N687714L607452J502931n45025k479375
1030G63305902m325389o236375q042156q783222p031142k549947J972616L320992J347303
1048.4G32978582k271533n681276p071078o828010o544351l862799L702283J1353851
1064.7G15775669J3052404R537220N554318L916144L775001L194928J744807m17j866281
1083G54683793l782034m742027l309488K22743L482461M596769L744066K068877N83530
$$ plain form
960.7 769632697 770377219 769084275 763347745 757451475 759560823 770224333 781869888 789066195
977 789066195 791528344 790992618 789068639 786384463 782865226 778616190 774283946 770708680 768603802
995.3 768603802 768351316 769317091 769732296 768076956 763993859 757804871 750152946 742939174 739565313
1013.7 739565313 741979539 748410523 755532205 761219919 764827371 766330302 765785277 763305902
1030 763305902 758980513 752744138 744701982 735918760 728887618 726337671 728310287 731631279 732978582
1048.4 732978582 730707049 725025773 717954695 711126685 704582334 700719535 704421818 715775669
1064.7 715775669 728828073 738365293 743919611 747835755 751610756 754805684 756550491 756550074 754683793
1083 754683793 750901759 746159732 742850244 743072987 746555448 751152217 754896283 756965160 757548690
1101.4G57548690p4268j2159J6511l04282n14567m77910q33988j678109j749397l95238
1121.8G51525283P95781L76642p47442j544535k519965m024685n560279p052123q106530
1140.1G23142147o291270q45134M009962M523098K096653k08020r78410m3333J526117
1158.5G26931810K242029J801014P14481m42505j285970k032936k935231l648340l718317
1176.9G17626035l092050j701653Q11457L868699N572677M882753K912462J101970
1193.2G31982350l09169j663685l067493m405678m816353l401518j889288k329588
1209.5G10099578l670633l790140j906097N60999J015663m20630r38356p54356k619207
1227.9F97576821o023228q285284q141280n280733l72529L883660M720628K348066
$$ plain form
1101.4 757548690 757474422 757462263 757478774 757174492 756659925 756182015 755348027 753669918 751920521 751525283
1121.8 751525283 752321064 752697706 751950264 750405729 747885764 743861079 738300800 731248677 723142147
1140.1 723142147 716850877 716005743 720015705 724538803 726635456 726427436 725449026 725405693 726931810
1158.5 726931810 729173839 730974853 731689334 731246829 729960859 727927923 724992692 721344352 717626035
1176.9 717626035 714533985 712832332 713643789 717512488 723085165 727967918 730880380 731982350
1193.2 731982350 731673181 730009496 726942003 722536325 717719972 714318454 712429166 710099578
1209.5 710099578 706428945 702638805 700732708 701293707 702309370 701888740 700950384 700196028 697576821
1227.9 697576821 691553593 683268309 675127029 669846296 669473767 673357427 678078055 680426121
1244.2F80426121q65877l247142m668176n826592p146895q234382q554518p804454
1260.5F34078085o102085n241632p111013j1162996j5262962j6060650j1229217n393744
1276.8E56513786o872832j4812947j6146362k870261J1474669J0722100Q11935n009532
1293.1E33810556m564941j924276n48065j298726l106951m762173n403698m868745
1309.4E07332981m762948o361633p945687o985098k103597O497204J5709937K1197378
1325.8E22578537K0856679J6163111J0008394M260898k68400l026902m026831m719674
1342.1E61825812o557346q713305r452044q547485p177174p158876r520769j1848986
1358.4D92849827r855986l062337K167850R85116k439469m222274n859852o854713
$$ plain form
1244.2 680426121 679560244 676313102 671644926 665818334 658671439 650437057 641882539 634078085
1260.5 634078085 627976000 622734368 615623355 604460359 589197397 573136747 561907530 556513786
1276.8 556513786 549640954 534828007 518681645 515811384 527286053 538008153 538820088 533810556
1293.1 533810556 529245615 527321339 526773274 525474548 522367597 517605424 512201726 507332981
1309.4 507332981 502570033 496208400 488262713 481277615 479174018 485671222 501381159 522578537
1325.8 522578537 543435216 559598327 569606721 573867619 573599219 570572317 566545486 561825812
1342.1 561825812 555268466 546555161 537103117 528555632 521378458 514219582 504698813 492849827
1358.4 492849827 482993841 479931504 482099354 483084470 480645001 476422727 470562875 463708162
1374.7D63708162j527071Q730799J3622344P452726m383921j6002179k3567468k3108720
1391D24924672j6974479p693202K623111J1565030J6723901J7539740J6256660J2423217
1407.3D77388650P680893L249675j342326n558998r487897j2859821j2273759j0779261
1423.7D36017156j1473745j3200492j5759200j6544342j3961911j0008574o581455
1437.9C48487437o679416o775021l229887l459304j1083156j4281810q089453P24376
1454.3B95613766J0082125J7321766J6266763J5007198J6328096J4067829O213158
1468.5C90900701l047734j1666596j0800690q86499Q145958J6997963K3528516K1880686
1484.9D35052305J4603287O175191j62393r00477L106504R163827J3001412J2817949
$$ plain form
1374.7 463708162 462181091 470911890 484534234 491986960 487603039 471600860 448033392 424924672
1391 424924672 407950193 400256991 402880102 414445132 431169033 448708773 464965433 477388650
1407.3 477388650 485069543 488319218 486976892 481417894 471929997 459070176 446796417 436017156
1423.7 436017156 424543411 411342919 395583719 379039377 365077466 355068892 348487437
1437.9 348487437 341808021 335033000 331803113 328343809 317260653 302978843 294889390 295613766
1454.3 295613766 305695891 323017657 339284420 354291618 370619714 384687543 390900701
1468.5 390900701 387852967 376186371 365385681 364499182 372645140 389643103 413171619 435052305
1484.9 435052305 449655592 455830783 455668390 454767913 457874417 467038244 480039656 492857605
1501.2D92857605J1058897J0160744Q551061K894819j140952l228545n390167p539392
1517.5E08224070r528905j2741447j4555037j4744132j5953392j5648127j5727222
1531.8D09325808j7684936j6204536j4231503j7308504j7761617j4412046j3410360
1546B98312306j3434648j4096588j3822079j2430325j0274529r030342p022992k617583
1562.4B15583220K38851K335518M950807P592052Q299813R978518J4005825J4306813
1578.7B77291417J3472438J5076458J6510874J7262042J7635047J7634303J7062425
1593C91945004J5939922J4168501J2019604R701848O919324L772825P64877j699060
1609.3D53532845k880246k993047m312783p692010r304642j0112196j2729228j4464200
$$ plain form
1501.2 492857605 503916502 514077246 522628307 525523126 524382174 521153629 515763462 508224070
1517.5 508224070 498695165 485953718 471398681 456654549 440701157 425053030 409325808
1531.8 409325808 391640872 375436336 361204833 343896329 326134712 311722666 298312306
1546 298312306 284877658 270781070 256958991 244528666 234254137 225223795 218200803 215583220
1562.4 215583220 215822071 218157589 223108396 230700448 239000261 248978779 262984604 277291417
1578.7 277291417 290763855 305840313 322351187 339613229 357248276 374882579 391945004
1593 391945004 407884926 422053427 434073031 443774879 450694203 454467028 455231905 453532845
1609.3 453532845 450652599 447659552 443346769 435654759 426350117 416237921 403508693 389044493
1625.6C89044493j5419215j5663713j2966722r747088p644623m938841k997756k758026
1641.9C16908509l019065k671480k65777L459066J0505587J8938481J5254349J2438297
1658.2C71547967J3920278J6077667J6497165J4809221J5890837J7911643J6430586
1672.5D83085364J7231256J9219398J7965377J7294466J9079268K1840215J7431140
1686.8F13146484J2876868J2028337J0344743J0013700R924352R267509R666681P710040
1703.1F94978714O357431O256164N258023M902303N077005N073368M726351L560245
1719.4G36189604K781629K672017K616823K583205K819539K757608K721608K404749
1735.7G57546782K189339K542674K500832K437651K616048K570987K253473K100348
$$ plain form
1625.6 389044493 373625278 357961565 344994843 335247755 327603132 322664291 319666535 316908509
1641.9 316908509 313889444 311217964 310952187 314411253 324916840 343855321 359109670 371547967
1658.2 371547967 385468245 401545912 418043077 432852298 448743135 466654778 483085364
1672.5 483085364 500316620 519536018 537501395 554795861 573875129 595715344 613146484
1686.8 613146484 626023352 638051689 648396432 658410132 668334484 677601993 687268674 694978714
1703.1 694978714 701336145 707592309 712850332 717752635 722829640 727903008 732629359 736189604
1719.4 736189604 738971233 741643250 744260073 746843278 749662817 752420425 755142033 757546782
1735.7 757546782 759736121 762278795 764779627 767217278 769833326 772404313 774657786 776758134
1752G76758134K119601K279461K311766K430081K605438K096355J816511K144516K373815
1770.4G96935678J957833J203895J063883J382113J285493R54032J024127J149237
1786.7H06956291J078010J066923J099646Q24392N87702O54518R04262Q57950N54084
1805.1H14583778N42224Q41737Q67486M31060L10898N87285O72996M53830M45068O35266
1825.5H20371628N85258K40147o5804Q7023K59996J29401J40906N08129N38409m5121
1845.9H22749972k65181N2333J92583M0054P1645K72035K45274O3717J86741N25892
1866.3H24135065M86016N901r9718J97351K53796R4950J12594K67803K19703P5340
1886.7H25748801J17660J90615J33992O8843J35660K86579K57731N2512L5762J73629
$$ plain form
1752 776758134 778877735 781157196 783468962 785899043 788504481 790600836 792417347 794561863 796935678
1770.4 796935678 798893511 800097406 801161289 802543402 803828895 804782927 805807054 806956291
1786.7 806956291 808034301 809101224 810200870 811025262 811612964 812267482 813171744 814029694 814583778
1805.1 814583778 815126002 815967739 816835225 817266285 817577183 818164468 818837464 819291294 819736362 820371628
1825.5 820371628 820956886 821197033 821131229 821218252 821478248 821607649 821748555 822256684 822795093 822749972
1845.9 822749972 822484791 822537124 822729707 822769761 822841406 823113441 823358715 823422432 823609173 824135065
1866.3 824135065 824621081 824626982 824527264 824724615 824978411 825073361 825185955 825453758 825673461 825748801
1886.7 825748801 825866461 826057076 826191068 826259911 826395571 826682150 826939881 826992393 827028155 827201784
1907.1H27201784J04665j43647j81496N5552J15752j46628k12788o1035j35899k74837
1927.5H26321423j48594P3015M6075j52409j43469K3961l6716l28541l96550k50756
1947.9H25007439k70903l73722k82108j66715l08990m86493m26829k77281l20494m63247
1968.3H21630657m10915k66432l21269m77851m50551l94166n49793p02024n90861m64797
1988.7H17001998o12676q48353q52227p66039q73923j002252r54688q62777r21249
2007H09307814r94265q91030p73251q22425q87513p96855p22527q04842q89122q16524
2027.4H00909460p56443q32558q67843p16865n50092n86152o80148o70076o92248q64744
2047.8G93692291r97842r92596j023292j170755j241266j119197j013398j100540j242578
$$ plain form
1907.1 827201784 827306449 827162802 826981306 827036858 827152610 827005982 826793194 826732159 826596260 826321423
1927.5 826321423 826172829 826245844 826291919 826139510 825996041 826020002 825983286 825654745 825258195 825007439
1947.9 825007439 824736536 824362814 824080706 823913991 823605001 823118508 822691679 822414398 822093904 821630657
1968.3 821630657 821219742 820953310 820632041 820154190 819703639 819309473 818759680 818057656 817466795 817001998
1988.7 817001998 816389322 815540969 814688742 813922703 813048780 812046528 811091840 810229063 809307814
2007 809307814 808313549 807422519 806649268 805826843 804939330 804142475 803419948 802615106 801725984 800909460
2027.4 800909460 800153017 799320459 798452616 797735751 797185659 796599507 795919359 795249283 794557035 793692291
2047.8 793692291 792694449 791701853 790678561 789507806 788266540 787147343 786133945 785033405 783790827
2066.2G83790827j233399j199901j276672j323223j227796j153529j234829j316607
2082.5G73824871j276553j270115j408756j484633j383722j307368j387119j426339
2098.8G62880266j303256j204967j257122j294494j173436j101077j221955j304209
2115.1G53019750j192689j121580j237154j308620j174808j065433j126170j107395
2131.4G43685901q86440o73056n95212m47452j30892R7394J67251L35753O41882Q31962
2151.8G43027091Q24153Q72016J105190J274764J279652J357854J573801J655996J560151
2170.2G54530668J584113J745462J731813J509190J406252J481235J401723J162827
2186.5G66553283J138091J284718J214266R90331R92775J122237R90450P15136O58572
$$ plain form
2066.2 783790827 782557428 781357527 780080855 778757632 777529836 776376307 775141478 773824871
2082.5 773824871 772548318 771278203 769869447 768384814 767001092 765693724 764306605 762880266
2098.8 762880266 761577010 760372043 759114921 757820427 756646991 755545914 754323959 753019750
2115.1 753019750 751827061 750705481 749468327 748159707 746984899 745919466 744793296 743685901
2131.4 743685901 742799461 742126405 741531193 741083741 740952849 741050243 741217494 741553247 742195129 743027091
2151.8 743027091 743851244 744723260 745828450 747103214 748382866 749740720 751314521 752970517 754530668
2170.2 754530668 756114781 757860243 759592056 761101246 762507498 763988733 765390456 766553283
2186.5 766553283 767691374 768976092 770190358 771180689 772173464 773295701 774286151 775001287 775659859
2204.8G75659859P01368N39303L30746L73185M71949L21627J31965J90615K67089P4923
2225.2G79062629j49727j03057L159j11937k34008j17600k265j37090k80977k16841
2245.6G77712286j75298l33488m67300m10617l68595m79459n69761n09560m90725o41227
2266G73266256p09295n78165n21183o54519p11739n75364m57883m82440n12480m80533
2286.4G67582655n24759o98388q18610p61509p47025q75235q94069p64907p63118r31919
2306.8G59803116j012563r12607q40724r37283j023113r93848r67384j006603r99570
2325.2G51109421r18746r39131j060307j044392r33409j008630j205444j235306j056731
2343.5G41707325r19879j033067j297713j539409j681983j700521j527428j190782
$$ plain form
2204.8 775659859 776361227 776900530 777231276 777604461 778076410 778398037 778530002 778720617 778987706 779062629
2225.2 779062629 778912902 778809845 778813004 778701067 778467059 778349459 778347194 778210104 777929127 777712286
2245.6 777712286 777536988 777203500 776736200 776325583 775956988 775477529 774907768 774398208 773907483 773266256
2266 773266256 772556961 771978796 771457613 770803094 770091355 769515991 769058108 768575668 768063188 767582655
2286.4 767582655 767057896 766359508 765540898 764779389 764032364 763157129 762263060 761498153 760735035 759803116
2306.8 759803116 758790553 757877946 757037222 756099939 755076826 754082978 753115594 752108991 751109421
2325.2 751109421 750190675 749251544 748191237 747146845 746213436 745204806 743999362 742764056 741707325
2343.5 741707325 740787446 739754379 738456666 736917257 735235274 733534753 732007325 730816543
2359.9G30816543r66668r69827r20534p57337p06196p75397q11636q43823r84430j132667
2380.2G21948028j181305j199245j298130j426697j444459j367867j329600j332105
2396.6G11368620j298844j255989j285494j369417j381576j349628j388073j457572
2412.9G00582027j455783j407147j426637j509547j546979j526416j561760j666427
2429.2F88481331j721621j736164j823306j927972j928389j844406j782536j786352
2445.5F73930585j770734j730442j768232j871705j950502j999200k072155k154708
2461.8F58612907k142787k033889j969695j935363j790166j578629j423419j312315
2478.1F44426644j189947j089037j073599j101136j052916r39488r17197r85145r91106
$$ plain form
2359.9 730816543 729849875 728880048 727959514 727202177 726495981 725720584 724908948 724065125 723080695 721948028
2380.2 721948028 720766723 719567478 718269348 716842651 715398192 714030325 712700725 711368620
2396.6 711368620 710069776 708813787 707528293 706158876 704777300 703427672 702039599 700582027
2412.9 700582027 699126244 697719097 696292460 694782913 693235934 691709518 690147758 688481331
2429.2 688481331 686759710 685023546 683200240 681272268 679343879 677499473 675716937 673930585
2445.5 673930585 672159851 670429409 668661177 666789472 664838970 662839770 660767615 658612907
2461.8 658612907 656470120 654436231 652466536 650531173 648741007 647162378 645738959 644426644
2478.1 644426644 643236697 642147660 641074061 639972925 638920009 637980521 637063324 636078179 635087073
2496.5F35087073r72033j072228j252055j349330j369416j443983j535654j543164
2512.8F24549210j513660j530528j534045j420080j253486j173019j142025j068891
2529.1F13913476j033604j098334j146198j079023r74595r48012r51707r06766q75652
2547.5F04899585r47177j073063j153707j230240j367927j479804j481891j421869
2563.8E94743907j347184j215815r96113p69496o11842m48704k08973q881O5505J70231
2584.2E89372635M04239N78999N81622N64516O00338N82158M98712M77255N52475N83411
2604.6E94796360M77671L37660K69056J90258M3034m5895o5267k04981m82857o92606
2625E94622433p64727q27730q76725p86602o25789n57304n58436n03838m38511m94778
$$ plain form
2496.5 635087073 634115040 633042812 631790757 630441427 629072011 627628028 626092374 624549210
2512.8 624549210 623035550 621505022 619970977 618550897 617297411 616124392 614982367 613913476
2529.1 613913476 612879872 611781538 610635340 609556317 608581722 607633710 606682003 605775237 604899585
2547.5 604899585 603952408 602879345 601725638 600495398 599127471 597647667 596165776 594743907
2563.8 594743907 593396723 592180908 591184795 590415299 589803457 589354753 589145780 589136899 589202404 589372635
2584.2 589372635 589776874 590355873 590937495 591502011 592102349 592684507 593183219 593660474 594212949 594796360
2604.6 594796360 595274031 595611691 595880747 596071005 596114039 596068144 596002877 595797896 595315039 594622433
2625 594622433 593857706 593029976 592153251 591366649 590740860 590183556 589625120 589121282 588682771 588187993
2645.4E88187993o14346o48975o08027n67078m92812l64422k78473k97010l83079m50433
2665.8E83483338m56094m50492l95358k26676k3246J09196K09212L60250M99547N58734
2686.2E83668411N99503O90997P40349O51419M87984L06248Q4997j71662m09484o03318
2706.6E86045444p91490j030743j280546j493156j720667j960993k147257k258599
2722.9E73361993k280832k206742k033651j794875j587391j434982j336157j347244
2739.2E59340119j466930j631081j765191j812279j792014j758576j706004j633882
2755.5E45774162j597226j593649j555324j477778j390040j285732j148939r82105
2771.8E34743369q06690o51538n03063l42429k31922k04682j91688j57118j84834l28005
$$ plain form
2645.4 588187993 587573647 586924672 586316645 585749567 585256755 584892333 584613860 584316850 583933771 583483338
2665.8 583483338 583027244 582576752 582181394 581954718 581931472 582040668 582249880 582610130 583109677 583668411
2686.2 583668411 584267914 584958911 585699260 586350679 586838663 587144911 587229908 587058246 586648762 586045444
2706.6 586045444 585253954 584223211 582942665 581449509 579728842 577767849 575620592 573361993
2722.9 573361993 571081161 568874419 566840768 565045893 563458502 562023520 560687363 559340119
2739.2 559340119 557873189 556242108 554476917 552664638 550872624 549114048 547408044 545774162
2755.5 545774162 544176936 542583287 541027963 539550185 538160145 536874413 535725474 534743369
2771.8 534743369 533936679 533285141 532782078 532439649 532207727 532003045 531811357 531654239 531469405 531141400
2792.2E31141400n28335p29621r28223j121163j249969j261115j174510j071811j018345
2810.6E22058308j002133j017749j131833j373291j694858k092778k603591l204822
2826.9E07937253l861368m607707n483240o553382p933229r700239j1849075j4179975
2843.2D43769038j6239494j7538011j7713041j6311705j2841642p236748r6590O942243
2859.5C62734050J1507213J2444377J0831624Q631766P264256P047117P196426O715387
2875.9D34372216N343169L509909J817793N71877l66032j256228k195328l048838l601044
2894.2D35147494l890395m238486m846484n513042n964637o249696o544083o881684
2910.5C91018987p136762p022649o456346n980700n933940o017924o253421o763250
$$ plain form
2792.2 531141400 530613065 529883444 528955221 527834058 526584089 525322974 524148464 523076653 522058308
2810.6 522058308 521056175 520038426 518906593 517533302 515838444 513745666 511142075 507937253
2826.9 507937253 504075885 499468178 493984938 487431556 479498327 469798088 457949013 443769038
2843.2 443769038 427529544 409991533 392278492 375966787 363125145 355888397 355791807 362734050
2859.5 362734050 374241263 386685640 397517264 406149030 413413286 420460403 427656829 434372216
2875.9 434372216 439715385 443225294 445043087 445614964 445248932 443992704 441797376 438748538 435147494
2894.2 435147494 431257099 427018613 422172129 416659087 410694450 404444754 397900671 391018987
2910.5 391018987 383882225 376859576 370403230 364422530 358488590 352470666 346217245 339453995
2926.8C39453995p214546p319927p000983o056696m149526j308114K066761N855591
2943.2C14326555R984642J3501018J4963120J4185340J2320399J0128140P895887O272525
2959.5D03577626N711287N854368O022901N891323N499363M938960M233747L449858
2975.8D45179433K849638K823293L427238L994882L789663K929032K028256J404316
2992.1D68425751J043409Q42154P30097P35313Q04484P94053P69704Q39413R05066
3010.5D75889444Q56102P73132P73996Q19087Q41141Q70287R13322R11295Q87663Q91387
3030.9D84426856Q92192Q13157O55680N79179N70208M42892K64168K35349L34024L65377
3051.3D89579082L23027L36766L28869K42799K13206L12924M71682N99921P25925Q91119
$$ plain form
2926.8 339453995 332239449 324919522 317918539 311861843 307712317 306404203 308470964 314326555
2943.2 314326555 324311197 337812215 352775335 366960675 379281074 389409214 397305101 403577626
2959.5 403577626 409288913 415143281 421166182 427057505 432556868 437495828 441729575 445179433
2975.8 445179433 448029071 450852364 454279602 458274484 462064147 464993179 467021435 468425751
2992.1 468425751 469469160 470311314 471041411 471776724 472581208 473375261 474144965 474984378 475889444
3010.5 475889444 476745546 477518678 478292674 479111761 479952902 480823189 481736511 482647806 483535469 484426856
3030.9 484426856 485319048 486132205 486787885 487367064 487937272 488380164 488644332 488879681 489213705 489579082
3051.3 489579082 489902109 490238875 490567744 490810543 491023749 491336673 491808355 492408276 493134201 494025320
3071.7D94025320J037419J167476J345098J536161J680016J788557J912772K067805
3088E06560624K228021K363444K495229K640962K709568K732337K814829K895892K938509
3106.3E30379415K966642K962172K929747K886891K843619K831042K879321K900124
3122.6E53578973K769470K553403K410710K344370K239883K068222J900673J809477
3139E71675181J772702J692355J555443J379132J157582J016617J041829J032829Q56400
3157.3E83180070O75440N76794M60625K93076J38461M0055m3214j67429l03865l91125
3177.7E84458888m82023o15478o84201o87600p18891p90239q47160q30055q16107q65638
3198.1E77121496q52763p64072p43211p69853p46608p19249p70867q61347r07957r39906
$$ plain form
3071.7 494025320 495062739 496230215 497575313 499111474 500791490 502580047 504492819 506560624
3088 506560624 508788645 511152089 513647318 516288280 518997848 521730185 524545014 527440906 530379415
3106.3 530379415 533346057 536308229 539237976 542124867 544968486 547799528 550678849 553578973
3122.6 553578973 556348443 558901846 561312556 563656926 565896809 567965031 569865704 571675181
3139 571675181 573447883 575140238 576695681 578074813 579232395 580249012 581290841 582323670 583180070
3157.3 583180070 583855510 584432304 584892929 585186005 585324466 585364521 585321307 585153878 584850013 584458888
3177.7 584458888 583976865 583361387 582677186 581989586 581270695 580480456 579633296 578803241 577987134 577121496
3198.1 577121496 576268733 575504661 574761450 573991597 573244989 572525740 571754873 570893526 569985569 569045663
3218.5E69045663j058996j228154j333475j433789j604021j743197j782179j834095
3234.8E57027757j970410k082646k102375k106071k146422k172053k150953k097726
3251.1E40199101k073169k077877k035082j988530j983881j952231j915514j941443
3267.5E24231374j954615j871407j739442j664460j675665j675785j652181j691401
3283.8E10306418j754165j825809j964092k176047k515852l000856l574252m289567
3300.1D89205778n154580n876750o060421n393446l865629k095074r38177q60810j843602
3318.4D57117289l585607n711585p912427j0146022j2564301j5148133j7409593j8031538
3334.8C66608083j5496105r585142j810849N694002J1481136J5169979J6855239J6786337
$$ plain form
3218.5 569045663 567986667 566758513 565425038 563991249 562387228 560644031 558861852 557027757
3234.8 557027757 555057347 552974701 550872326 548766255 546619833 544447780 542296827 540199101
3251.1 540199101 538125932 536048055 534012973 532024443 530040562 528088331 526172817 524231374
3267.5 524231374 522276759 520405352 518665910 517001450 515325785 513650000 511997819 510306418
3283.8 510306418 508552253 506726444 504762352 502586305 500070453 497069597 493495345 489205778
3300.1 489205778 484051198 478174448 472114027 466720581 462854952 460759878 459821701 458960891 457117289
3318.4 457117289 453531682 447820097 439907670 429761648 417197347 402049214 384639621 366608083
3334.8 366608083 351111978 341526836 339715987 345409989 356891125 372061104 388916343 405702680
3351.1D05702680J5616447J4054209J2448758J0863990R343951Q014441O908476N898387
3367.4D88851339M911214M035890L424823L058076K736688K396404K091885J884818
3383.7E13391137J754701J705170J715243J520157J170814J061916J194775J213849
3400E24727762R46283O98686P53581Q89361R09865Q47340P47204P16388Q26716R29892
3420.4E32993078R27568R66131J108885J198948J102209J065552J187682J109660Q56399
3438.8E42516112Q61407J124918J343966J435101J384377J346588J462639J634359
3455.1E53109467J790285J895309J886725J891792K073943K195478J944125J613259
3471.4E68400383J684785J944303K096415K123356J987636J905680K000928K029717
$$ plain form
3351.1 405702680 421319127 435373336 447822094 458686084 468030035 476044476 482952952 488851339
3367.4 488851339 493762553 497798443 501223266 504281342 507018030 509414434 511506319 513391137
3383.7 513391137 515145838 516851008 518566251 520086408 521257222 522319138 523513913 524727762
3400 524727762 525674045 526372731 527126312 528015673 528925538 529772878 530520082 531236470 532063186 532993078
3420.4 532993078 533920646 534886777 535995662 537194610 538296819 539362371 540550053 541659713 542516112
3438.8 542516112 543377519 544502437 545846403 547281504 548665881 550012469 551475108 553109467
3455.1 553109467 554899752 556795061 558681786 560573578 562647521 564842999 566787124 568400383
3471.4 568400383 570085168 572029471 574125886 576249242 578236878 580142558 582143486 584173203
3487.7E84173203J998305K076983K173782K231776K229870K254426K332688K199232
3504F01670265K041042K207518K418756K483010K452076K375185K395273K533257K706587
3522.4F23282969K673507K511322K532363K597809K574921K688765K847433K781391
3538.7F44490480K790571K991199L018975K705336K472997K647400K830028K779722
3555F66726708K802015K954423L004492K946198L060996L340364L179311K778411K801895
3573.4F93594813L089965L264963L335417L359139L404319L573477L578544L210306
3589.7G20410943L018081L230036L383636L334939L249884L122926L029406L132880
3606G45912731L342151L240109K961933K791167K656519K769888K762079K254009K014637
$$ plain form
3487.7 584173203 586171508 588248491 590422273 592654049 594883919 597138345 599471033 601670265
3504 601670265 603711307 605918825 608337581 610820591 613272667 615647852 618043125 620576382 623282969
3522.4 623282969 625956476 628467798 631000161 633597970 636172891 638861656 641709089 644490480
3538.7 644490480 647281051 650272250 653291225 655996561 658469558 661116958 663946986 666726708
3555 666726708 669528723 672483146 675487638 678433836 681494832 684835196 688014507 690792918 693594813
3573.4 693594813 696684778 699949741 703285158 706644297 710048616 713622093 717200637 720410943
3589.7 720410943 723429024 726659060 730042696 733377635 736627519 739750445 742779851 745912731
3606 745912731 749254882 752494991 755456924 758248091 760904610 763674498 766436577 768690586 770705223
3624.4G70705223K343178K812624K420485J659095J629591J735449J717210J730144
3640.7G86752999J684546J762271K145827K298713J368105M82619O90877J109541R44555
3659G99240053O53863N74350O84500R67502J161218R00805P01845P63178L05235Q166
3679.4H05960715L05176O41286J054525J583934J336873L07917K623L15011N40614
3697.8H12048674O14881N44965L08752K96355O27696Q61764N22316j27852k91586p391
3718.2H15398574K74420L16500J64211n901K6226L70860P57695P37071K69115k00212
3738.6H18108559k08080K46882N36025K57075K78234L62694k18987n05328j45853J43767
3759H18854988L5822l2485J04189J69158J42634l6001k40862r9302K76208L05355r6560
$$ plain form
3624.4 770705223 773048401 775861025 778281510 779940605 781570196 783305645 785022855 786752999
3640.7 786752999 788437545 790199816 792345643 794644356 796012461 796495080 797185957 798295498 799240053
3659 799240053 799893916 800468266 801152766 802120268 803281486 804182291 804884136 805647314 805952549 805960715
3679.4 805960715 806265891 806907177 807961702 809545636 810882509 811190426 811193049 811508060 812048674
3697.8 812048674 812663555 813208520 813517272 813813627 814441323 815303087 815825403 815697551 815405965 815398574
3718.2 815398574 815672994 815989494 816153705 816147804 816174030 816544890 817302585 818039656 818308771 818108559
3738.6 818108559 817900479 818147361 818683386 818940461 819218695 819581389 819362402 818857074 818711221 818854988
3759 818854988 818890810 818858325 818962514 819131672 819274306 819238305 818997443 818898141 819174349 819479704 819383144
3781.4H19383144k23577o2823j2278J0728P5579J57595K48909K49624L04818K79725
3801.8H20411444o5387j36911j12951k85507j59323J90318L40402K29716J21296j88053
3822.2H20345044m25756j75595N8114J15812J84834K63274K92599R8646j68801k27451
3842.6H20360720k73645l30508j21533L40342O40512P2658n68450m50313r2924J36197
3863H19713056Q8453l7789N9605Q4936j24752k23339r4414J72377K03252L7014l2603
3885.4H19845796k02418j46389N5909j34825k64168Q762K83122K12788j22785m44889
3905.8H19090903n00262k91347m6134Q5413R9361o914j27852j02818l5525j06275j87337
3928.3H17871213j03951k3901r9182j59145j18613m7505l4988j09613j05857o4433
$$ plain form
3781.4 819383144 819159567 819096744 819084466 819095194 819170773 819328368 819577277 819826901 820131719 820411444
3801.8 820411444 820346057 820209146 820096195 819810688 819651365 819841683 820182085 820411801 820533097 820345044
3822.2 820345044 819919288 819743693 819801807 819917619 820102453 820365727 820658326 820756972 820588171 820360720
3842.6 820360720 820087075 819756567 819635034 819975376 820615888 820688546 820120096 819669783 819576859 819713056
3863 819713056 819801509 819763720 819823325 819908261 819783509 819560170 819465756 819638133 819841385 819878399 819845796
3885.4 819845796 819643378 819496989 819552898 819418073 819153905 819162667 819445789 819658577 819535792 819090903
3905.8 819090903 818590641 818299294 818253160 818338573 818437934 818431020 818303168 818200350 818164825 818058550 817871213
3928.3 817871213 817767262 817743361 817644179 817485034 817366421 817318916 817283928 817174315 817068458 817004025
3948.7H17004025j42515j86979j16766k8253K1100K0385k3246p5042m7028L3081L3557
3971.1H16492319k5928p6055j59204j95921j34885j52886k82645l46423k94685k70426
3991.5H14553261l09050k44081p3731
3997.6H13926399
$$ plain form
3948.7 817004025 816861510 816674531 816557765 816529512 816550612 816570997 816547751 816472709 816425681 816458762 816492319
3971.1 816492319 816466391 816390336 816231132 816035211 815900326 815747440 815464795 815118372 814823687 814553261
3991.5 814553261 814244211 814000130 813926399
3997.6 813926399
##END=$$ End of the data block
