##TITLE=Amostra 2 $$ Begin of the data block
##JCAMP-DX=5.00 $$ ACD/SpecManager v 10.08
##SPECTROMETER/DATA SYSTEM=Alpha
##DATE=23 Aug 2016 09:05:00
##DATA TYPE=INFRARED SPECTRUM
##DATA CLASS=XYDATA
##ORIGIN=
##OWNER=
##NPOINTS=1765
##FIRSTX=399.77209473
##LASTX=3997.72216797
##MAXX=3997.72216797
##MINX=399.77209473
##MAXY=0.84090096
##MINY=0.09075989
##XFACTOR=1.0000000000
##YFACTOR=1.000000000000000e-9
##FIRSTY=0.74826068
##DELTAX=2.03965425
##XUNITS=1/CM
##YUNITS=ARBITRARY UNITS
##XYDATA=(X++(Y..Y))
$$ plain form
399.8 748260677 749620438 753805339 758939922 760551810 761257946 765323877 769195795 768672645 768101156
418.1 768101156 772523344 776121557 775672495 776540995 780437052 782308578 781378269 782831311 786913157
436.5 786913157 788274944 787107170 788842082 792764485 793356359 792218447 794294417 797536433 797423661
454.8 797423661 796227038 798397243 801029503 800260603 799347341 801868796 804429293 803599834 803063929
473.2 803063929 806011081 808485925 807700932 807553589 810561121 812731326 811907589 812107146 814988077
491.6 814988077 816318393 814801633 814900339 817581773 818511546 817044497 817311704 819574416 819750309
509.9 819750309 817876101 818144858 820389450 820489407 818888128 819540679 821682513 821516573 819925189
528.3 819925189 820607066 822624981 822482526 821092784 821842074 823649526 823320985 822085977 823030710
$$ packed form
399.8G48260677J359761M184901N134583J611888P06136M065931L871918n23150n71489
418.1G68101156M422188L598213m49062Q68500L896057J871526r30309J453042M081846
436.5G86913157J361787j167774J734912L922403N91874j137912K075970L242016j12772
454.8G97423661j196623K170205K632260p68900r13262K521455K560497q29459n35905
473.2H03063929K947152K474844p84993j47343L007532K170205q23737J99557K880931
491.6H14988077J330316j516760R8706K681434R29773j467049K67207K262712J75893
509.9H19750309j874208K68757K244592R9957j601279O52551K141834j65940j591384
528.3H19925189O81877K017915j42455j389742P49290J807452l28541j235008R44733
$$ plain form
546.6 823030710 824805439 824397147 823308825 824319005 825837016 825208008 824160278 825230002 826562047
565 826562047 825759172 824757636 825879276 827193618 826505840 825653851 826718152 827768445 826964438
583.3 826964438 826272488 827366233 828218937 827298999 826678395 827795625 828628242 827706397 827130854
601.7 827130854 828212857 828898549 828016281 827490509 828333020 828597188 827365577 826772213 827946007
620.1 827946007 828754783 828197002 828145683 829383850 829978287 829266727 829044104 829910338 830217123 829368353
640.5 829368353 829083204 829879820 830130160 829268932 828939617 829620481 829752743 828834295 828370154 828862727
660.8 828862727 828768015 827476442 825840712 825531006 825758398 825179636 824599385 824464560 823682845 822117329
681.2 822117329 820969522 820191443 818540156 815744936 812274992 806073010 790479243 762026250
$$ packed form
546.6H23030710J774729m08292j088322J010180J518011o29008j047730J069724J332045
565H26562047q02875j001536J121640J314342o87778q51989J064301J050293q04007
583.3H26964438o91950J093745Q52704r19938o20604J117230Q32617r21845n75543
601.7H27130854J082003O85692q82268n25772Q42511K64168j231611n93364J173794
620.1H27946007Q08776n57781n1319J238167N94437p11560k22623Q66234L06785q48770
640.5H29368353k85149P96616K50340q61228l29315O80864J32262r18448m64141M92573
660.8H28862727r4712j291573j635730l09706K27392n78762n80251j34825p81715j565516
681.2H22117329j147807p78079j651287k795220l469944o201982j5593767k8452993
$$ plain form
697.6 762026250 743360877 758555233 785680771 793190718 774646342 727817833 678661764 683976293
713.9 683976293 742479086 796113729 821908653 832055449 836057365 837980092 839253247 839976966
730.2 839976966 840413988 840845466 840900958 840637624 840460062 840396821 840082884 839639723 839426875 839353859
750.6 839353859 839150727 838829398 838653505 838519514 838290095 837993681 837739706 837433934 837066352 836721182
771 836721182 836355269 835942209 835554481 835258365 834943652 834582090 834261596 834039152 833690047 833097219
791.4 833097219 832449973 831863225 831220508 830501139 829875052 829341531 828608394 827566266 826556385
809.7 826556385 825590193 824268639 822517157 820698261 818797290 816398680 813402236 810113847 806473851
828.1 806473851 801956058 796452820 790189087 782702923 772261620 756156862 737833202 727493167
$$ packed form
697.6G62026250j8665373J5194356K7125538P509947j8544376m6828509m9156069N314529
713.9F83976293N8502793N3634643K5794924J0146796M001916J922727J273155P23719
730.2H39976966M37022M31478N5492k63334j77562o3241l13937m43161k12848p3016
750.6H39353859k03132l21329j75893j33991k29419k96414k53975l05772l67582l45170
771H36721182l65913m13060l87728k96116l14713l61562l20494k22444l49105n92828
791.4H33097219o47246n86748o42717p19369o26087n33521p33137j042128j009881
809.7H26556385r66192j321554j751482j818896j900971k398610k996444l288389l639996
828.1H06473851m517793n503238o263733p486164j0441303j6104758j8323660j0340035
$$ plain form
844.4 727493167 720560968 699539900 658225834 601073742 537035406 476255685 426483721 397930562
860.7 397930562 402981609 444324613 507749140 572188199 624238014 661551595 687452853 707074583
877.1 707074583 725057662 742845237 759646714 774435818 785734117 792980492 797863603 801895022
893.4 801895022 805003703 807078779 808922827 810928583 812228799 812132657 812102020 814199150 817174435
911.7 817174435 818732142 819473863 820460021 821056962 820963442 821068525 821732998 822085619 821768701 821700454
932.1 821700454 822233260 822408020 821842670 821532786 821840286 821800053 821089983 820662379 820821762 820607662
952.5 820607662 819654524 818909347 818807304 818406343 817301273 816465378 816323400 815857172 814629674
970.9 814629674 813652575 813367486 812761247 811334729 810087800 809561551 808849812 807473838 806393087
$$ packed form
844.4G27493167o932199k1021068m1314066n7152092o4038336o0779721m9771964k8553159
860.7C97930562N051047M1343004O3424527O4439059N2049815L7313581K5901258J9621730
877.1G07074583J7983079J7787575J6801477J4789104J1298299P246375M883111M031419
893.4H01895022L108681K075076J844048K005756J300216r6142l0637K097130K975285
911.7H17174435J557707P41721R86158N96941r3520J05083O64473L52621l16918o8247
932.1H21700454N32806J74760n65350l09884L07500m0233p10070m27604J59383k14100
952.5H20607662r53138p45177j02043m00961j105070q35895j41978m66228j227498
970.9H14629674r77099k85089o06239j426518j246929n26249p11739j375974j080751
$$ plain form
989.2 806393087 806039095 805461586 804211676 803167284 802759588 802091539 800714314 799550533 799112618
1007.6 799112618 798441470 797027528 795815706 795342028 794650435 793192983 791919768 791402102 790739775
1025.9 790739775 789344013 788115144 787616193 787050962 785851598 784818292 784463823 783926606 782620192
1044.3 782620192 781370282 780900538 780511260 779616892 778867900 778742313 778442502 777473629 776465714
1062.7 776465714 775844812 774858892 772947907 770842552 768912554 765821040 758838475 742357790
1079 742357790 716833532 705897629 725911975 754156649 768785954 772859097 773184657 772714496
1095.3 772714496 772625804 772449851 771554291 770547688 770081103 769599795 768545330 767495990 767041802
1113.7 767041802 766649485 765751064 764815390 764456749 764157772 763284326 762349665 762085915 762015760 761369050
$$ packed form
989.2H06393087l53992n77509j249910j044392m07696o68049j377225j163781m37915
1007.6G99112618o71148j413942j211822m73678o91593j457452j273215n17666o62327
1025.9G90739775j395762j228869m98951n65231j199364j033306l54469n37217j306414
1044.3G82620192j249910m69744l89278q94368p48992j25587k99811r68873j007915
1062.7G76465714o20902r85920j910985k105355j929998l091514o982565j6480685
1079G42357790k5524258j0935903K0014346K8244674J4629305M073143L25560m70161
1095.3G72714496q8692j75953q95560j006603m66585m81308j054465j049340m54188
1113.7G67041802l92317q98421r35674l58641k98977q73446r34661k63750p0155o46710
$$ plain form
1134.1 761369050 760520697 760094404 759655833 758538485 757183373 756268799 755461097 754133344 752597094
1152.4 752597094 751420856 750315666 748753488 747033358 745771348 744760036 743451476 742083967
1168.7 742083967 741275012 740788877 740004122 739116967 738687038 738493145 737935901 737143457 736619294 736197293
1189.1 736197293 735342383 734220266 733359694 732656837 731599152 730286002 729240716 728362679 727148533
1207.5 727148533 725691915 724492550 723432779 721956789 720132351 718571186 717267036 715676486
1223.8 715676486 713808417 712164164 710735440 709034562 707074285 705333412 703856587 702172756
1240.1 702172756 700233340 698493004 697034180 695435703 693623483 691986620 690522254 688747644
1256.4 688747644 686539769 684362113 682356060 680125237 677604318 675280094 673278689 671190083
$$ packed form
1134.1G61369050q48353m26293m38571j117348j355112r14574q07702j327753j536250
1152.4G52597094j176238j105190j562178j720130j262010j011312j308560j367509
1168.7G42083967q08955m86135p84755q87155m29929j93893n57244p92444n24163m22001
1189.1G36197293q54910j122117q60572p02857j057685j313150j045286q78037j214146
1207.5G27148533j456618j199365j059771j475990j824438j561165j304150j590550
1223.8G15676486j868069j644253j428724j700878j960277j740873j476825j683831
1240.1G02172756j939416j740336j458824j598477j812220j636863j464366j774610
1256.4F88747644k207875k177656k006053k230823k520919k324224k001405k088606
$$ plain form
1272.8 671190083 668905079 666805506 665025949 663175642 661144793 659289658 657664239 655777991
1289.1 655777991 653464019 651117086 648917735 646507740 643712342 640944421 638414383 635805070
1305.4 635805070 632921517 630116403 627514303 624721587 621576428 618450165 615555942 612570405
1321.7 612570405 609269440 605907381 602678716 599266052 595574439 591892481 588227153 584171832
1338 584171832 579796195 575689912 571852684 567781866 563280344 558687508 554202795 549595237 544701517
1356.4 544701517 539770544 534763217 529366672 523808360 518381059 512884676 507136524 500951886
1372.7 500951886 494392902 487964630 481265843 473694146 465744644 458349109 451416969 444679052
1389 444679052 438445866 432115167 425162733 418069601 410989523 403902978 396495402 388236225 379863322
$$ packed form
1272.8F71190083k285004k099573j779557j850307k030849j855135j625419j886248
1289.1F55777991k313972k346933k199351k409995k795398k767921k530038k609313
1305.4F35805070k883553k805114k602100k792716l145159l126263k894223k985537
1321.7F12570405l300965l362059l228665l412664l691613l681958l665328m055321
1338E84171832m375637m106283l837228m070818m501522m592836m484713m607558m893720
1356.4E44701517m930973n007327n396545n558312n427301n496383n748152o184638
1372.7E00951886o558984o428272o698787p571697p949502p395535o932140o737917
1389D44679052o233186o330699o952434p093132p080078p086545p407576q259177q372903
$$ plain form
1407.4 379863322 371867359 364095539 356744736 349897265 342877090 335233450 328134865 321322113
1423.7 321322113 313971192 305998623 296962887 287370473 277741015 266196370 252592653 239470586
1440 239470586 226156786 212399080 199053779 186434299 175573736 167189389 161106184 156530961
1456.3 156530961 152717158 148803696 142921969 133266166 121273674 110551141 101858988 95121741
1472.6 95121741 91535836 90759888 91588594 93522891 96351072 99764735 103688791 108336538 113555111
1491 113555111 118599109 123743810 129896104 136622936 143218383 149582788 157283947 168138593
1507.3 168138593 179033384 189217716 200094700 212005585 224951625 238528118 253777474
1521.6 253777474 269195080 283519417 298061579 311658204 324688405 338502318 350732774
$$ packed form
1407.4C79863322p995963p771820p350803o847471p020175p643640p098585o812752
1423.7C21322113p350921p972569r035736r592414r629458j1544645j3603717j3122067
1440B39470586j3313800j3757706j3345301j2619480j0860563q384347o083205m575223
1456.3A56530961l813803l913462n881727r655803j1992492j0722533q692153o737247
1472.6I5121741l585905p75948Q28706J934297K828181L413663L924056M647747N218573
1491A13555111N043998N144701O152294O726832O595447O364405P701159J0854646
1507.3A68138593J0894791J0184332J0876984J1910885J2946040J3576493J5249356
1521.6B53777474J5417606J4324337J4542162J3596625J3030201J3813913J2230456
$$ plain form
1535.9 350732774 361212760 373630375 386619240 397508413 407319367 416306794 425013274 433377802
1552.2 433377802 441060692 447720587 455033511 463534176 469575405 474082679 478700042 484264851
1568.5 484264851 491349161 498534381 505922318 514836848 523018003 529543400 535535276 541101456
1584.8 541101456 545930326 550067723 553809345 557263553 560277820 562786937 565051973 567196071
1601.1 567196071 569046438 570476890 571778715 573125541 574293315 575053036 575741172 577028513 578505635
1619.5 578505635 579640329 580851495 582385063 583885491 585321069 586783171 588454306 590831339
1635.8 590831339 593690574 596500278 599284887 601857483 604564071 607873261 610795200 613687098
1652.1 613687098 617904961 622032344 625505388 628753066 632023752 635484636 638728321 641843736
$$ packed form
1535.9C50732774J0479986J2417615J2988865J0889173R810954Q987427Q706480Q364528
1552.2D33377802P682890O659895P312924Q500665O041229M507274M617363N564809
1568.5D84264851P084310P185220P387937Q914530Q181155O525397N991876N566180
1584.8E41101456M828870M137397L741622L454208L014267K509117K265036K144098
1601.1E67196071J850367J430452J301825J346826J167774P59721O88136J287341J477122
1619.5E78505635J134694J211166J533568J500428J435578J462102J671135K377033
1635.8E90831339K859235K809704K784609K572596K706588L309190K921939K891898
1652.1F13687098M217863M127383L473044L247678L270686L460884L243685L115415
$$ plain form
1668.4 641843736 645159364 648336172 651703954 655344784 658354998 660700798 663161814 666647255
1684.8 666647255 670158863 673055530 675973713 678535640 680753350 683137894 685948253 689501703
1701.1 689501703 692622006 695237219 698220789 701067924 703263342 705034614 706947625 709488213
1717.4 709488213 712247849 714710951 717177451 719577670 721469820 723036289 724632919 726703823
1733.7 726703823 729020596 730921447 732921779 735073805 736780703 738186121 739768624 741754234
1750 741754234 743887424 745776594 747700691 749737620 751470804 753248572 755307794 757086515 758256793
1768.4 758256793 758819997 758285880 754601002 746370792 735201299 724641025 716539800 709809661
1784.7 709809661 704764605 704133749 709204793 717682660 725191772 731033027 737098575 744183779
$$ packed form
1668.4F41843736L315628L176808L367782L640830L010214K345800K461016L485441
1684.8F66647255L511608K896667K918183K561927K217710K384544K810359L553450
1701.1F89501703L120303K615213K983570K847135K195418J771272J913011K540588
1717.4G09488213K759636K463102K466500K400219J892150J566469J596630K070904
1733.7G26703823K316773J900851K000332K152026J706898J405418J582503J985610
1750G41754234K133190J889170J924097K036929J733184J777768K059222J778721J170278
1768.4G58256793N63204n34117l684878q230210j1169493j0560274q101225o730139
1784.7G09809661n045056o30856N071044Q477867P509112N841255O065548P085204
$$ plain form
1801 744183779 751239359 757035017 761325717 764359355 766790271 769178629 771396101 773134828 774558842
1819.4 774558842 775978625 777368307 778561831 779540002 780756652 782373369 783706546 784608483 785616755
1837.7 785616755 786706328 787392080 787941098 789057970 790461361 791524589 792232692 793007076 793990433
1856.1 793990433 794824898 795425713 796142220 796989560 797545850 797912955 798715115 799820185 800637186
1874.5 800637186 801119924 801705897 802536070 803246379 803663254 804088116 804745436 805410028 805830359 806299329
1894.9 806299329 807077229 807768643 808130026 808528125 809192121 809754312 810027421 810429096 811104596 811589122
1915.2 811589122 811732769 812050402 812705338 813307703 813633442 813961208 814575732 815156043 815382004 815595686
1935.6 815595686 816089392 816488087 816578627 816817701 817448735 818037927 818250656 818394303 818821609 819245100
$$ packed form
1801G44183779P055580N795658M290700L033638K430916K388358K217472J738727J424014
1819.4G74558842J419783J389682J193524R78171J216650J616717J333177R01937J008272
1837.7G85616755J089573O85752N49018J116872J403391J063228P08103P74384R83357
1856.1G93990433Q34465O00815P16507Q47340N56290L67105Q02160J105070Q17001
1874.5H00637186M82738N85973Q30173P10309M16875M24862O57320O64592M20331M68970
1894.9H06299329P77900O91414L61383L98099O63996N62191K73109M01675O75500M84526
1915.2H11589122J43647L17633O54936O02365L25739L27766O14524N80311K25961K13682
1935.6H15595686M93706L98695R0540K39074O31034N89192K12729J43647M27306M23491
$$ plain form
1956 819245100 819342315 819460511 819938481 820431828 820563078 820665061 821090698 821513176 821613908 821702242
1976.4 821702242 822127223 822598755 822732568 822772145 823087573 823428452 823466599 823517740 823939860 824413955
1996.8 824413955 824551940 824580431 824862242 825217545 825304866 825330079 825637817 826018929 826078713 825988650
2017.2 825988650 826141119 826272428 825771511 825108886 825533569 826683819 827252984 827316761 827579439 827978194
2037.6 827978194 828072190 827993691 828222752 828638434 828752100 828668952 828852654 829210699 829310954 829243720
2058 829243720 829436421 829787552 829869926 829770386 829917669 830255032 830364048 830287933 830453932 830821335
2078.4 830821335 830943763 830853581 830972910 831261396 831310451 831166506 831266701 831603646 831727564 831603467
2098.8 831603467 831630230 831821024 831812203 831611216 831588507 831742525 831707478 831465781 831408560 831599593 831629992
$$ packed form
1956H19245100R7215J18196M77970M93347J31250J01983M25637M22478J00732Q8334
1976.4H21702242M24981M71532J33813L9577L15428L40879L8147N1141M22120M74095
1996.8H24413955J37985K8491K81811L55303Q7321K5213L07738L81112N9784r0063
2017.2H25988650J52469J31309n00917o62625M24683J150250N69165O3777K62678L98755
2037.6H27978194R3996p8499K29061M15682J13666q3148J83702L58045J00255o7234
2058H29243720J92701L51131Q2374r9540J47283L37363J09016p6115J65999L67403
2078.4H30821335J22428r0182J19329K88486M9055j43945J00195L36945J23918j24097
2098.8H31603467K6763J90794q821k00987k2709J54018l5047k41697n7221J91033L0399
$$ plain form
2121.3 831629992 831425965 831414640 831655920 831708968 831508458 831452072 831621408 831665039 831524968 831547797
2141.6 831547797 831764638 831765294 831437945 831200898 831259191 831312716 831233978 831348717 831768334 832119167 832202375
2164.1 832202375 832273901 832473338 832588077 832551241 832628727 832910120 833077610 832982004 832947612 833177745
2184.5 833177745 833364367 833301008 833294392 833532989 833704114 833607793 833548248 833724797 833861887 833776712 833737493
2206.9 833737493 833939195 834099293 833994567 833907902 834064841 834168971 833996773 833866835 834031641 834175825
2227.3 834175825 834030926 833880424 833989084 834089041 833920479 833764732 833884060 833992362 833822727 833650887
2247.7 833650887 833711505 833740413 833539248 833399296 833542347 833673418 833529711 833342850 833383918 833447635
2268.1 833447635 833287954 833141744 833249629 833365560 833243430 833121479 833201528 833220482 832970440 832697749
$$ packed form
2121.3H31629992k04027j1325K41280N3048k00510n6386J69336M3631j40071K2829
2141.6H31547797K16841O56l27349k37047N8293N3525p8738J14739M19617L50833Q3208
2164.1H32202375P1526J99437J14739l6836P7486K81393J67490r5606l4392K30133
2184.5H33177745J86622o3359o616K38597J71125r6321n9545J76549J37090q5175l9219
2206.9H33737493K01702J60098j04726q6665J56939J04130j72198j29938J64806J44184
2227.3H34175825j44899j50502J08660R9957j68562j55747J19328J08302j69635j71840
2247.7H33650887O0618K8908k01165j39952J43051J31071j43707j86861M1068O3717
2268.1H33447635j59681j46210J07885J15931j22130j21951Q0049J8954k50042k72691
$$ plain form
2288.5 832697749 832641065 832585156 832265735 831879258 831701219 831528068 831068099 830532849 830255330 830058694
2308.9 830058694 829620659 829110622 828805089 828470528 827786505 827037275 826683879 826511204 826081514 825571120
2329.3 825571120 825367689 825325727 825066745 824674249 824489892 824490190 824566007 824987531 825467110 825236619
2349.7 825236619 824194431 822972119 822212756 821866751 821615219 821508050 821834147 822463810 823021233
2368 823021233 823589683 824398398 825266361 825901449 826383114 826938927 827423513 827584922 827557564 827612340
2388.4 827612340 827700615 827604592 827373683 827250183 827205002 827010036 826737463 826635897 826623380 826436341
2408.8 826436341 826133370 825960398 825870335 825634360 825310469 825135946 825041354 824785292 824446201 824268222
2429.2 824268222 824164331 823884964 823500812 823272407 823154986 822888494 822479427 822142720 821878195 821490645
$$ packed form
2288.5H32697749n6684n5909l19421l86477j78039j73151m59969n35250k77519j96636
2308.9H30058694m38035n10037l05533l34561o84023p49230l53396j72675m29690n10394
2329.3H25571120k03431m1962k58982l92496j84357K98P5817M21524M79579k30491
2349.7H25236619j042188j222312p59363l46005k51532j07169L26097O29663N57423
2368H23021233N68450Q08715Q67963O35088M81665N55813M84586J61409k7358N4776
2388.4H27612340Q8275r6023k30909j23500m5181j94966k72573j01566j2517j87039
2408.8H26436341l02971j72972r0063k35975l23891j74523r4592k56062l39091j77979
2429.2H24268222j03891k79367l84152k28405j17421k66492m09067l36707k64525l87550
$$ plain form
2449.6 821490645 820980310 820521414 820091128 819485486 818685949 817876458 817072749 816064000 814811051
2468 814811051 813488603 812015712 810067058 807603836 804950535 802296042 799558938 796787798 794208288
2486.3 794208288 791829586 789415181 786970675 784871042 783365369 782373846 781871438 782012880 782702029
2504.7 782702029 783384442 783469081 782675147 780852497 778039336 774905503 772504866 771370292 771290123
2523 771290123 771949589 773349226 775509596 778152645 780922711 783605695 785825312 786912560 786543727
2541.4 786543727 785257101 784083128 783804238 784637511 786408722 788627803 790590286 791965425 793018162
2559.8 793018162 794011176 794874191 795599222 796444654 797475636 798380315 798984706 799482465 800005376
2578.1 800005376 800399482 800577879 800726712 800994992 801244497 801328719 801389217 801551938 801634550 801502407
$$ packed form
2449.6H21490645n10335m58896m30286o05642p99537q09491q03709j008749j252949
2468H14811051j322448j472891j948654k463222k653301k654493k737104k771140k579510
2486.3G94208288k378702k414405k444506k099633j505673r91523n02408J41442O89149
2504.7G82702029O82413Q4639p93934j822650k813161l133833k400637j134574q0169
2523G71290123O59466J399637K160370K643049K770066K682984K219617J087248l68833
2541.4G86543727j286626j173973k78890Q33273J771211K219081J962483J375139J052737
2559.8G93018162R93014Q63015P25031Q45432J030982R04679O04391M97759N22911
2578.1H00005376L94106J78397J48833K68280K49505Q4222O0498J62721Q2612j32143
$$ plain form
2598.5 801502407 801340401 801288068 801176488 800888240 800626040 800538838 800418854 800104916 799819052 799758375
2618.9 799758375 799747407 799588442 799400270 799378395 799440324 799415052 799435794 799709916 800119698 800466835
2639.3 800466835 800830960 801339030 801856816 802201509 802489638 802933216 803419530 803753853 804052114 804467499
2659.7 804467499 804845154 804994583 805056453 805225849 805368066 805299819 805145383 805073738 804995358 804789305
2680.1 804789305 804563403 804453313 804364026 804147720 803885281 803725362 803590059 803323090 803020656 802885175
2700.5 802885175 802814364 802584410 802258790 802044392 801905215 801664114 801382661 801211715 801060617 800783336
2720.9 800783336 800454319 800219178 800037146 799782932 799519897 799364746 799221218 798946381 798616111 798402548
2741.3 798402548 798248649 797966123 797610044 797374845 797234356 797017753 796709836 796447158 796245277 795954645
$$ packed form
2598.5H01502407j62006n2333j11580k88248k62200q7202j19984l13938k85864o0677
2618.9G99758375j0968j58965j88172k1875O1929k5272K0742K74122M09782L47137
2639.3H00466835L64125N08070N17786L44693K88129M43578M86314L34323K98261M15385
2659.7H04467499L77655J49429O1870J69396J42217o8247j54436p1645p8380k06053
2680.1H04789305k25902j10090q9287k16306k62439j59919j35303k66969l02434j35481
2700.5H02885175p0811k29954l25620k14398j39177k41101k81453j70946j51098k77281
2720.9H00783336l29017k35141j82032k54214k63035j55151j43528k74837l30270k13563
2741.3G98402548j53899k82526l56079k35199j40489k16603l07917k62678k01881k90632
$$ plain form
2761.7 795954645 795588851 795336187 795168757 794885933 794508100 794208825 793989718 793705881 793353498 793073773
2782.1 793073773 792846382 792522311 792126417 791811287 791559100 791215003 790790677 790441096 790163219 789808750
2802.5 789808750 789391458 789045393 788717508 788273752 787769914 787356913 787003219 786552310 786030650 785562277
2822.9 785562277 785084724 784464180 783745229 783022463 782254398 781301796 780104399 778806031 777425170
2841.2 777425170 775729120 773722947 771799862 770311236 769334018 768879175 768926442 769259512 769588172
2859.6 769588172 769793391 769928515 769982219 769846499 769539595 769171715 768816113 768464744 768039703 767548740
2880 767548740 767005503 766303897 765414774 764440894 763406873 762214005 760880828 759624720 758548439
2898.3 758548439 757504642 756380498 755182326 753800988 751982987 749646962 747133195 744962215
$$ packed form
2761.7G95954645l65794k52664j67430k82824l77833k99275k19107k83837l52383k79725
2782.1G93073773k27391l24071l95894l15130k52187l44097m24326l49581k77877l54469
2802.5G89808750m17292l46065l27885m43756n03838m13001l53694m50909n21660m68373
2822.9G85562277m77553o20544p18951p22766p68065r52602j197397j298368j380861
2841.2G77425170j696050k006173j923085j488626r77218m54843M7267L33070L28660
2859.6G69588172K05219J35124N3704j35720l06904l67880l55602l51369m25041m90963
2880G67548740n43237p01606q89123r73880j034021j192868j333177j256108j076281
2898.3G58548439j043797j124144j198172j381338j818001k336025k513767k170980
$$ plain form
2914.6 744962215 743453503 742712319 742661655 743045449 743632078 744294345 745059013 746026397 747064650
2933 747064650 747984409 748789966 749471188 749918163 750179529 750491440 750911415 751205504 751239002 751197934
2953.4 751197934 751196563 751099527 750867784 750636220 750475705 750314355 750078380 749762952 749367237 748886943
2973.8 748886943 748404443 748048306 747893333 747948527 748161554 748475492 748879611 749336243 749843597 750481784
2994.2 750481784 751163065 751748383 752235532 752637446 752982914 753235281 753268123 753117561 752998471 752979934
3014.6 752979934 752952814 752884746 752801538 752626896 752345085 752077639 751834571 751525462 751135588 750785708
3035 750785708 750509083 750142574 749653161 749208212 748907983 748642266 748275518 747843802 747418463 746988416
3055.4 746988416 746526837 746029079 745513916 744964182 744361997 743797064 743317664 742863536 742376029 741793275
$$ packed form
2914.6G44962215j508712p41184n0664L83794N86629O62267P64668R67384J038253
2933G47064650R19759Q05557O81222M46975K61366L11911M19975K94089L3498m1068
2953.4G51197934j371r7036k31743k31564j60515j61350k35975l15428l95715m80294
2973.8G48886943m82500l56137j54973N5194K13027L13938M04119M56632N07354O38187
2994.2G50481784O81281N85318M87149M01914L45468K52367L2842j50562j19090j8537
3014.6G52979934k7120o8068q3208j74642k81811k67446k43068l09109l89874l49880
3035G50785708k76625l66509m89413m44949l00229k65717l66748m31716m25339m30047
3055.4G46988416m61579m97758n15163n49734o02185n64933m79400m54128m87507n82754
$$ plain form
3075.8 741793275 741129100 740485966 739893496 739341259 738829195 738287449 737660885 737019658 736445010 735884786
3096.2 735884786 735245407 734572291 733939111 733297884 732606173 731917858 731273711 730625153 729915023 729153275
3116.6 729153275 728385270 727660716 726976871 726274729 725552559 724830210 724078894 723296821 722520471 721760094
3136.9 721760094 720959902 720082283 719177604 718289793 717408001 716530919 715686321 714829624 713876605 712869227
3157.3 712869227 711918354 711015999 710062444 709053993 708070219 707098246 706073225 705010772 703952253
3175.7 703952253 702908874 701834977 700685441 699536979 698456168 697378397 696243644 695079446
3192 695079446 693923771 692762911 691586614 690433085 689317763 688194275 687037408 685876727 684732139
3210.4 684732139 683552206 682329059 681184173 680134773 679047406 677873313 676694095 675574124
$$ packed form
3075.8G41793275o64175o43134n92470n52237n12064n41746o26564o41227n74648n60224
3096.2G35884786o39379o73116o33180o41227o91711o88315o44147o48558p10130p61748
3116.6G29153275p68005p24554o83845p02142p22170p22349p51316p82073p76350p60377
3136.9G21760094q00192q77619r04679q87811q81792q77082q44598q56697r53019j007378
3157.3G12869227r50873r02355r53555j008451r83774r71973j025021j062453j058519
3175.7G03952253j043379j073897j149536j148462j080811j077771j134753j164198
3192F95079446j155675j160860j176297j153529j115322j123488j156867j160681j144588
3210.4F84732139j179933j223147j144886j049400j087367j174093j179218j119971
$$ plain form
3226.7 675574124 674481869 673424602 672421753 671350121 670178056 669037580 667984247 667017519
3243 667017519 666090429 665126085 664144874 663199425 662259102 661297441 660362542 659448802 658498943 657540500
3263.4 657540500 656657994 655884326 655114353 654191434 653162479 652185977 651251435 650298059 649359465
3281.8 649359465 648419261 647419989 646408439 645481229 644595385 643551648 642317355 641099989 639984190
3300.1 639984190 638878644 637765169 636595666 635242283 633774042 632330358 630924523 629520774
3316.4 629520774 628078222 626593709 625115335 623659074 622102559 620396674 618687332 617028534
3332.7 617028534 615399182 613810241 612170577 610393345 608524323 606659532 604889631 603192985
3349.1 603192985 601377428 599384844 597402751 595544100 593756139 591936707 590090156 588345826
$$ packed form
3226.7F75574124j092255j057267j002849j071632j172065j140476j053333r66728
3243F67017519r27090r64344r81211r45449r40323r61661r34899r13740r49859r58443
3263.4F57540500q82506p73668p69973r22919j028955r76502r34542r53376r38594
3281.8F49359465r40204r99272j011550r27210q85844j043737j234293j217366j115799
3300.1F39984190j105546j113475j169503j353383j468241j443684j405835j403749
3316.4F29520774j442552j484513j478374j456261j556515j705885j709342j658798
3332.7F17028534j629352j588941j639664j777232j869022j864791j769901j696646
3349.1F03192985j815557j992584j982093j858651j787961j819432j846551j744330
$$ plain form
3365.4 588345826 586706102 584983230 583073497 581162989 579448760 577866375 576315463 574795306
3381.7 574795306 573303401 571851373 570536673 569396615 568221927 566837668 565446675 564356208
3398 564356208 563451946 562323749 560959160 559718490 558721364 557819247 556896687 555918396 554930866
3416.4 554930866 554066420 553306282 552556634 551892698 551415443 551070511 550706446 550385416 550195396 549933016
3436.8 549933016 549502730 549125552 548953474 548938036 549028397 549176455 549334049 549530268 549828708 550233185
3457.2 550233185 550673723 551102638 551607192 552309692 553122163 553761423 554163516 554582894 555186093 556006312
3477.6 556006312 556921482 557729125 558476150 559300542 560170650 561065912 562063634 563155293 564275742
3495.9 564275742 565366387 566417754 567484975 568536758 569553077 570662022 571938038 573280692
$$ packed form
3365.4E88345826j639724j722872j909733j910508j714229j582385j550912j520157
3381.7E74795306j491905j452028j314700j140058j174688j384259j390993j090467
3398E64356208r04262j128197j364589j240670r97126r02117r22560r78291r87530
3416.4E54930866q64446p60138p49648o63936m77255l44932l64065l21030j90020k62380
3436.8E49933016m30286l77178j72078j5438R0361J48058J57594J96219K98440M04477
3457.2E50233185M40538M28915N04554P02500Q12471O39260M02093M19378O03199Q20219
3477.6E56006312R15170Q07643P47025Q24392Q70108Q95262R97722J091659J120449
3495.9E64275742J090645J051367J067221J051783J016319J108945J276016J342654
$$ plain form
3512.2 573280692 574540317 575734317 576977193 578274906 579609692 580908954 582172930 583562136
3528.5 583562136 585073411 586587071 588114321 589621961 591027021 592434049 593952239 595555365
3544.9 595555365 597109914 598545849 600033820 601673067 603333175 604970098 606651425 608287156
3561.2 608287156 609693289 611135960 613156915 615451336 617401183 619151771 621018469 622972488
3577.5 622972488 624918163 626798630 628495634 630207062 632334173 634563029 636436641 638307631
3593.8 638307631 640461028 642697513 644914627 647017181 648768842 650356472 652312040 654541075
3610.1 654541075 656646669 658547640 660218477 662238538 664792895 666837931 668039620 669163823
3626.4 669163823 671378851 674210370 676287949 678025007 679705739 681237340 682708621 683887482
$$ packed form
3512.2E73280692J259625J194000J242876J297713J334786J299262J263976J389206
3528.5E83562136J511275J513660J527250J507640J405060J407028J518190J603126
3544.9E95555365J554549J435935J487971J639247J660108J636923J681327J635731
3561.2F08287156J406133J442671K020955K294421J949847J750588J866698J954019
3577.5F22972488J945675J880467J697004J711428K127111K228856J873612J870990
3593.8F38307631K153397K236485K217114K102554J751661J587630J955568K229035
3610.1F54541075K105594J900971J670837K020061K554357K045036J201689J124203
3626.4F69163823K215028K831519K077579J737058J680732J531601J471281J178861
$$ plain form
3642.8 683887482 684544325 685322225 687311471 689735711 690995872 691869557 693371415 694814444 695685208
3661.1 695685208 696175158 696307123 696321189 696871161 697568834 697805762 698688686 699992061 700631082 700969160
3681.5 700969160 700994253 700702608 700898528 701817214 702511668 702740192 702818990 702787280 702804327 703145742
3701.9 703145742 703414679 703194797 702843130 702902257 703520715 703978419 703865170 703465998 703079283 702836692
3722.3 702836692 702717423 702577412 702099860 701371193 700835049 700959563 701753795 702015460 701077342 700260401
3742.7 700260401 700748444 701029480 700745523 701330125 702145576 702143133 701918423 702049315 702178180 701923490
3763.1 701923490 701610923 701451242 701559067 701825738 701736212 701300740 701007366 701080799 701084912 700843751
3783.5 700843751 700692415 700622201 700483024 700150907 699586987 699037671 698494375 698156178 698368430 698344946
$$ packed form
3642.8F83887482O56843P77900J989246K424240J260161Q73685J501858J443029Q70764
3661.1F95685208M89950J31965J4066N49972O97673K36928Q82924J303375O39021L38078
3681.5G00969160K5093k91645J95920R18686O94454K28524P8798l1710J7047L41415
3701.9G03145742K68937k19882l51667N9127O18458M57704j13249l99172l86715k42591
3722.3G02836692j19269j40011m77552p28667n36144J24514P94232K61665r38118q16941
3742.7G00260401M88043K81036k83957N84602Q15451k443k24710J30892J28865k54690
3763.1G01923490l12567j59681J07825K66671q9526m35472k93374P3433M113k41161
3783.5G00843751j51336p0214j39177l32117n63920n49316n43296l38197K12252k3484
$$ plain form
3803.9 698344946 698184550 698447287 698314309 697539032 696916521 696802199 696463883 696276784 696740985 696764171
3824.3 696764171 696362972 696017623 695673764 695271254 694753110 694476962 694679797 694859087 694895804 694881558
3844.7 694881558 694391966 693138957 691779733 692061782 693646729 693846107 693061173 692412674 692163110
3863 692163110 692007184 691555142 691350043 691598654 691654444 691445172 690994442 690646052 690490365 690233707
3883.4 690233707 690270841 690258980 689907253 689832807 689741075 689147115 688433111 687965810 687848270 688148260
3903.8 688148260 688492119 688434124 688161612 687831521 687353730 686966538 686867774 686753035 686481833 686310709
3924.2 686310709 686200976 685920060 685646236 685565293 685501397 685314238 684985340 684613407 684422791 684299886
3944.6 684299886 684042633 683794498 683642805 683499396 683293760 683023751 682755411 682542145 682339728 682109237
$$ packed form
3803.9F98344946j60396K62737j32978p75277o22511j14322l38316j87099M64201K3186
3824.3F96764171m01199l45349l43859m02510n18144k76148K02835J79290L6717j4246
3844.7F94881558m89592j253009j359224K82049J584947J99378p84934o48499k49564
3863F92163110j55926m52042k05099K48611N5790k09272m50730l48390j55687k56658
3883.4F90233707L7134j1861l51727p4446r1732n93960p14004m67301j17540K99990
3903.8F88148260L43859n7995k72512l30091m77791l87192r8764j14739k71202j71124
3924.2F86310709j09733k80916k73824q0943o3896j87159l28898l71933j90616j22905
3944.6F84299886k57253k48135j51693j43409k05636k70009k68340k13266k02417k30491
$$ plain form
3965 682109237 681898952 681718528 681534171 681361794 681237936 681097329 680875599 680689573 680609167 680489302
3985.4 680489302 680244803 679983079 679793835 679621994 679443538 679289699
3997.6 679289699
$$ packed form
3965F82109237k10285j80424j84357j72377j23858j40607k21730j86026q0406j19865
3985.4F80489302k44499k61724j89244j71841j78456j53839
3997.6F79289699
##END=$$ End of the data block
