##TITLE=Amostra 2 - Marcela $$ Begin of the data block
##JCAMP-DX=5.00 $$ ACD/SpecManager v 10.08
##SPECTROMETER/DATA SYSTEM=Alpha
##DATE=24 Oct 2013 10:57:42
##DATA TYPE=INFRARED SPECTRUM
##DATA CLASS=XYDATA
##ORIGIN=
##OWNER=
##NPOINTS=1765
##FIRSTX=399.75695801
##LASTX=3997.56933594
##MAXX=3997.56933594
##MINX=399.75695801
##MAXY=0.83190566
##MINY=0.16238329
##XFACTOR=1.0000000000
##YFACTOR=1.000000000000000e-9
##FIRSTY=0.47428462
##DELTAX=2.03957629
##XUNITS=1/CM
##YUNITS=ARBITRARY UNITS
##XYDATA=(X++(Y..Y))
$$ plain form
399.8 474284619 470784098 469299972 468788773 468331814 468290150 469834119 472257614 473053813 471512467
418.1 471512467 469676912 468779504 467711836 465522170 462456048 459502220 457189441 455475777 454314828
436.5 454314828 454082876 455561221 459015995 463428319 467462659 470795214 473523170 475523382 476534992
454.8 476534992 476179391 474681169 473140329 471584857 469156235 465651631 461621314 457631439 454048038
473.2 454048038 450936317 448095888 445923656 444967717 444840759 444722891 444354445 443997383 443708926
491.5 443708926 443021655 441602916 439689249 437733978 435905874 433815747 430988520 427548230 424086094
509.9 424086094 420615286 416505277 411554456 406371593 401840359 398371875 396012396 394800961
526.2 394800961 394679993 395657301 398037672 401917815 406963587 412778080 418751925 423871577 427229583
$$ packed form
399.8D74284619l500521j484126n11199m56959m1664J543969K423495P96199j541346
418.1D71512467j835555q97408j067668k189666l066122k953828k312779j713664j160949
436.5D54314828k31952J478345L454774M412324M034340L332555K727956K000212J011610
454.8D76534992l55601j498222j540840j555472k428622l504604m030317l989875l583401
473.2D54048038l111721k840429k172232r55939j26958j17868l68446l57062k88457
491.5D43708926o87271j418739j913667j955271j828104k090127k827227l440290l462136
509.9D24086094l470808m110009m950821n182863m531234l468484k359479j211435
526.2C94800961j20968R77308K380371L880143N045772N814493N973845N119652L358006
$$ plain form
544.6 427229583 428584605 428352445 427110374 424983531 421855897 417937160 413425863 408177942 401881337
562.9 401881337 394534200 386655271 379061192 372626871 368180722 366381347 367377430 370911479 376631767
581.3 376631767 383954704 391859889 399253070 405332685 409775376 412502766 413699597 413890392 413585991
599.6 413585991 413169235 412914455 413006753 413568795 414688826 416381657 418770969 422027111 426174432
618 426174432 431018353 436310649 441852242 447200835 451966882 456039548 459469557 462226897 464264333
636.3 464264333 465878695 467483997 469112635 470551014 471823275 473097146 474385023 475605637
652.7 475605637 476746023 477894932 479132652 480482459 481830209 482940584 484011889 485512763
669 485512763 487020135 488406569 489859045 491335988 492833436 494427502 496024817 497347236 498298824
$$ packed form
544.6D27229583J355022k32160j242071k126843l127634l918737m511297n247921o296605
562.9D01881337p347137p878929p594079o434321m446149j799375R96083L534049N720288
581.3C76631767P322937P905185P393181O079615M442691K727390J196831J90795l04401
599.6D13585991m16756k54780R2298N62042J120031J692831K389312L256142M147321
618D26174432M843921N292296N541593N348593M766047M072666L430009K757340K037436
636.3D64264333J614362J605302J628638J438379J272261J273871J287877J220614
652.7D75605637J140386J148909J237720J349807J347750J110375J071305J500874
669D85512763J507372J386434J452476J476943J497448J594066J597315J322419R51588
$$ plain form
687.3 498298824 498933166 499173224 498707891 497175246 494474858 490912408 486919791 482905030 479502141
705.7 479502141 477523655 477498323 479480416 483166903 488096535 494003206 500963569 508693814 516528904
724 516528904 524038732 530947685 537162483 542549253 546810389 549885631 551936626 552980363 552602828
742.4 552602828 550375402 546355963 540971100 534640133 527610600 520171165 512921274 506619036
758.7 506619036 501910686 499178767 498795062 501380503 507253647 515911222 526255190 537108421
775 537108421 547688901 557653368 566671133 574409962 580876410 586402595 591557741 596721053 601845503
793.4 601845503 607045174 612805963 619261682 625745893 631344438 635788679 639482439 642794311
809.7 642794311 645661652 647687912 648810208 649429321 649751484 649304271 647279918 643429101 638207078
$$ packed form
687.3D98298824O34342K40058m65333j532645k700388l562450l992617m014761l402889
705.7D79502141j978486k5332J982093L686487M929632N906671O960363P730245P835090
724E16528904P509828O908953O214798N386770M261136L075242K050995J043737l77535
742.4E52602828k227426m019439n384863o330967p029533p439435p249891o302238
758.7E06619036m708350k731919l83705K585441N873144Q657575J0343968J0853231
775E37108421J0580480R964467R017765P738829O466448N526185N155146N163312N124450
793.4F01845503N199671N760789O455719O484211N598545M444241L693760L311872
809.7F42794311K867341K026260J122296O19113L22163m47213k024353l850817n222023
$$ plain form
828.1 638207078 632000923 624677479 616210461 607289732 598928154 591668546 585383415 579783738
844.4 579783738 574971557 571200728 568289638 565595686 562664032 559887111 558346808 559323251 563821316
862.7 563821316 571991861 583200097 596399784 609920323 621710420 630310953 635326147 637025356
879.1 637025356 635528505 630644798 622807860 613490999 604219556 595640838 587633252 580081046
895.4 580081046 573218286 567079127 561038613 554127216 545815408 536288977 525838673 514445901
911.7 514445901 502150714 489517212 477666110 467778683 460467249 455650419 452943742 452059507
928 452059507 452834845 455003738 458248824 462549508 468205720 475237429 482468843 487404376 487575650
946.4 487575650 482044280 471361578 456593424 438918114 419543624 399303317 378477693 357063770
$$ packed form
828.1F38207078o206155p323444q467018q920729q361578p259608o285131n599677
844.4E79783738m812181l770829k911090k693952k931654k776921j540303R76443M498065
862.7E63821316Q170545J1208236J3199687J3520539J1790097Q600533N015194J699209
879.1F37025356j496851m883707p836938r316861r271443q578718q007586p552206
895.4E80081046o862760o139159o040514o911397q311808r526431j0450304j1392772
911.7E14445901j2295187j2633502j1851102r887427p311434m816830k706677q84235
928D52059507P75338K168893L245086M300684N656212P031709P231414M935533J71274
946.4D87575650n531370j0682702j4768154j7675310j9374490k0240307k0825624k1413923
$$ plain form
962.7 357063770 335123897 312972546 290987641 269410580 248508230 228738964 210748300
977 210748300 195246518 182774603 173498571 167257130 163715199 162383288 162704885 164147794 166233808
995.3 166233808 168613881 171069771 173383191 175290942 176582083 177251384 177491650 177571565 177790597
1013.7 177790597 178368822 179411680 180960104 183031663 185603857 188569382 191740096 194926456
1030 194926456 197967350 200674921 202885807 204603553 206088319 207606629 209311485 211353540 213831022
1048.3 213831022 216825351 220504403 225066915 230673939 237517551 245853454 255814761 266719878
1064.7 266719878 276289523 280909568 277983576 268655688 257184654 247561410 241443112 238712728
1081 238712728 238681868 240662128 244095206 248597622 253901094 259644717 265250623 270044565 273598403
$$ packed form
962.7C57063770k1939873k2151351k1984905k1577061k0902350j9769266j7990664
977B10748300j5501782j2471915r276032o241441l541931j331911L21597J442909K086014
995.3A66233808K380073K455890K313420J907751J291141O69301K40266P9915K19032
1013.7A77790597N78225J042858J548424K071559K572194K965525L170714L186360
1030A94926456L040894K707571K210886J717746J484766J518310J704856K042055K477482
1048.3B13831022K994329L679052M562512N607024O843612Q335903R961307J0905117
1064.7B66719878R569645M620045k925992r327888j1471034r623244o118298k730384
1081B38712728l0860J980260L433078M502416N303472N743623N605906M793942L553838
$$ plain form
1099.3 273598403 275930405 277503014 278992504 280923814 283535630 286817521 290551782 294353932
1115.6 294353932 297792673 300639123 303022325 305361748 308150589 311674565 315843493 319994330
1132 319994330 322942317 323470771 320829302 315091938 307148516 298226923 289364219 281269848 274364084
1150.3 274364084 268837959 264781594 262205988 261041433 261254668 262976199 266440332 271861255
1166.6 271861255 279362053 288968176 300604880 314039141 328821510 344401926 360261798 375945210
1182.9 375945210 391025931 404954672 417151004 427194446 434919924 440529376 444451779 447144061
1199.3 447144061 449211985 451389551 454222620 457944602 462576240 468037486 474118859 480391681
1215.6 480391681 486206919 490914047 494181812 496043950 496713936 496416658 495375305 493907213 492413223
$$ packed form
1099.3B73598403K332002J572609J489490J931310K611816L281891L734261L802150
1115.6B94353932L438741K846450K383202K339423K788841L523976M168928M150837
1132C19994330K947987N28454k641469n737364p943422q921593q862704q094371o905764
1150.3B74364084n526125m056365k575606j164555K13235J721531L464133N420923
1166.6B71861255P500798R606123J1636704J3434261J4782369J5580416J5859872J5683412
1182.9C75945210J5080721J3928741J2196332J0043442P725478N609452L922403K692282
1199.3D47144061K067924K177566K833069L721982M631638N461246O081373O272822
1215.6D80391681N815238M707128L267765J862138O69986k97278j041353j468092j493990
$$ plain form
1233.9 492413223 491210431 490399659 489962012 489990503 490703881 492191255 494266599 496657580 499237716
1252.3 499237716 501987696 504812181 507520974 510039806 512492418 515082300 517887056 520712554
1268.6 520712554 523253262 525319934 526878238 527906418 528305769 528074443 527424693 526590109 525599778
1287 525599778 524305046 522608578 520622909 518536091 516463041 514514208 512812436 511498570 510607719
1305.3 510607719 509909391 509100914 507965505 506454647 504672945 502553999 499874771 496540576 492543817
1323.7 492543817 487916797 482769370 477326155 471981466 467204094 463338166 460486352 458614409
1340 458614409 457538933 456854731 456248790 455530375 454510719 453170687 451641023 450093478 448533952
1358.3 448533952 446798861 445027828 443719685 442927152 442484528 442456603 442856133 443902194 445640117
$$ packed form
1233.9D92413223j202792q10772m37647K8491P13378J487374K075344K390981K580136
1252.3D99237716K749980K824485K708793K518832K452612K589882K804756K825498
1268.6E20712554K540708K066672J558304J028180L99351k31326o49750q34584r90331
1287E25599778j294732j696468j985669k086818k073050j948833j701772j313866q90851
1305.3E10607719o98328q08477j135409j510858j781702k118946k679228l334195l996759
1323.7D92543817m627020n147427n443215n344689m777372l865928k851814j871943
1340D58614409j075476o84202o05941p18415j019656j340032j529664j547545j559526
1358.3D48533952j735091j771033j308143p92533m42624k7925L99530J046061J737923
$$ plain form
1376.7 445640117 447644770 449652582 451815963 454523057 458196074 462475032 466085315 468426019
1393 468426019 469734162 470351100 470374048 469861954 468705148 467021793 465313256 463615477 461813033
1411.4 461813033 460075408 458498657 457045346 456192762 456255108 456655294 457193226 457916826 458853453
1429.7 458853453 460067600 461240023 462428302 464324981 466539204 468385875 469612569 470068485
1446 470068485 469875962 469225764 467947662 465833873 462852806 460694492 460744917 461730391 463707179
1464.4 463707179 467519075 472651184 478876323 487401754 497564226 507545173 517055273 526223958
1480.7 526223958 535055816 542965651 550069213 557385743 565306246 572309971 578059793 583831668
1497 583831668 589913368 595453560 599615753 602793992 607125103 612549961 617306173 621185720 624273479
$$ packed form
1376.7D45640117K004653K007812K163381K707094L673017M278958L610283K340704
1393D68426019J308143O16938K2948n12094j156806j683355j708537j697779j802444
1411.4D61813033j737625j576751j453311q52584O2346M00186N37932P23600R36627
1429.7D58853453J214147J172423J188279J896679K214223J846671J226694M55916
1446D70068485j92523o50198j278102k113789k981067k158314N0425R85474J976788
1464.4D63707179L811896N132109O225139Q525431J0162472R980947R510100R168685
1480.7E26223958Q831858P909835P103562P316530P920503P003725N749822N771875
1497E83831668O081700N540192M162193L178239M331111N424858M756212L879547L087759
$$ plain form
1515.4 624273479 627121449 629999578 633346319 637090385 640410483 643562555 646470964 648933172
1531.7 648933172 651498020 653839648 655073166 656345010 659234047 662579894 665454566 667640626
1548 667640626 669554532 671468258 672932923 673393548 673779964 676613986 679957449 682012320 683202505
1566.4 683202505 683983326 685217798 686691344 687393904 687846005 688819587 689752519 690262675 690323949
1584.7 690323949 689827442 688914657 687800765 686494470 684792280 682596385 679988265 677024722 673736393
1603.1 673736393 669953465 665520489 660616398 655664325 650546253 644320548 637293696 631724894
1619.4 631724894 626622856 620725334 615135074 609985173 605180979 601062834 596761525 592056215
1635.7 592056215 589187622 587977171 587030649 586011291 585122526 585445821 586455584 587408781 590299070
$$ packed form
1515.4F24273479K847970K878129L346741L744066L320098L152072K908409K462208
1531.7F48933172K564848K341628J233518J271844K889037L345847K874672K186060
1548F67640626J913906J913726J464665M60625L86416K834022L343463K054871J190185
1566.4F83202505P80821J234472J473546P02560M52101R73582R32932N10156O1274
1584.7F90323949m96507r12785j113892j306295j702190k195895k608120k963543l288329
1603.1F73736393l782928m432976m904091m952073n118072o225705p026852n568802
1619.4F31724894n102038n897522n590260n149901m804194m118145m301309m705310
1635.7E92056215k868593j210451r46522j019358q88765L23295J009763R53197K890289
$$ plain form
1654.1 590299070 594470263 597942829 601091385 604754508 609147429 613163233 616978168 621759057
1670.4 621759057 626813233 631967187 637701571 642925978 647082925 651076794 656974554 663482249
1686.7 663482249 668701589 673470736 677497029 681085169 684844196 688585401 693289459 697910726
1703 697910726 701696634 705559552 709138930 711987495 714152694 715964377 718517661 722098351 725317955
1721.4 725317955 727872491 730151951 732023239 733400106 734335542 735702515 738242865 740460515
1737.7 740460515 742090523 743812919 745552957 747043610 748255074 749630213 751608849 753508508
1754 753508508 754945099 756221533 757304847 758485854 759892404 760952473 761568189 761972487 762781441
1772.4 762781441 764413953 766041934 767161250 768015802 768897653 769873619 770883024 771521688 771725595
$$ packed form
1654.1E90299070M171193L472566L148556L663123M392921M015804L814935M780889
1670.4F21759057N054176N153954N734384N224407M156947L993869N897760O507695
1686.7F63482249N219340M769147M026293L588140L759027L741205M704058M621267
1703F97910726L785908L862918L579378K848565K165199J811683K553284L580690L219604
1721.4G25317955K554536K279460J871288J376867R35436J366973K540350K217650
1737.7G40460515J630008J722396J740038J490653J211464J375139J978636J899659
1754G53508508J436591J276434J083314J181007J406550J060069O15716M04298Q08954
1772.4G62781441J632512J627981J119316Q54552Q81851R75966J009405O38664K03907
$$ plain form
1790.7 771725595 772390902 773685515 774785221 775555253 776393831 777458191 778483033 779288471 779966235
1809.1 779966235 780729294 781601429 782411635 783169925 783939004 784478307 784673572 784944773 785411298 785956681
1829.5 785956681 786799312 787605524 788063049 788465261 788797319 788685381 788449883 788877606 789687097 790310860
1849.9 790310860 790662289 790818930 790952981 791187763 791510165 791756034 791736424 791452944 791416645 792073071
1870.3 792073071 792859554 793302417 793626487 794036984 794463694 794781387 794982135 795128345 795343220 795801759
1890.7 795801759 796245456 796423018 796623051 797006309 797374964 797542036 797538519 797536910 797690690 797996521
1911.1 797996521 798193395 798081458 797951519 798184037 798500896 798673093 798883975 799139082 799384594 799602032
1931.5 799602032 799726784 799794912 799912751 800026357 800072789 800205052 800476968 800794244 801143706 801490188
$$ packed form
1790.7G71725595O65307J294613J099706P70032Q38578J064360J024842Q05438O77764
1809.1G79966235P63059Q72135Q10206P58290P69079N39303J95265K71201M66525N45383
1829.5G85956681Q42631Q06212M57525M02212L32058j11938k35498M27723Q09491O23763
1849.9G90310860L51429J56641J34051K34782L22402K45869j9610k83480l6299O56426
1870.3G92073071P86483M42863L24070M10497M26710L17693K00748J46210K14875M58539
1890.7G95801759M43697J77562K00033L83258L68655J67072l517j609J53780L05831
1911.1G97996521J96874j11937j29939K32518L16859J72197K10882K55107K45512K17438
1931.5G99602032J24752O8128J17839J13606M6432J32263K71916L17276L49462L46482
$$ plain form
1951.9 801490188 801729023 801865578 802064240 802404583 802739680 802880108 802889407 803068697 803469837 803810894
1972.3 803810894 803934753 803969562 804112315 804369807 804583430 804624915 804540634 804488599 804537714 804664195
1992.6 804664195 804780245 804810762 804839313 804920793 804917932 804735661 804457188 804217100 804019451 803720355
2013 803720355 803247273 802746236 802377641 802082479 801708817 801205158 800651193 800163627 799762845 799329996
2033.4 799329996 798782110 798195422 797713041 797393262 797120512 796769023 796416223 796248972 796256244 796225071
2053.8 796225071 796088696 796013713 796109855 796274424 796362042 796378374 796437323 796583056 796761990 796883941
2074.2 796883941 796906233 796899199 796993375 797221601 797438562 797531962 797592223 797767699 798037708 798238873 798315942
2096.7 798315942 798397601 798608243 798906803 799130321 799233794 799343526 799530983 799726248 799818456 799809933
$$ packed form
1951.9H01490188K38835J36555J98662L40343L35097J40428R299J79290M01140L41057
1972.3H03810894J23859L4809J42753K57492K13623M1485q4281n2035M9115J26481
1992.6H04664195J16050L0517K8551Q1480k861j82271k78473k40088j97649k99096
2013H03720355m73082n01037l68595k95162l73662n03659n53965m87566m00782m32849
2033.4G99329996n47886n86688m82381l19779k72750l51489l52800j67251P272l1173
2053.8G96225071j36375p4983R6142J64569Q7618J6332N8949J45733J78934J21951
2074.2G96883941K2292p034R4176K28226K16961R3400O0261J75476K70009K01165P7069
2096.7G98315942Q1659K10642K98560K23518J03473J09732J87457J95265R2208q523
$$ plain form
2117.1 799809933 799829006 799951375 800107896 800182700 800152123 800106525 800141394 800237060 800282657 800229847 800197244
2139.5 800197244 800301433 800459206 800515652 800467670 800458789 800599277 800855994 801106870 801306844 801549554
2159.9 801549554 801931858 802386224 802801073 803211868 803716660 804340482 805003405 805609226 806142569 806679785
2180.3 806679785 807318747 808028102 808642209 809112251 809594452 810187936 810803592 811332405 811809003 812335014
2200.7 812335014 812938869 813559711 814112544 814593196 815100729 815702975 816329658 816863358 817293346 817719042
2221.1 817719042 818212390 818738401 819195867 819539607 819848776 820213437 820600450 820930481 821211398 821511984
2241.5 821511984 821860492 822193384 822447896 822647274 822875142 823186040 823534250 823847711 824117839 824401855
2261.9 824401855 824750066 825123489 825445533 825733125 826053381 826424837 826802313 827101350 827353954 827666283
$$ packed form
2117.1G99809933J9073J22369J56521P4804l0577m5598L4869R5666M5597n2810l2603
2139.5H00197244J04189J57773N6446m7982q881J40488K56717K50876J99974K42710
2159.9H01549554L82304M54366M14849M10795N04792O23822O62923O05821N33343N37216
2180.3H06679785O38962P09355O14107M70042M82201N93484O15656N28813M76598N26011
2200.7H12335014O03855O20842N52833M80652N07533O02246O26683N33700M29988M25696
2221.1H17719042M93348N26011M57466L43740L09169L64661L87013L30031K80917L00586
2241.5H21511984L48508L32892K54512J99378K27868L10898L48210L13461K70128K84016
2261.9H24401855L48211L73423L22044K87592L20256L71456L77476K99037K52604L12329
$$ plain form
2282.3 827666283 828013361 828302324 828510523 828679204 828864574 829091907 829322040 829503953 829666078 829863310
2302.7 829863310 830090106 830317557 830507934 830646455 830757737 830878019 831034720 831230283 831449807 831590354
2323.1 831590354 831645310 831762493 831894159 831905663 831841350 831768513 831695020 831661224 831621647 831469774 831216395
2345.5 831216395 830890596 830581427 830457866 830561221 830736101 830877244 830919206 830877662 830837727 830729902
2365.9 830729902 830422819 830017686 829666555 829356492 829087615 828856111 828627527 828410327 828204691 828017414
2386.3 828017414 827880323 827749252 827561080 827337265 827126026 826929331 826697111 826392114 826045990 825717509
2406.7 825717509 825430989 825157642 824815392 824376881 823900819 823431075 822975755 822517514 822023571 821476579
2427.1 821476579 820895195 820314527 819745779 819154739 818523288 817892373 817294657 816722929 816142559 815532446
$$ packed form
2282.3H27666283L47078K88963K08199J68681J85370K27333K30133J81913J62125J97232
2302.7H29863310K26796K27451J90377J38521J11282J20282J56701J95563K19524J40547
2323.1H31590354N4956J17183J31666J1504o4313p2837p3493l3796l9577j51873k53379
2345.5H31216395l25799l09169j23561J03355J74880J41143M1962m1544l9935j07825
2365.9H30729902l07083m05133l51131l10063k68877k31504k28584k17200k05636j87277
2386.3H28017414j37091j31071j88172k23815k11239j96695k32220l04997l46124l28481
2406.7H25717509k86520k73347l42250m38511m76062m69744m55320m58241m93943n46992
2427.1H21476579n81384n80668n68748n91040o31451o30915n97716n71728n80370o10113
$$ plain form
2447.5 815532446 814909577 814294517 813702703 813129187 812576056 812067509 811561048 811016142 810465574 809932888
2467.9 809932888 809429109 808966756 808530688 808067381 807579219 807150722 806777239 806381047 805952907 805539191
2488.3 805539191 805209517 804990649 804800451 804542661 804232419 803938568 803689539 803469658 803227484 802956462
2508.7 802956462 802698314 802448273 802158773 801797628 801400959 801037490 800699472 800301015 799809813 799284160
2529 799284160 798778296 798276305 797711492 797069132 796416759 795802772 795210958 794601858 793940067 793275297
2549.4 793275297 792691350 792155623 791578770 790954471 790346801 789766133 789189160 788616061 788012922 787385702
2569.8 787385702 786818206 786324680 785817385 785242319 784662485 784153938 783703566 783243358 782711685 782169580
2590.2 782169580 781737983 781401038 781044781 780622125 780170619 779724479 779270053 778738499 778092563 777380407
$$ packed form
2447.5H15532446o22869o15060n91814n73516n53131n08547n06461n44906n50568n32686
2467.9H09932888n03779m62353m36068m63307m88162m28497l73483l96192m28140m13716
2488.3H05539191l29674k18868j90198k57790l10242k93851k49029k19881k42174k71022
2508.7H02956462k58148k50041k89500l61145l96669l63469l38018l98457m91202n25653
2529G99284160n05864n01991n64813o42360o52373o13987n91814o09100o61791o64770
2549.4G93275297n83947n35727n76853o24299o07670n80668n76973n73099o03139o27220
2569.8G87385702n67496m93526n07295n75066n79834n08547m50372m60208n31673n42105
2590.2G82169580m31597l36945l56257m22656m51506m46140m54426n31554o45936p12156
$$ plain form
2610.6 777380407 776658416 775925577 775106430 774154663 773126781 772098601 771063268 769931614 768670678
2629 768670678 767373860 766128898 764902472 763611317 762246072 760874331 759554803 758283079 756986856
2647.3 756986856 755630672 754308224 753101885 751964033 750788867 749520600 748237252 747071683
2663.7 747071683 746020734 744932175 743734956 742551923 741518497 740623593 739721000 738713205 737678766
2682 737678766 736739933 735905051 735064268 734114408 733082116 732071579 731105924 730108917 729012430
2700.4 729012430 727843344 726696312 725586474 724406362 723128438 721866250 720676303 719537556
2716.7 719537556 718393743 717186630 715942681 714751482 713689864 712702632 711648524 710537136
2733 710537136 709510624 708597064 707688868 706708848 705697060 704745889 703879058 703043640 702166796 701274037
$$ packed form
2610.6G77380407p21991p32839q19147r51767j027882j028180j035333j131654j260936
2629G68670678j296818j244962j226426j291155j365245j371741j319528j271724j296223
2647.3G56986856j356184j322448j206339j137852j175166j268267j283348j165569
2663.7G47071683j050949j088559j197219j183033j033426q94904r02593j007795j034439
2682G37678766r38833q34882q40783r49860j032292j010537r65655r97007j096487
2700.4G29012430j169086j147032j109838j180112j277924j262188j189947j138747
2716.7G19537556j143813j207113j243949j191199j061618r87232j054108j111388
2733G10537136j026512r13560r08196r80020j011788r51171q66831q35418q76844q92759
$$ plain form
2753.4 701274037 700495541 699842036 699159503 698377788 697593927 696876287 696202338 695487857 694658995 693756521
2773.8 693756521 692868233 692004561 691051424 689917326 688680291 687463284 686274171 685012937 683588862
2792.2 683588862 682020605 680407465 678787708 677077770 675210178 673232198 671206713 669137716
2808.5 669137716 666984737 664698184 662315547 659907877 657453537 654898763 652229726 649471045
2824.8 649471045 646651447 643766284 640760839 637606323 634355068 631057858 627704680 624212027
2841.1 624212027 620523512 616699934 612815797 608878493 604857981 600733757 596524358 592211902
2857.4 592211902 587672830 582717478 577227056 571255922 564891279 558175206 551200509 544111431
2873.7 544111431 537103772 530452609 524425805 519152880 514637113 510919452 508067369 506002009
$$ packed form
2753.4G01274037p78496o53505o82533p81715p83861p17640o73949p14481q28862r02474
2773.8F93756521q88288q63672r53137j134098j237035j217007j189113j261234j424075
2792.2F83588862j568257j613140j619757j709938j867592j977980k025485k068997
2808.5F69137716k152979k286553k382637k407670k454340k554774k669037k758681
2824.8F49471045k819598k885163l005445l154516l251255l297210l353178l492653
2841.1F24212027l688515l823578l884137l937304m020512m124224m209399m312456
2857.4E92211902m539072m955352n490422n971134o364643o716073o974697p089078
2873.7E44111431p007659o651163o026804n272925m515767l717661k852083k065360
$$ plain form
2890.1 506002009 504536629 503487527 502670646 501921535 501101136 500061274 498677999 496876448 494617045
2908.4 494617045 491902858 488729566 485077888 481073797 477039099 473289162 470025480 467386365
2924.7 467386365 465514660 464586496 464725018 465954363 468240380 471548438 475817680 480896771 486604631
2943.1 486604631 492776692 499263376 505990863 512938678 520009995 527061820 534032047 540881395
2959.4 540881395 547493815 553773701 559723616 565382659 570808291 576105177 581349790 586531162
2975.7 586531162 591655076 596701205 601548553 606101096 610310376 614153922 617651820 620773256
2992 620773256 623431683 625617385 627340317 628561497 629328489 629697561 629637301 629182220 628418863
3010.4 628418863 627350509 625932276 624164701 622094929 619825482 617455959 614928186 612163901
$$ packed form
2890.1E06002009j465380j049102q16881p49111q20399j039862j383275j801551k259403
2908.4D94617045k714187l173292l651678m004091m034698l749937l263682k639115
2924.7D67386365j871705r28164J38522J229345K286017L308058M269242N079091N707860
2943.1D86604631O172061O486684O727487O947815P071317P051825O970227O849348
2959.4E40881395O612420O279886N949915N659043N425632N296886N244613N181372
2975.7E86531162N123914N046129M847348M552543M209280L843546L497898L121436
2992F20773256K658427K185702J722932J221180P66992L69072o0260m55081p63357
3010.4F28418863j068354j418233j767575k069772k269447k369523k527773k764285
$$ plain form
3026.7 612163901 609250963 606298864 603333652 600258529 596987605 593655527 590331852 586906791
3043 586906791 583343744 579684377 576012671 572349906 568618238 564853013 561106026 557334006 553564191
3061.4 553564191 549842775 546121240 542318821 538413644 534475923 530609369 526881278 523256719
3077.7 523256719 519557059 515690804 511797726 507958829 504141390 500327885 496474594 492619902
3094 492619902 488885522 485269159 481652200 477961093 474270135 470704675 467207938 463625163 460079223
3112.4 460079223 456781626 453583688 450238794 446691871 443040788 439496249 436159521 432942390
3128.7 432942390 429710299 426459461 423317343 420331895 417378128 414279073 411124587 408126414
3145 408126414 405270845 402557820 399986595 397299290 394372076 391460836 388728797 386117816 383595347
$$ packed form
3026.7F12163901k912938k952099k965212l075123l270924l332078l323675l425061
3043E86906791l563047l659367l671706l662765l731668l765225l746987l772020l769815
3061.4E53564191l721416l721535l802419l905177l937721l866554l728091l624559
3077.7E23256719l699660l866255l893078l838897l817439l813505l853291l854692
3094D92619902l734380l616363l616959l691107l690958l565460l496737l582775l545940
3112.4D60079223l297597l197938l344894l546923l651083l544539l336728l217131
3128.7D32942390l232091l250838l142118k985448k953767l099055l154486k998173
3145D08126414k855569k713025k571225k687305k927214k911240k732039k610981k522469
$$ plain form
3163.4 383595347 381140798 378712237 376288474 373875916 371514499 369231910 367004007 364826947
3179.7 364826947 362687796 360576510 358549565 356638640 354771346 352844507 350878268 348944455
3196 348944455 347069561 345295131 343635947 342039078 340452552 338861614 337286264 335748404 334265858
3214.3 334265858 332854033 331457734 330058724 328705996 327358663 326009631 324759930 323700368
3230.7 323700368 322758824 321635067 320291787 319044799 317977220 317002535 316113353 315216631 314223260
3249 314223260 313240260 312375546 311566174 310717195 309865415 309074104 308329254 307640612 307051152 306516737
3269.4 306516737 305871993 305061132 304216355 303430706 302697629 302004427 301354885 300731629 300137222 299641490
3289.8 299641490 299203932 298647910 297913611 297085732 296306401 295714915 295304477 294822901 294050395 293090016
$$ packed form
3163.4C83595347k454549k428561k423763k412558k361417k282589k227903k177060
3179.7C64826947k139151k111286k026945j910925j867294j926839j966239j933813
3196C48944455j874894j774430j659184j596869j586526j590938j575350j537860j482546
3214.3C34265858j411825j396299j399010j352728j347333j349032j249701j059562
3230.7C23700368r41544j123757j343280j246988j067579r74685q89182q96722r93371
3249C14223260r83000q64714q09372q48979q51780p91311p44850o88642n89460n34415
3269.4C06516737o44744q10861q44777p85649p33077o93202o49542o23256n94407m95732
3289.8B99641490m37558n56022p34299q27879p79331n91486m10438m81576p72506r60379
$$ plain form
3310.2 293090016 292129934 291251361 290463120 289726585 289024413 288357347 287692636 286930293 286048383 285182536
3330.6 285182536 284363925 283572048 282856911 282100946 281207889 280308992 279432774 278553635 277769268 276970863
3351 276970863 275959551 274857849 273889750 273085892 272314370 271471411 270690501 270037800 269245863 268156081
3371.4 268156081 267006755 266059369 265257210 264463872 263647079 262860179 262227386 261824787 261605382
3389.7 261605382 261273950 260584712 259821177 259418905 259271502 258856922 258101493 257445723 257007211 256619841
3410.1 256619841 256250799 255873859 255482733 255141765 254852355 254610389 254469126 254459560 254564315 254655957
3430.5 254655957 254723728 254876643 254924655 254689604 254417956 254395425 254591703 254804671 254982978 255237520
3450.9 255237520 255563587 255883008 256237417 256690264 257093757 257460088 258091301 258918732 259476095 259598225
$$ packed form
3310.2B93090016r60082q78573p88241p36535p02172o67066o64711p62343q81910q65847
3330.6B85182536q18611p91877p15137p55965q93057q98897q76218q79139p84367p98405
3351B76970863j011312j101702r68099q03858p71522q42959p80910o52701p91937j089782
3371.4B68156081j149326r47386q02159p93338q16793p86900o32793m02599k19405
3389.7B61605382l31432o89238p63535m02272j47403m14580p55429o55770m38512l87370
3410.1B56619841l69042l76940l91126l40968k89410k41966j41263r566J04755R1642
3430.5B54655957O7771J52915M8012k35051k71648k2531J96278K12968J78307K54542
3450.9B55237520L26067L19421L54409M52847M03493L66331O31213Q27431N57363J22130
$$ plain form
3471.3 259598225 259690166 260096192 260795683 261501253 261911064 262258589 262861222 263506055 264046520 264649928
3491.7 264649928 265338987 266057372 266768038 267453015 268107295 268646359 269109696 269650847 270381570 271353394
3512.1 271353394 272331744 273085386 273772985 274633855 275695682 276694834 277483463 278275967 279271543
3530.5 279271543 280460894 281746268 282988161 284135222 285366178 286733061 288034379 289189130
3546.8 289189130 290422052 291791767 293210655 294780970 296488047 298212767 299970418 301677585
3563.1 301677585 303212106 305012614 307509333 310206681 312669933 315077573 317631751 320383161
3579.4 320383161 323316842 326240122 328896046 331506938 334671557 338123769 341440380 344849259
3595.7 344849259 348535061 352298826 356069952 359802395 363297582 366807908 370678097 374734879
$$ packed form
3471.3B59598225R1941M06026O99491P05570M09811L47525O02633O44833N40465O03408
3491.7B64649928O89059P18385P10666O84977O54280N39064M63337N41151P30723R71824
3512.1B71353394R78350P53642O87599Q60870J061827R99152P88629P92504R95576
3530.5B79271543J189351J285374J241893J147061J230956J366883J301318J154751
3546.8B89189130J232922J369715J418888J570315J707077J724720J757651J707167
3563.1C01677585J534521J800508K496719K697348K463252K407640K554178K751410
3579.4C20383161K933681K923280K655924K610892L164619L452212L316611L408879
3595.7C44849259L685802L763765L771126L732443L495187L510326L870189M056782
$$ plain form
3612.1 374734879 378859311 382918090 386950195 391475558 396190286 400334507 403786451 407419682
3628.4 407419682 412163734 417081565 421659142 426109850 430454880 434760928 438960969 442727149
3644.7 442727149 446086138 449997216 455082804 460123003 464571148 469221801 474035561 478370816
3661 478370816 482338548 486080766 489344805 492544085 496309072 499816507 503255725 507573485 511889756
3679.4 511889756 515762568 519297659 522280872 524939954 527912259 531309068 534676015 537717581
3695.7 537717581 540346265 542648315 545070767 547778845 550132871 551807165 553307235 555543184
3712 555543184 558487296 561128795 563147843 564818084 566469431 568230450 570155442 572073758 573476851
3730.3 573476851 574440718 575721741 577850103 580228150 581748784 582317829 583305895 585134029 586447597
$$ packed form
3612.1C74734879M124432M058779M032105M525363M714728M144221L451944L633231
3628.4D07419682M744052M917831M577577M450708M345030M306048M200041L766180
3644.7D42727149L358989L911078N085588N040199M448145M650653M813760M335255
3661D78370816L967732L742218L264039L199280L764987L507435L439218M317760M316271
3679.4E11889756L872812L535091K983213K659082K972305L396809L366947L041566
3695.7E37717581K628684K302050K422452K708078K354026J674294J500070K235949
3712E55543184K944112K641499K019048J670241J651347J761019J924992J918316J403093
3730.3E73476851R63867J281023K128362K378047J520634N69045R88066J828134J313568
$$ plain form
3748.7 586447597 587752163 590014458 592258036 593811989 595203042 596895933 598481834 599766314
3765 599766314 600947022 602137208 603611708 605244279 606606901 607692480 608795524 610030353 611173928
3783.4 611173928 612324417 613607347 614809155 615822792 616589010 617255688 617971063 618498266 619310558
3801.7 619310558 620657384 621832669 623143971 624609411 625511765 625803411 626182556 626873910 627550900
3820.1 627550900 628828764 630404770 631517649 632325947 632897079 633403063 634004295 634517550 635168433
3838.4 635168433 636236370 637506127 638835967 639881253 640166521 639553070 639022231 640392661 642477989
3856.8 642477989 643677294 644148409 644428253 644989729 645558238 645925224 646632254 647641003 648702860
3875.2 648702860 649482727 649793446 650223732 650820911 651462853 652250946 652785420 653287530 654138744 654754698
$$ packed form
3748.7E86447597J304566K262295K243578J553953J391053J692891J585901J284480
3765E99766314J180708J190186J474500J632571J362622J085579J103044J234829J143575
3783.4F11173928J150489J282930J201808J013637P66218O66678P15375N27203Q12292
3801.7F19310558J346826J175285J311302J465440R02354K91646L79145O91354O76990
3820.1F27550900J277864J576006J112879Q08298N71132N05984O01232N13255O50883
3838.4F35168433J067937J269757J329840J045286K85268o13451n30839J370430K085328
3856.8F42477989J199305M71115K79844N61476N68509L66986P07030J008749J061857
3875.2F48702860P79867L10719M30286N97179O41942P88093N34474N02110Q51214O15954
$$ plain form
3895.5 654754698 654748619 654517353 654625177 655333340 656507313 657649577 658466280 658915579 658979177 658964217
3915.9 658964217 659308195 659889460 660303771 660613596 661028981 661363721 661533117 661869109 662480414 663034499
3936.3 663034499 663346946 663512290 663728774 664101660 664490700 664846122 665240705 665630043 665992081 666329086
3956.7 666329086 666652501 667023838 667418242 667728901 667957366 668185234 668413281 668672502 669040143 669452786
3977.1 669452786 669802785 670102894 670389771 670622468 670798004 671022773 671305776 671554685 671784937 672046542
3997.5 672046542
$$ packed form
3895.5F54754698o079k31266J07824P08163J173973J142264Q16703M49299O3598j4960
3915.9F58964217L43978N81265M14311L09825M15385L34740J69396L35992O11305N54085
3936.3F63034499L12447J65344K16484L72886L89040L55422L94583L89338L62038L37005
3956.7F66329086L23415L71337L94404L10659K28465K27868K28047K59221L67641M12643
3977.1F69452786L49999L00109K86877K32697J75536K24769K83003K48909K30252K61605
3997.5F72046542
##END=$$ End of the data block
