##TITLE=Amostra 2 - Marcela $$ Begin of the data block
##JCAMP-DX=5.00 $$ ACD/SpecManager v 10.08
##SPECTROMETER/DATA SYSTEM=Alpha
##DATE=24 Oct 2013 10:57:42
##DATA TYPE=INFRARED SPECTRUM
##DATA CLASS=XYDATA
##ORIGIN=
##OWNER=
##NPOINTS=1765
##FIRSTX=399.75695801
##LASTX=3997.56933594
##MAXX=3997.56933594
##MINX=399.75695801
##MAXY=0.83310860
##MINY=0.16267444
##XFACTOR=1.0000000000
##YFACTOR=1.000000000000000e-9
##FIRSTY=0.47609699
##DELTAX=2.03957629
##XUNITS=1/CM
##YUNITS=ARBITRARY UNITS
##XYDATA=(X++(Y..Y))
$$ plain form
399.8 476096988 472373277 470751882 469894230 469033837 468879849 470518023 473146588 474318594 472819388
418.1 472819388 470484763 469326049 468268365 466152251 463130444 460042000 457782477 456310093
434.4 456310093 455118984 454842687 456378937 459801346 464266479 468349695 471415281 473834604 475999832
452.8 475999832 477232069 476738840 475377709 474157929 472615212 470140249 466532916 462378681 458458871
471.1 458458871 454894722 451602519 448608518 446380794 445301294 445041329 444965035 444826454 444745570
489.5 444745570 444554299 443836480 442414850 440514714 438517362 436567307 434389323 431589574 428261995
507.9 428261995 424824566 421166897 416883826 412089914 407259256 402837098 399273723 396809131
524.2 396809131 395398349 395219982 396477550 399053782 402823240 407786697 413762987 419935912 425006121
$$ packed form
399.8D76096988l723711j621395q57652q60393j53988J638174K628565J172006j499206
418.1D72819388k334625j158714j057684k116114l021807l088444k259523j472384
434.4D56310093j191109k76297J536250L422409M465133M083216L065586K419323K165228
452.8D75999832J232237m93229j361131j219780j542717k474963l607333m154235l919810
471.1D58458871l564149l292203k994001k227724j079500k59965p6294j38581q0884
489.5D44745570j91271p17819j421630j900136j997352j950055k177984k799749l327579
507.9D28261995l437429l657669m283071m793912m830658m422158l563375k464592
524.2C96809131j410782j78367J257568K576232L769458M963457N976290O172925N070209
$$ plain form
542.5 425006121 428103000 429265678 429006428 427768201 425718635 422726423 418743134 414062083 408758521
560.9 408758521 402452707 395136476 387338132 379821897 373493910 369130045 367314816 368248165 371742904
579.2 371742904 377472401 384802550 392660409 400001436 406113774 410650760 413461357 414666355
595.6 414666355 414724976 414303780 413963228 413791329 413788557 414239198 415404558 417235166 419748574 423116386
616 423116386 427319854 432096660 437276900 442723364 447976708 452681571 456774920 460263878 463090330
634.3 463090330 465262800 466999233 468541592 470005780 471369386 472539246 473592460 474786162
650.6 474786162 476170212 477555960 478829592 480061471 481374830 482737750 483913302 484985769
666.9 484985769 486355722 487842351 489364713 490898520 492314219 493771046 495389730 497039378
$$ packed form
542.5D25006121L096879J162678k59250j238227k049566k992212l983289m681051n303562
560.9D08758521o305814p316231p798344p516235o327987m363865j815229R33349L494739
579.2C71742904N729497P330149P857859P341027O112338M536986K810597J204998
595.6D14666355N8621m21196l40552j71899k772M50641J165360J830608K513408L367812
616D23116386M203468M776806N180240N446464N253344M704863M093349L488958K826452
634.3D63090330K172470J736433J542359J464188J363606J169860J053214J193702
650.6D74786162J384050J385748J273632J231879J313359J362920J175552J072467
666.9D84985769J369953J486629J522362J533807J415699J456827J618684J649648
$$ plain form
683.3 497039378 498393267 499285012 499848157 500067115 499562770 497977436 495297223 491815001 487841159
701.6 487841159 483790278 480416983 478475094 478373021 480225474 483866960 488862932 494859964 501882732
720 501882732 509598017 517321944 524772644 531790912 538155854 543598413 547815979 550780058 552763462
738.3 552763462 553814650 553436399 551171303 547093034 541676581 535395920 528486788 521074891 513719678
756.7 513719678 507364333 502646208 499903589 499595314 502253056 508085072 516722918 527182043
773 527182043 538145423 548717082 558626890 567630291 575368881 581802964 587324679 592513025
789.3 592513025 597724676 602903545 608101964 613851428 620338976 626829386 632371247 636707783
805.6 636707783 640334725 643715143 646667182 648720980 649845302 650402308 650673151 650231421 648186564
$$ packed form
683.3D97039378J353889Q91745N63145K18958n04345j585334k680213l482222l973842
701.6D87841159m050881l373295j941889j02073J852453L641486M995972N997032P022768
720E01882732P715285P723927P450700P018268O364942N442559M217566K964079J983404
738.3E52763462J051188l78251k265096m078269n416453o280661o909132p411897p355213
756.7E13719678o355345m718125k742619l08275K657742N832016Q637846J0459125
773E27182043J0963380J0571659R909808R003401P738590O434083N521715N188346
789.3E92513025N211651N178869N198419N749464O487548O490410N541861M336536
805.6F36707783L626942L380418K952039K053798J124322N57006K70843m41730k044857
$$ plain form
824 648186564 644264400 638979316 632782102 625484407 616981030 607985318 599594831 592346907 585978746
842.3 585978746 580236852 575390577 571664333 568795085 566179156 563349605 560601771 559012890
858.7 559012890 559940934 564432025 572622895 583839834 597045124 610619128 622451246 630943775
875 630943775 635750115 637273312 635652363 630741298 622949302 613652468 604390562 595822453 587815702
893.3 587815702 580259919 573394895 567283690 561255515 554293573 545932353 536401868 525972962
909.6 525972962 514579237 502210736 489520878 477732241 467931688 460643351 455802768 453085482
926 453085482 452261627 453127384 455336183 458548993 462816060 468482703 475484341 482628912 487501949
944.3 487501949 487641186 482065290 471324623 456538647 438883752 419475287 399150819 378285974
$$ packed form
824F48186564l922164n285084o197214p297695q503377q995712q390487p247924o368161
842.3E85978746n741894m846275l726244k869248k615929k829551k747834j588881
858.7E59012890R28044M491091Q190870J1216939J3205290J3574004J1832118Q492529
875F30943775M806340J523197j620949m911065p791996r296834r261906q568109q006751
893.3E87815702p555783o865024o111205o028175o961942q361220r530485j0428906
909.6E25972962j1393725j2368501j2689858j1788637r800553p288337m840583k717286
926D53085482q23855Q65757K208799L212810M267067N666643P001638P144571M873037
944.3D87501949J39237n575896j0740667j4785976j7654895j9408465k0324468k0864845
$$ plain form
960.6 378285974 356907994 335035682 312912673 290902525 269301236 248410761 228697851
974.9 228697851 210812554 195429727 183037981 173809960 167588726 164022267 162674442 163019881
991.2 163019881 164473906 166544244 168917760 171372369 173662141 175560251 176881552 177571654 177818134
1009.6 177818134 177916989 178156137 178733915 179756373 181296378 183380768 185950935 188899696 192057386
1027.9 192057386 195206791 198221296 200953111 203195930 204944283 206449464 207993478 209770113
1044.3 209770113 211858407 214278921 217165589 220801383 225421801 231095210 237937778 246249974
1060.6 246249974 256193310 267059118 276580513 281192183 278315008 269034684 257583767 247984245
1076.9 247984245 241895273 239201084 239199355 241154611 244535312 249016196 254295707 260005474 265606821
$$ packed form
960.6C78285974k1377980k1872312k2123009k2010148k1601289k0890475j9712910
974.9B28697851j7885297j5382827j2391746r228021o221234l566459j347825L45439
991.2A63019881J454025K070338K373516K454609K289772J898110J321301O90102K46480
1009.6A77818134R8855K39148N77778J022458J540005K084390K570167K948761L157690
1027.9A92057386L149405L014505K731815K242819J748353J505181J544014J776635
1044.3B09770113K088294K420514K886668L635794M620418N673409O842568Q312196
1060.6B46249974R943336J0865808R521395M611670k877175r280324j1450917r599522
1076.9B47984245o088972k694189j729J955256L380701M480884N279511N709767N601347
$$ plain form
1095.2 265606821 270394355 273910880 276215762 277791291 279293656 281257182 283901453 287176818
1111.6 287176818 290877998 294656187 298098505 300950676 303322703 305643290 308405876 311910421
1127.9 311910421 316080421 320239961 323202074 323745847 321122527 315410525 307490408 298619181
1144.2 298619181 289818108 281710327 274733722 269180566 265150279 262596548 261430770 261652023
1160.5 261652023 263406277 266875029 272265196 279755592 289364845 300989062 314419180 329223245
1176.8 329223245 344823897 360690445 376364917 391417891 405347109 417563200 427583665
1191.1 427583665 435290933 440902382 444795966 447457403 449503154 451665282 454528809 458323121
1207.4 458323121 463007420 468453616 474491268 480736434 486527562 491236329 494544566 496443450
$$ packed form
1095.2B65606821M787534L516525K304882J575529J502365J963526K644271L275365
1111.6B87176818L701180L778189L442318K852171K372027K320587K762586L504545
1127.9C11910421M170000M159540K962113N43773k623320n712002p920117q871227
1144.2B98619181q801073q107781o976605n553156m030287k553731j165778K21253
1160.5B61652023J754254L468752N390167P490396R609253J1624217J3430118J4804065
1176.8C29223245J5600652J5866548J5674472J5052974J3929218J2216091J0020465
1191.1D27583665P707268N611449L893584K661437K045751K162128K863527L794312
1207.4D58323121M684299N446196O037652O245166N791128M708767L308237J898884
$$ plain form
1223.7 496443450 497126877 496813804 495714873 494188428 492705196 491546392 490733624 490274698 490303487
1242.1 490303487 491016656 492492497 494568527 496973336 499569416 502355456 505212247 507914662
1258.4 507914662 510434926 512908459 515481651 518242419 521043837 523583353 525661647 527219951
1274.7 527219951 528227270 528616071 528388977 527746499 526919246 525931239 524636805 522946656 520966828
1293.1 520966828 518891931 516842067 514888763 513171613 511869907 510997593 510300756 509468377 508319497
1311.4 508319497 506831229 505046785 502875626 500170231 496855259 492879361 488276243 483160883
1327.8 483160883 477717757 472346276 467576891 463745028 460914344 459038824 457928061 457206249
1344.1 457206249 456578553 455860466 454885900 453598529 452086151 450549960 448998541 447248697 445448071
$$ packed form
1223.7D96443450O83427l13073j098931j526445j483232j158804q12768m58926K8789
1242.1D90303487P13169J475841K076030K404809K596080K786040K856791K702415
1258.4E07914662K520264K473533K573192K760768K801418K539516K078294J558304
1274.7E27219951J007319L88801k27094o42478q27253r88007j294434j690149j979828
1293.1E20966828k074897k049864j953304j717150j301706q72314o96837q32379j148880
1311.4E08319497j488268j784444k171159k705395l314972l975898m603118n115360
1327.8D83160883n443126n371481m769385l831863k830684j875520j110763p21812
1344.1D57206249o27696p18087r74566j287371j512378j536191j551419j749844j800626
$$ plain form
1362.4 445448071 444107413 443300366 442866027 442869902 443320304 444377303 446068347 448039323 450036079
1380.8 450036079 452177852 454876065 458568186 462837279 466406435 468743026 470069170 470691383
1397.1 470691383 470732838 470232993 469061852 467352748 465619236 463928640 462159842 460429072 458836615
1415.5 458836615 457410812 456621110 456684232 457044691 457563967 458292603 459241182 460442573 461578727
1433.8 461578727 462762475 464687258 466903478 468720019 469907373 470360428 470193028 469539076 468251467
1452.2 468251467 466155291 463199943 461037129 461068302 462051541 464058340 467914969 473039657 479219973
1470.5 479219973 487736791 497912258 507880867 517370164 526527047 535367370 543304980 550472498
1486.8 550472498 557888150 565859020 572835922 578556716 584333181 590422034 595950127 600082576
$$ packed form
1362.4D45448071j340658q07047m34339L875M50402J056999J691044J970976J996756
1380.8D50036079K141773K698213L692121M269093L569156K336591J326144O22213
1397.1D70691383M1455m99845j171141j709104j733512j690596j768798j730770j592457
1415.5D58836615j425803p89702O3122L60459N19276P28636R48579J201391J136154
1433.8D61578727J183748J924783K216220J816541J187354M53055j67400o53952j287609
1452.2D68251467k096176k955348k162814L1173R83239K006799L856629N124688O180316
1470.5D79219973Q516818J0175467R968609R489297R156883Q840323P937610P167518
1486.8E50472498P415652P970870O976902N720794N776465O088853N528093M132449
$$ plain form
1503.2 600082576 603251457 607633173 613072336 617787421 621642590 624738276 627617657 630542755
1519.5 630542755 633909166 637617946 640907407 644056916 646956742 649412870 651986837 654339731
1535.8 654339731 655602574 656900227 659768760 663118899 666026413 668226123 670114398 671977282
1552.1 671977282 673424244 673907697 674344003 677197754 680491745 682516515 683723092 684549212 685824096
1570.5 685824096 687259614 687883079 688333690 689365625 690325260 690807879 690814972 690310776 689429879 688332081
1590.9 688332081 687014759 685269177 683039546 680457711 677545965 674293697 670528173 666109264
1607.2 666109264 661219180 656271398 651172340 644995213 637995601 632409990 627299547 621392906
1623.5 621392906 615783453 610641241 605845511 601716578 597435892 592821121 590028822 588824034
$$ packed form
1503.2F00082576L168881M381716N439163M715085L855169L095686K879381K925098
1519.5F30542755L366411L708780L289461L149509K899826K456128K573967K352894
1535.8F54339731J262843J297653K868533L350139K907514K199710J888275J862884
1552.1F71977282J446962M83453M36306K853751L293991K024770J206577Q26120J274884
1570.5F85824096J435518O23465M50611J031935R59635M82619P093n04196q80897j097798
1590.9F88332081j317322j745582k229631k581835k911746l252268l765524m418909
1607.2F66109264m890084m947782n099058o177127o999612n585611n110443n906641
1623.5F21392906n609453n142212m795730m128933m280686m614771k792299j204788
$$ plain form
1639.8 588824034 587866247 586856663 585990429 586319149 587329566 588336885 591299474 595468462 598928094
1658.2 598928094 602086544 605791926 610228896 614253998 618082821 622880399 627938330 633133829
1674.5 633133829 638898671 644087732 648203671 652199984 658134103 664620996 669785321 674525023
1690.8 674525023 678542614 682131290 685866952 689599693 694355845 698981225 702722549 706539154
1707.1 706539154 710068464 712876379 715025246 716867864 719489098 723071516 726230025 728751123
1723.4 728751123 731036305 732914150 734274924 735181332 736557961 739106894 741282701 742878318
1739.7 742878318 744590223 746329665 747816384 749019146 750411808 752407610 754287004 755702972
1756.1 755702972 756982327 758094609 759304464 760690928 761716604 762314081 762721181 763574600 765233457
$$ packed form
1639.8E88824034r57787j009584q66234L28720J010417J007319K962589M168988L459632
1658.2E98928094L158450L705382M436970M025102L828823M797578N057931N195499
1674.5F33133829N764842N189061M115939L996313N934119O486893N164325M739702
1690.8F74525023M017591L588676L735662L732741M756152M625380L741324L816605
1707.1G06539154L529310K807915K148867J842618K621234L582418L158509K521098
1723.4G28751123K285182J877845J360774R06408J376629K548933K175807J595617
1739.7G42878318J711905J739442J486719J202762J392662J995802J879394J415968
1756.1G55702972J279355J112282J209855J386464J025676N97477M07100Q53419J658857
$$ plain form
1774.4 765233457 766824901 767918289 768802583 769702137 770653427 771636903 772263825 772482872 773176134
1792.8 773176134 774475992 775560200 776290834 777103901 778183520 779220581 780032933 780736983 781521261
1811.1 781521261 782381415 783166409 783908367 784670413 785213888 785412550 785653055 786075354 786622763 787501693
1831.5 787501693 788341105 788820326 789234161 789578915 789468825 789224327 789651573 790446162 791031837 791356683
1851.9 791356683 791523099 791688740 791944027 792264581 792507172 792487741 792185962 792118192 792763650 793562770
1872.3 793562770 794010043 794317663 794727802 795184791 795527458 795736730 795875549 796070278 796510100 796941340
1892.7 796941340 797131598 797365129 797760129 798119724 798293293 798302174 798283637 798411012 798701406 798888147
1913.1 798888147 798778355 798653543 798866630 799164951 799364626 799611568 799879014 800128222 800332963 800446689
$$ packed form
1774.4G65233457J591444J093388Q84294Q99554R51290R83476O26922K19047O93262
1792.8G73176134J299858J084208P30634Q13067J079619J037061Q12352P04050P84278
1811.1G81521261Q60154P84994P41958P62046N43475J98662K40505M22299N47409Q78930
1831.5G87501693Q39412M79221M13835L44754j10090k44498M27246P94589N85675L24846
1851.9G91356683J66416J65641K55287L20554K42591j9431l01779o7770O45458P99120
1872.3G93562770M47273L07620M10139M56989L42667K09272J38819J94729M39822M31240
1892.7G96941340J90258K33531L95000L59595J73569Q881j8537J27375K90394J86741
1913.1G98888147j09792j24812K13087K98321J99675K46942K67446K49208K04741J13726
$$ plain form
1933.5 800446689 800522268 800624847 800697923 800738394 800901175 801174402 801467299 801811337 802158296 802394390
1953.9 802394390 802546442 802764177 803104341 803432107 803582489 803611696 803794503 804178238 804511249 804670513
1974.3 804670513 804741681 804863691 805077851 805277526 805323601 805238903 805199742 805285096 805440187 805557251
1994.7 805557251 805566251 805558562 805613399 805616915 805457771 805200756 804980159 804789066 804487050 804018378 803519368
2017.1 803519368 803141236 802834332 802458644 801963747 801413894 800923824 800514102 800059140 799479723 798868895
2037.5 798868895 798386455 798067629 797788382 797468424 797176838 797034621 797027588 796984613 796839178 796749592
2057.9 796749592 796841085 797013104 797122121 797160983 797211587 797352314 797555625 797695518 797728956 797749341
2078.3 797749341 797877669 798095942 798259854 798326373 798396349 798575401 798827529 799019694 799112499 799221218
$$ packed form
1933.5H00446689P5579J02579P3076M0471J62781K73227K92897L44038L46959K36094
1953.9H02394390J52052K17735L40164L27766J50382K9207J82807L83735L33011J59264
1974.3H04670513P1168J22010K14160J99675M6075q4698l9161Q5354J55091J17064
1994.7H05557251R000p689N4837L516j59144k57015k20597j91093l02016m68672m99010
2017.1H03519368l78132l06904l75688m94897n49853m90070m09722m54962n79417o10828
2037.5G98868895m82440l18826k79247l19958k91586j42217p033m2975j45435q9586
2057.9G96749592R1493J72019J09017L8862N0604J40727K03311J39893L3438K0385
2078.3G97749341J28328K18273J63912O6519O9976J79052K52128J92165R2805J08719
$$ plain form
2098.7 799221218 799451888 799747109 799972713 800089657 800190151 800349116 800521851 800612032 800600290 800599754
2119.1 800599754 800717235 800888419 800959706 800903618 800857246 800939143 801087976 801146865 801074207 801012456 801085591
2141.5 801085591 801232159 801312745 801301777 801320672 801477551 801723957 801934421 802108943 802365601 802779853
2161.9 802779853 803265810 803695023 804098666 804591298 805219233 805900872 806507468 807019532 807550132 808196545
2182.3 808196545 808887839 809471965 809943795 810450375 811067343 811699986 812220931 812661767 813169360 813788295
2202.7 813788295 814431727 815004408 815486908 815967262 816540778 817165673 817710400 818136513 818546534 819036961
2223.1 819036961 819565952 820004702 820334792 820670307 821072817 821487367 821833134 822102904 822374403 822706282
2243.5 822706282 823044717 823294401 823472559 823716342 824066341 824407935 824690878 824958563 825243711 825572371
$$ packed form
2098.7G99221218K30670K95221K25604J16944J00494J58965J72735R0181j1742n36
2119.1H00599754J17481J71184P1287n6088m6372Q1897J48833N8889p2658o1751P3135
2141.5H01085591J46568Q0586j0968J8895J56879K46406K10464J74522K56658M14252
2161.9H02779853M85957M29213M03643M92632O27935O81639O06596N12064N30600O46413
2182.3H08196545O91294N84126M71830N06580O16968O32643N20945M40836N07593O18935
2202.7H13788295O43432N72681M82500M80354N73516O24895N44727M26113M10021M90427
2223.1H19036961N28991M38750L30090L35515M02510M14550L45767K69770K71499L31879
2243.5H22706282L38435K49684J78158K43783L49999L41594K82943K67685K85148L28660
$$ plain form
2263.9 825572371 825939059 826280534 826572299 826872587 827237010 827618897 827937961 828217149 828517675 828852355
2284.3 828852355 829158545 829370677 829543054 829756558 830007195 830248058 830430388 830561996 830716670 830929875
2304.7 830929875 831170797 831378937 831532419 831664383 831801713 831977487 832197249 832403719 832561374 832675517
2325.1 832675517 832816482 833007872 833108604 833079636 833043575 833053768 833054364 832943141 832741737 832484663 832083404
2347.5 832083404 831676543 831548393 831785679 832150698 832383394 832433343 832335532 832136214 831909955 831623137
2367.9 831623137 831252515 830824614 830420613 830119073 829870045 829622507 829393029 829174101 828956246 828776896
2388.3 828776896 828618169 828432739 828229129 828022778 827812076 827569783 827263832 826924205 826608479 826322496
2408.7 826322496 826025665 825671971 825264752 824833632 824395180 823954403 823480308 822939932 822354496 821768701
$$ packed form
2263.9H25572371L66688L41475K91765L00288L64423L81887L19064K79188L00526L34680
2284.3H28852355L06190K12132J72377K13504K50637K40863J82330J31608J54674K13205
2304.7H30929875K40922K08140J53482J31964J37330J75774K19762K06470J57655J14143
2325.1H32675517J40965J91390J00732k8968l6061J0193N96j11223k01404k57074m01259
2347.5H32083404m06861j28150K37286L65019K32696M9949r7811j99318k26259k86818
2367.9H31623137l70622m27901m04001l01540k49028k47538k29478k18928k17855j79350
2388.3H28776896j58727j85430k03610k06351k10702k42293l05951l39627l15726k85983
2408.7H26322496k96831l53694m07219m31120m38452m40777m74095n40376n85436n85795
$$ plain form
2429.1 821768701 821185172 820595264 820011854 819431186 818829894 818234086 817663848 817046583 816376746 815754533
2449.5 815754533 815188944 814607143 814003885 813442290 812947750 812460065 811927676 811370015 810838342 810363829
2469.9 810363829 809926569 809488356 809015274 808528125 808100104 807727993 807340086 806912184 806499064 806171000
2490.3 806171000 805921078 805660248 805346489 805048168 804823935 804640055 804426193 804149210 803851247 803600550
2510.7 803600550 803386211 803123355 802770615 802383602 802019060 801669776 801270247 800765455 800217748 799730778
2531.1 799730778 799267650 798707783 798044443 797370613 796750069 796176195 795590520 794947565 794284880 793684185
2551.5 793684185 793149769 792584598 791945279 791313887 790744364 790196359 789615273 788976908 788340449 787795246
2571.9 787795246 787312806 786794901 786213696 785607517 785062432 784648895 784268081 783765852 783208013 782768190
$$ packed form
2429.1H21768701n83529n89908n83410n80668o01292n95808n70238o17265o69837o22213
2449.5H15754533n65589n81801o03258n61595m94540m87685n32389n57661n31673m74513
2469.9H10363829m37260m38213m73082m87149m28021l72111l87907m27902m13120l28064
2490.3H06171000k49922k60830l13759k98321k24233j83880k13862k76983k97963k50697
2510.7H03600550k14339k62856l52740l87013l64542l49284l99529n04792n47707m86970
2531.1G99730778m63128n59867o63340o73830o20544n73874n85675o42955o62685o00695
2551.5G93684185n34416n65171o39319o31392n69523n48005n81086o38365o36459n45203
2571.9G87795246m82440n17905n81205o06179n45085m13537l80814n02229n57839m39823
$$ plain form
2592.3 782768190 782454491 782119215 781680942 781203508 780760765 780334413 779825807 779193521 778487563 777756035
2612.7 777756035 777003586 776168287 775208473 774183869 773165405 772116363 770943820 769646466 768336892
2631 768336892 767108917 765908897 764635861 763288319 761926949 760612965 759357870 758072078 756708264
2649.4 756708264 755384922 754185259 753032327 751842618 750592232 749320686 748146772 747090101
2665.7 747090101 745998502 744815171 743673265 742670655 741758287 740811944 739775240 738746285 737837434
2684.1 737837434 737029672 736182749 735199273 734173417 733217657 732285738 731274068 730133116 728927910
2702.4 728927910 727781534 726686895 725526512 724258602 722971678 721767426 720649481 719526470
2718.7 719526470 718331575 717118382 715977371 714920759 713859618 712739110 711631417 710618317
$$ packed form
2592.3G82768190l13699l35276m38273m77434m42743m26352n08606o32286p05958p31528
2612.7G77756035p52449q35299r59814j024604j018464j049042j172543j297354j309574
2631G68336892j227975j200020j273036j347542j361370j313984j255095j285792j363814
2649.4G56708264j323342j199663j152932j189709j250386j271546j173914j056671
2665.7G47090101j091599j183331j141906j002610r12368r46343j036704j028955r08851
2684.1G37837434q07762q46923r83476j025856r55760r31919j011670j140952j205206
2702.4G28927910j146376j094639j160383j267910j286924j204252j117945j123011
2718.7G19526470j194895j213193j141011j056612j061141j120508j107693j013100
$$ plain form
2735 710618317 709691703 708774507 707802176 706806600 705884099 705039263 704198301 703333437 702476799 701698363
2755.4 701698363 701009214 700314641 699545383 698773921 698074460 697393596 696651042 695822597 694946945 694084823
2775.8 694084823 693197846 692189455 691063166 689886451 688705444 687501967 686196625 684749246
2792.2 684749246 683203757 681620121 679992735 678256273 676364958 674383283 672406673 670399606
2808.5 670399606 668264866 665967703 663561344 661120057 658650637 656111062 653438091 650641203
2824.8 650641203 647811174 644950807 641960323 638798475 635520279 632192016 628843367 625399947
2841.1 625399947 621750236 617931724 614040256 610075653 606012523 601857066 597616911 593268096
2857.4 593268096 588704050 583735287 578245401 572268248 565870225 559112251 552093387 544969618
$$ packed form
2735G10618317r26614r17196r72331r95576r22501q44836q40962q64864q56638p78436
2755.4G01698363o89149o94573p69258p71462o99461o80864p42554q28445q75652q62122
2775.8F94084823q86977j008391j126289j176715j181007j203477j305342j447379
2792.2F84749246j545489j583636j627386j736462j891315j981675j976610k007067
2808.5F70399606k134740k297163k406359k441287k469420k539575k672971k796888
2824.8F50641203k830029k860367k990484l161848l278196l328263l348649l443420
2841.1F25399947l649711l818512l891468l964603m063130m155457m240155m348815
2857.4E93268096m564046m968763n489886n977153o398023o757974p018864p123769
$$ plain form
2873.7 544969618 537946641 531282485 525229394 519920230 515393496 511700988 508864284 506773174
2890.1 506773174 505255580 504166126 503355503 502643824 501849711 500827730 499471039 497681320 495414138
2908.4 495414138 492688864 489478171 485785812 481788814 477783829 474039763 470740616 468050659
2924.7 468050659 466158062 465246499 465404779 466637164 468947977 472299993 476570845 481609046 487274647
2943.1 487274647 493425220 499938339 506754041 513772130 520826757 527860343 534851968 541705012
2959.4 541705012 548341036 554685831 560694695 566396236 571838439 577139914 582409203 587596238
2975.7 587596238 592681289 597724378 602644563 607282341 611548841 615441024 619005680 622191429
2992 622191429 624860585 627009690 628743947 630056441 630869508 631194592 631091535 630641580 629910707
$$ packed form
2873.7E44969618p022977o664156o053091n309164m526734l692508k836704k091110
2890.1E06773174j517594j089454q10623p11679p94113j021981j356691j789719k267182
2908.4D95414138k725274l210693l692359l996998m004985l744066l299147k689957
2924.7D68050659j892597r11563J58280J232385K310813L352016M270852N038201N665601
2943.1D87274647O150573O513119O815702P018089P054627P033586O991625O853044
2959.4E41705012O636024O344795O008864N701541N442203N301475N269289N187035
2975.7E87596238N085051N043089M920185M637778M266500L892183L564656L185749
2992F22191429K669156K149105J734257J312494Q13067L25084j03057m49955p30873
$$ plain form
3010.4 629910707 628864348 627463937 625730157 623705745 621462524 619073451 616529465 613787234
3026.7 613787234 610902548 607958019 604969025 601869106 598607481 595293701 591995776 588609755
3043 588609755 585065067 581408322 577737510 574062765 570308745 566517472 562733710 558906198 555078864
3061.4 555078864 551318705 547589779 543817818 539960325 536074758 532239497 528495967 524834573
3077.7 524834573 521087408 517203510 513328254 509464502 505614817 501820922 497969627 494063705
3094 494063705 490284145 486648411 483001202 479263753 475542963 471973628 468481541 464898378 461322844
3112.4 461322844 457979351 454768181 451426506 447853595 444156468 440590262 437287986 434102446
3128.7 434102446 430839837 427547157 424382776 421392560 418443084 415326715 412135690 409102499
$$ packed form
3010.4F29910707j046359j400411j733780k024412k243221k389073k543986k742231
3026.7F13787234k884686k944529k988994l099919l261625l313780l297925l386021
3043E88609755l544688l656745l670812l674745l754020l791273l783762l827512l827334
3061.4E55078864l760159l728926l771961l857493l885567l835261l743530l661394
3077.7E24834573l747165l883898l875256l863752l849685l793895l851295l905922
3094D94063705l779560l635734l647209l737449l720790l569335l492087l583163l575534
3112.4D61322844l343493l211170l341675l572911l697127l566206l302276l185540
3128.7D34102446l262609l292680l164381k990216k949476l116369l191025l033191
$$ plain form
3145 409102499 406221956 403477073 400851071 398132175 395231843 392366439 389680088 387091815 384528607
3163.4 384528607 381998271 379509270 377062738 374659717 372315645 370033085 367787451 365596980
3179.7 365596980 363443911 361298382 359224409 357268184 355378330 353472739 351527452 349603295
3196 349603295 347768277 346018344 344322741 342652440 340984792 339339852 337760389 336261958 334807068
3214.3 334807068 333357155 331922114 330516189 329141229 327813536 326546639 325345010 324241966
3230.7 324241966 323202699 322029084 320716500 319491506 318395078 317372262 316435426 315537810 314563811
3249 314563811 313535064 312608421 311808139 311018705 310192049 309357494 308545321 307792813 307158530 306652546
3269.4 306652546 306082129 305308163 304469883 303679526 302942991 302260697 301601171 300951779 300354362 299857020
$$ packed form
3145D09102499k880543k744883k626002k718896k900332k865404k686351k588273k563208
3163.4C84528607k530336k489001k446532k403021k344072k282560k245634k190471
3179.7C65596980k153069k145529k073973j956225j889854j905591j945287j924157
3196C49603295j835018j749933j695603j670301j667648j644940j579463j498431j454890
3214.3C34807068j449913j435041j405925j374960j327693j266897j201629j103044
3230.7C24241966j039267j173615j312584j224994j096428j022816r36836q97616r73999
3249C14563811j028747r26643q00282p89434q26656q34555q12173p52508o34283n05984
3269.4C06652546n70417p73966q38280p90357p36535o82294o59526o49392n97417m97342
$$ plain form
3289.8 299857020 299375892 298751235 297981769 297164887 296414495 295856923 295472711 294986784 294167399 293159336
3310.2 293159336 292215645 291378617 290568143 289776951 289044917 288361818 287682950 286895066 285974830 285070032
3330.6 285070032 284252226 283520788 282853663 282097012 281192273 280277193 279378802 278499484 277724296 276914805
3351 276914805 275878787 274745107 273758262 272948503 272139966 271275192 270530283 269900084 269092023 267979473
3371.4 267979473 266820192 265881538 265109479 264336824 263507843 262736768 262141317 261726975 261449575
3389.7 261449575 261052042 260337979 259611905 259241223 259088427 258662015 257855594 257132292 256696492 256376475
3410.1 256376475 256059617 255676180 255264521 254918426 254586071 254258335 254097134 254141092 254245073 254299074
3430.5 254299074 254415870 254656911 254703254 254395217 254075557 254047334 254242659 254467636 254674226 254921317
$$ packed form
3289.8B99857020m81128o24657p69466q16882p50392n57572l84212m85927q19385j008063
3310.2B93159336r43691q37028q10474p91192p32034o83099o78868p87884r20236r04798
3330.6B85070032q17806p31438o67125p56651r04739r15080q98391q79318p75188q09491
3351B76914805j036018j133680r86845q09759q08537q64774p44909o30199q08061j112550
3371.4B67979473j159281r38654p72059p72655q28981p71075n95451m14342k77400
3389.7B61449575l97533p14063p26074l70682j52796m26412q06421p23302m35800l20017
3410.1B56376475l16858l83437m11659l46095l32355l27736j61201M3958J03981N4001
3430.5B54299074J16796K41041M6343l08037l19660k8223J95325K24977K06590K47091
$$ plain form
3450.9 254921317 255217612 255552799 255943984 256413579 256837785 257208884 257828772 258654237 259208232 259369314
3471.3 259369314 259520799 259904265 260521621 261202037 261679292 262095809 262697041 263275415 263719261 264275789
3491.7 264275789 265000373 265780628 266540229 267255485 267891616 268364102 268824279 269457668 270257622 271251470
3512.1 271251470 272250861 272995919 273670554 274559259 275653809 276681751 277463734 278195620 279159695
3530.5 279159695 280368686 281672984 282912642 284072399 285342693 286743492 288057029 289192140
3546.8 289192140 290421039 291854143 293346435 294922352 296619833 298387915 300185382 301898360
3563.1 301898360 303445071 305261195 307766408 310479701 312959731 315386683 317967355 320725292
3579.4 320725292 323646516 326573074 329279095 331992894 335227937 338674992 342008442 345481247
$$ packed form
3450.9B54921317K96295L35187L91185M69595M24206L71099O19888Q25465N53995J61082
3471.3B59369314J51485L83466O17356O80416M77255M16517O01232N78374M43846N56528
3491.7B64275789P24584P80255P59601P15256O36131M72486M60177O33389P99954R93848
3512.1B71251470R99391P45058O74635Q88705J094550J027942P81983P31886R64075
3530.5B79159695J208991J304298J239658J159757J270294J400799J313537J135111
3546.8B89192140J228899J433104J492292J575917J697481J768082J797467J712978
3563.1C01898360J546711J816124K505213K713293K480030K426952K580672K757937
3579.4C20725292K921224K926558K706021K713799L235043L447055L333450L472805
$$ plain form
3595.7 345481247 349183828 352939069 356749952 360539228 364092708 367649168 371502370 375563204
3612.1 375563204 379777074 383900613 387935847 392454743 397170871 401334524 404796124 408430517
3628.4 408430517 413201094 418133467 422715217 427195072 431592524 435933858 440119743 443836063
3644.7 443836063 447163045 451139688 456317812 461323380 465714306 470407784 475277901 479628384
3661 479628384 483581394 487272471 490499020 493722469 497527391 501065612 504598022 508988202 513274014
3679.4 513274014 517059207 520483732 523424089 526134610 529161394 532587469 535982251 539008737
3695.7 539008737 541582763 543845475 546216011 548875928 551279187 553050578 554626405 556938410
3712 556938410 559879541 562422633 564383805 566086411 567768514 569543421 571517229 573459148 574839473
$$ packed form
3595.7C45481247L702581L755241L810883L789276L553480L556460L853202M060834
3612.1C75563204M213870M123539M035234M518896M716128M163653L461600L634393
3628.4D08430517M770577M932373M581750M479855M397452M341334M185885L716320
3644.7D43836063L326982L976643N178124N005568M390926M693478M870117M350483
3661D79628384L953010L691077L226549L223449L804922L538221L532410M390180M285812
3679.4E13274014L785193L424525K940357K710521L026784L426075L394782L026486
3695.7E39008737K574026K262712K370536K659917K403259J771391J575827K312005
3712E56938410K941131K543092J961172J702606J682103J774907J973808J941919J380325
$$ plain form
3730.3 574839473 575781822 577071667 579247236 581625938 583068430 583560288 584493697 586264074 587572515
3748.7 587572515 588959217 591323435 593617976 595188379 596600950 598314643 599893630 601137221
3765 601137221 602283299 603507280 605044842 606691122 608009040 609032393 610123098 611385703 612537146
3783.4 612537146 613688886 615012288 616275549 617285728 617952228 618498087 619174778 619775414 620675385
3801.7 620675385 622013450 623163998 624528170 626077056 626995206 627237916 627598166 628286719 628933132
3820.1 628933132 630180359 631749213 632875741 633695662 634297371 634802759 635317683 635800362 636526346
3838.4 636526346 637627423 638871074 640199423 641270757 641531527 640857100 640373945 641893983 644032359
3856.8 644032359 645154119 645484924 645675421 646227717 646809995 647218168 647966266 648957670 649991393
$$ packed form
3730.3E74839473R42349J289845K175569K378702J442492M91858R33409J770377J308441
3748.7E87572515J386702K364218K294541J570403J412571J713693J578987J243591
3765F01137221J146078J223981J537562J646280J317918J023353J090705J262605J151443
3783.4F12537146J151740J323402J263261J010179O66500N45859O76691O00636Q99971
3801.7F20675385J338065J150548J364172J548886R18150K42710L60250O88553O46413
3820.1F28933132J247227J568854J126528Q19921O01709N05388N14924M82679P25984
3838.4F36526346J101077J243651J328349J071334K60770o74427m83155J520038K138376
3856.8F44032359J121760L30805J90497N52296N82278M08173P48098R91404J033723
$$ plain form
3875.2 649991393 650757849 651040494 651463389 652086437 652778566 653640866 654192030 654630840 655416131 656012595
3895.5 656012595 656022429 655813873 655919552 656612813 657817960 658969462 659710765 660144627 660337627 660447001
3915.9 660447001 660802543 661342382 661715269 661991835 662409484 662771702 662965894 663335264 663953662 664484680
3936.3 664484680 664780676 664955020 665259957 665729880 666088164 666365027 666773438 667180896 667454422 667721212
3956.7 667721212 668074310 668462574 668839097 669129610 669318318 669547439 669841409 670161664 670551538 670941651
3977.1 670941651 671235800 671514273 671831310 672056973 672186792 672392428 672682703 672969818 673248351 673505008
3997.5 673505008
$$ packed form
3875.2F49991393P66456K82645M22895O23048O92129Q62300N51164M38810P85291N96464
3895.5F56012595R834k08556J05679O93261J205147J151502P41303M33862J93000J09374
3915.9F60447001L55542N39839L72887K76566M17649L62218J94192L69370O18398N31018
3936.3F64484680K95996J74344L04937M69923L58284K76863M08411M07458K73526K66790
3956.7F67721212L53098L88264L76523K90513J88708K29121K93970L20255L89874L90113
3977.1F70941651K94149K78473L17037K25663J29819K05636K90275K87115K78533K56657
3997.5F73505008
##END=$$ End of the data block
