##TITLE=Amostra 2 - Marcela $$ Begin of the data block
##JCAMP-DX=5.00 $$ ACD/SpecManager v 10.08
##SPECTROMETER/DATA SYSTEM=Alpha
##DATE=24 Oct 2013 10:57:42
##DATA TYPE=INFRARED SPECTRUM
##DATA CLASS=XYDATA
##ORIGIN=
##OWNER=
##NPOINTS=1765
##FIRSTX=399.75695801
##LASTX=3997.56933594
##MAXX=3997.56933594
##MINX=399.75695801
##MAXY=0.83407933
##MINY=0.16270922
##XFACTOR=1.0000000000
##YFACTOR=1.000000000000000e-9
##FIRSTY=0.47702187
##DELTAX=2.03957629
##XUNITS=1/CM
##YUNITS=ARBITRARY UNITS
##XYDATA=(X++(Y..Y))
399.8D77021873m025400k245485j197666n83262N36561J950294K323717Q95143j116574
418.1D73559201j835913j365333j441598k293140l123820l241986k573043j637042
434.4D56047326j001566j43141J614809L640473M542947L910452L016084K587766K190918
452.8D76406068J160264n88924j756370j530767j525223k521217l570139l799051l565043
471.1D58709598l402830l187775k926201k319038j231819l53187j27793k12490k51264
489.5D44697201l54051o58542j204044j792788k036870k007335k169013k816558l453583
507.9D28204417l463655l430725l978163m714936m974961m493594l607035k661943
524.2C96879405j476675P5191J466244K539724L643066M891634N869091N971998N066752
$$ plain form
399.8 477021873 472996473 470750988 469553322 468970060 469506621 471456915 473780632 474675775 473559201
418.1 473559201 471723288 470357955 468916357 466623217 463499397 460257411 457684368 456047326
434.4 456047326 455045760 454902619 456517428 460157901 464700848 468611300 471627384 474215150 476406068
452.8 476406068 477566332 476977408 475221038 473690271 472165048 469643831 466073692 462274641 458709598
471.1 458709598 455306768 452118993 449192792 446873754 445641935 445288748 445160955 444948465 444697201
489.5 444697201 444343150 443684608 442480564 440687776 438650906 436643571 434474558 431658000 428204417
507.9 428204417 424740762 421310037 417331874 412616938 407641977 403148383 399541348 396879405
524.2 396879405 395402730 395477921 396944165 399483889 403126955 408018589 413887680 419859678 424926430
542.5D24926430L297836J238405k65926j131832j980305l054738l958881m665405n395531
560.9D09010053o280065p311225q019596p726371o278247m158527j676351R33230L410995
579.2C71903896N693794P399410P981628P467806O127328M384070K585561J086980
595.6D14630473J78277k91973m31538l10927n0188M61430J235276J976192K640754
613.9D20037776L359378M131883M833847N351037N543619N260259M677534M042417
630.2D57237750L423840K739638K153963J830578J640946J453846J252204J175017
646.5D72907782J286238J360834J274228J179546J190722J295447J330227J264155
662.9D83089179J146257J195132J549453J544774J496046J514763J431733J492799
$$ plain form
542.5 424926430 428224266 429462671 429196745 428064913 426084608 423029870 419070989 414405584 409010053
560.9 409010053 402729988 395418763 387399167 379672796 373394549 369236022 367559671 368492901 371903896
579.2 371903896 377597690 384997100 392978728 400446534 406573862 410957932 413543493 414630473
595.6 414630473 414808750 414516777 414085239 413774312 413724124 414185554 415420830 417397022 420037776
613.9 420037776 423397154 427529037 432362884 437713921 443257540 448517799 453195333 457237750
630.2 457237750 460661590 463401228 465555191 467385769 469026715 470480561 471732765 472907782
646.5 472907782 474194020 475554854 476829082 478008628 479199350 480494797 481825024 483089179
662.9 483089179 484235436 485430568 486980021 488524795 490020841 491535604 492967337 494460136
679.2D94460136J670032J647741J269728Q41081O16491K86460n19574j681030k801448
697.5D95789617l539085l919005m000068l423482j967013n394J974105L675461M993499
715.9D89578635O065845P072002P665753P693708P457733O945729O264210N438030
732.2E44181645M314899L123105K022386R15527m38392k196312m054845n478501o371438
750.6E36018074p010043p443965p293403o350636m781068k758205k64942K731740N901575
768.9E08749127Q626104J0328769J0860801J0604501R976447R048104P796764O494522
785.2E82485139N545318N167842N098582N018115N190015N873918O516159O397307
801.6F27292395N524277M461289L715396L356695K957046K077162J087010N41866K63452
$$ plain form
679.2 494460136 496130168 497777909 499047637 499888718 500505209 500791669 500272095 498591065 495789617
697.5 495789617 492250532 488331527 484331459 480907977 478940964 478935570 480909675 484585136 489578635
715.9 489578635 495644480 502716482 510382235 518075943 525533676 532479405 538743615 544181645
732.2 544181645 548496544 551619649 553642035 554557562 554119170 551922858 547868013 542389512 536018074
750.6 536018074 529008031 521564066 514270663 507920027 503138959 500380754 500115812 502847552 508749127
768.9 508749127 517375231 527704000 538564801 549169302 559145749 568193853 575990617 582485139
785.2 582485139 588030457 593198299 598296881 603314996 608505011 614378929 620895088 627292395
801.6 627292395 632816672 637277961 640993357 644350052 647307098 649384260 650471270 651013136 651276588
819.9F51276588n07533k109349l945053n319237o298423p413030q542657q979380q408606
838.3E99753320p302344o362557n699158m857301l722847k795398k587199k893031
854.6E63533485k791524j561105J007080M581451Q245528J1209249J3115645J3438344
870.9F10778153J1714160Q453787M822254J532435j637399n011082p934272r385288
887.2F13332748r304583q593201q015573p553459o893873o151199n994737o890893
903.5E53935230q364797r606540j0479212j1381626j2309194j2625694j1767238r783805
919.8D67617124p253647m809021k694875q15273Q67635K195329L185540M240394N657375
938.2D68190581P036984P194876M883856P4565n696207j0842770j4860899j7699062
$$ plain form
819.9 651276588 650769055 648659706 644714653 639395416 633096993 625683963 617141306 608161926 599753320
838.3 599753320 592450976 586088419 580389261 575531960 571809113 569013715 566426516 563533485
854.6 563533485 560741961 559180856 560187936 564769387 573014915 584224164 597339809 610778153
870.9 610778153 622492313 630946100 635768354 637300789 635663390 630652308 622718036 613332748
887.2 613332748 604028165 595434964 587419391 579865932 572972059 566820860 560826123 553935230
903.5 553935230 545570433 535963893 525484681 514103055 501793861 489168167 477400929 467617124
919.8 467617124 460363477 455554456 452859581 452044308 452911943 455107272 458292812 462533206 468190581
938.2 468190581 475227565 482422441 487306297 487380862 481684655 470841885 455980986 438281924
954.5D38281924j9380182k0253122k0813972k1380007k1913827k2130728k1975219
968.8B90434867k1576762k0840272j9633189j7833948j5330688j2312963r163559o177112
985.1A67566374l527165j329988L34233J436368K084955K385706K407924K232074J863227
1003.5A75453708J305580O97612K53171J19537K84493N91070J009837J536145K086833
1021.8A83337986K595842K953142L113956L133654L020495K706111K241000J792863
1038.1B04895049J506001J481235J730517K086177K448857K954870L691122M609302
1054.5B25403130N653679O847173Q281142R877384J0840267R535610M613430k885014
1070.8B78166801r262920j1421203r586945o060750k676144n2810J925066L417492
$$ plain form
954.5 438281924 418901742 398648620 377834648 356454641 334540814 312410086 290434867
968.8 290434867 268858105 248017833 228384644 210550696 195220008 182907045 173743486 167566374
985.1 167566374 164039209 162709221 163043454 164479822 166564777 168950483 171358407 173590481 175453708
1003.5 175453708 176759288 177456900 177710071 177829608 178114101 178705171 179715008 181251153 183337986
1021.8 183337986 185933828 188886970 192000926 195134580 198155075 200861186 203102186 204895049
1038.1 204895049 206401050 207882285 209612802 211698979 214147836 217102706 220793828 225403130
1054.5 225403130 231056809 237903982 246185124 256062508 266902775 276438385 281051815 278166801
1070.8 278166801 268903881 257482678 247895733 241834983 239158839 239106029 241031095 244448587
1087.1B44448587M502476N286708N718559N588323M789114L535151K296329J589477
1103.4B77754724J555562J986951K649724L278881L686697L762752L413468K805621
1119.7C00894380K358853K348602K780408L484458M134744M144520K964228N46098
1136C23656291k644688n731523p880986q833885q788705q046031o893665n524903m050851
1154.4B65261054k572864j158685K30551J750022L469646N381078P452130R574860
1170.7B89387792J1617095J3426274J4782458J5576899J5865833J5694886J5064001
1185C91415238J3908565J2181819J0004878P699519N611003L917008K694875K098173
1201.3D49531078K193541K832412L768653M688233N452216O059915O267160N772948
$$ plain form
1087.1 244448587 248951063 254237771 259956330 265544653 270333767 273868918 276165247 277754724
1103.4 277754724 279310286 281297237 283946961 287225842 290912539 294675291 298088759 300894380
1119.7 300894380 303253233 305601835 308382243 311866701 316001445 320145965 323110193 323656291
1136 323656291 321011603 315280080 307399094 298565209 289776504 281730473 274836808 269311905 265261054
1154.4 265261054 262688190 261529505 261760056 263510078 266979724 272360802 279812932 289387792
1170.7 289387792 301004887 314431161 329213619 344790518 360656351 376351237 391415238
1185 391415238 405323803 417505622 427510500 435210019 440821022 444738030 447432905 449531078
1201.3 449531078 451724619 454557031 458325684 463013917 468466133 474526048 480793208 486566156
1217.6D86566156M646570L236323J858264O82950k74568j030684j478076j497745j192928
1236D91516262q19951m58092N9516P82668J514763K058506K383023K600998K789825
1254.3E02427518K853454K697289K494037K448320K580762K766192K769768K499223
1270.6E23536563K069831J581073J029610M11511j87815o19113q31187r99033j311183
1289E24680257j699507j971245k060473k033174j931191j693546j295567q96871p10309
1307.4E10388374q22007j147330j477778j769245k185285k732873l318667l965885
1323.7D92969304m610449n125165n422085n317807m727483l833771k854407j889169
1340D59188968j103312p16865o37948p26492r77367j275658j482070j538455j596868
$$ plain form
1217.6 486566156 491212726 494449049 496307313 496990263 496715695 495685011 494206935 492709190 491516262
1236 491516262 490696311 490238219 490297735 491080403 492595166 494653672 497036695 499637693 502427518
1254.3 502427518 505280972 507978261 510472298 512920618 515501380 518267572 521037340 523536563
1270.6 523536563 525606394 527187467 528217077 528628588 528440773 527821660 526990473 525991440 524680257
1289 524680257 522980750 521009505 518949032 516915858 514984667 513291121 511995554 511098683 510388374
1307.4 510388374 509566367 508419037 506941259 505172014 502986729 500253856 496935189 492969304
1323.7 492969304 488358855 483233690 477811605 472493798 467766315 463932544 461078137 459188968
1340 459188968 458085656 457368791 456730843 456004351 455026984 453751326 452269256 450730801 449133933
1358.3D49133933j779557j789272j309394p92861m57615n5641L95417J076848J751840
1376.7D46173698J987874J984388K125472K673000L675222M274130L570497K303690
1393D68767971J279771O02633L5673n05417j165748j699924j735002j696855j764953
1411.4D62118149j712710j582563j452207q18491Q4400M00483N48006P39336R59336
1429.7D59283739J232237J152813J183004J948595K244293J818687J170814M34727
1446D70468909j65910o13362j244127k101243k972245k131105M4823R53347J962930
1464.4D64202017L833562N149185O218553Q525908J0186940J0004431R503901R135604
1480.7E26760101Q807957P922590P158339P393480P970035O989479N698740N728603
$$ plain form
1358.3 449133933 447354376 445565104 444255710 443462849 443005234 442949593 443345010 444421858 446173698
1376.7 446173698 448161572 450145960 452271432 454944432 458619654 462893784 466464281 468767971
1393 468767971 470047742 470650375 470686048 470180631 469014883 467314959 465579957 463883102 462118149
1411.4 462118149 460405439 458822876 457370669 456552178 456636578 457037061 457585067 458324403 459283739
1429.7 459283739 460515976 461668789 462851793 464800388 467044681 468863368 470034182 470468909
1446 470468909 470302999 469689637 468445510 466344267 463372022 461240917 461285740 462239087 464202017
1464.4 464202017 468035579 473184764 479403317 487929225 498116165 508120596 517624497 526760101
1480.7 526760101 535568058 543490648 550648987 558042467 566012502 573001981 578700721 584429324
1497E84429324O075143N554259M138530L137588M375398N472482M739701L844798L047109
1515.4F24814332K839207K921343L409565L771960L315807L157198K898038K442538
1531.7F49569988K573669K333820J183093J248538K939880L409863K910256K187490
1548F68356597J896799J876712J428008M29749L83199K905547L371299K031326J174927
1566.4F83854163Q08060J300454J488686O49273M24445J004874R54211N04673O1333
1584.7F91050172m85242r14573j115680j296699j700521k207756k626419k971172l279269
1603.1F74452841l777027m407346m845619m916907n125701o234467o984174n511225
1619.4F32650375n074143n880475n557060n091191m758954m113793m299402m626811
$$ plain form
1497 584429324 590504467 596058726 600197256 603334844 607710242 613182724 617922425 621767223 624814332
1515.4 624814332 627653539 630574882 633984447 637756407 641072214 644229412 647127450 649569988
1531.7 649569988 652143657 654477477 655660570 656909108 659848988 663258851 666169107 668356597
1548 668356597 670253396 672130108 673558116 673987865 674371064 677276611 680647910 682679236 683854163
1566.4 683854163 684662223 685962677 687451363 688100636 688525081 689529955 690484166 690988839 691050172
1584.7 691050172 690564930 689650357 688534677 687237978 685537457 683329701 680703282 677732110 674452841
1603.1 674452841 670675814 666268468 661422849 656505942 651380241 645145774 638161600 632650375
1619.4 632650375 627576232 621695757 616138697 611047506 606288552 602174759 597875357 593248546
1635.7E93248546k747834j145601r17673r90868q23676M01676J017510R74596L043413
1654.1E92060089M282236L506839L174544L718853M472196M028499L789723M790664
1670.4F23823643N054593N171180N783736N228401M105627L921866N887270O526649
1686.7F65502965N182922M707814L949821L508925L694773L712237M738628M620433
1703F99618518L751159L867328L590107K828419K111853J767218K565503L592610L191710
1721.4G26884425K522230K269983J881659J362682Q66174J313150K553463K212763
1737.7G41866529J608431J728356J752556J468062J165092J395881K050281J893341
1754G54928529J375199J239180J078069J185954J396716J037001N84603L85761Q51810
$$ plain form
1635.7 593248546 590500712 589355111 588437438 587446570 586622894 587024570 588042080 589016676 592060089
1654.1 592060089 596342325 599849164 603023708 606742561 611214757 615243256 619032979 623823643
1670.4 623823643 628878236 634049416 639833152 645061553 649167180 653089046 658976316 665502965
1686.7 665502965 670685887 675393701 679343522 682852447 686547220 690259457 694998085 699618518
1703 699618518 703369677 707237005 710827112 713655531 715767384 717534602 720100105 723692715 726884425
1721.4 726884425 729406655 731676638 733558297 734920979 735787153 737100303 739653766 741866529
1737.7 741866529 743474960 745203316 746955872 748423934 749589026 750984907 753035188 754928529
1754 754928529 756303728 757542908 758620977 759806931 761203647 762240648 762825251 763211012 764062822
1772.4G64062822J676380J610578J086592Q40843Q76367R64582J011193O45816J93536
1790.7G72968709O65606J317441J103699P49231Q41558J079976J011312P95424O85752
1809.1G81218708P63297Q56220P93755P52211P60317N35846K14874K75672M29273N22613
1829.5G87122786Q57174Q30412M87626M25935L39925j36077k87533M22656Q48353O39379
1849.9G91550636L39389J45495J34468K30611L09348K49683P570k70962o4314O28710
1870.3G93260634P99179M68791L16858L74913M16040L41118K23458J51872K12312M46022
1890.7G97011197M09782J73270K71082M37975L34084J25289K980M77J37448K94269
1911.1G99197853J92403j09851j27554K19941K99692J74404K18153K58803K60413K41160
$$ plain form
1772.4 764062822 765739202 767349780 768436372 769277215 770153582 771118164 772129357 772775173 772968709
1790.7 772968709 773634315 774951756 776055455 776804686 777646244 778726220 779737532 780532956 781218708
1809.1 781218708 781982005 782838225 783631980 784384191 785144508 785680354 785895228 786170900 786600173 787122786
1829.5 787122786 787979960 788810372 789297998 789723933 790063858 789927781 789640248 790062904 790911257 791550636
1849.9 791550636 791890025 792035520 792169988 792400599 792709947 792959630 792967200 792696238 792631924 793260634
1870.3 793260634 794059813 794528604 794845462 795220375 795636415 795977533 796200991 796352863 796565175 797011197
1890.7 797011197 797420979 797594249 797865331 798303306 798637390 798762679 798765659 798766136 798903584 799197853
1911.1 799197853 799390256 799280405 799152851 799372792 799672484 799846888 800065041 800323844 800584257 800825417
1931.5H00825417J37925N5313Q4997Q5830N3108J62840K84731L19839L59595L31640
1951.9H02701235J93238J26183K36869L70443L43978J56701L6955J82390L51548K89977
1972.3H04989517J30236O1750J49310K59161K21848N3943p0393k5809R0062J43946
1992.6H06003571R7632P272Q583O5565j669j78814k76804k22325j87695l09289m65035
2015.1H04540992m63724l44634l12090m07040n28574n48721m49121l81708m53114n71371
2035.5H00080895n74350m40657l05891k86937l31104l06546j65701k7657l9935j25587
2055.9G97476530p8678R5904J76668J03116L5942O2108J45912K02060J32441P212K444
2078.3G98361659J30057K28167J84059P7903O7234J92523K89858K14159Q4818J05619
$$ plain form
1931.5 800825417 800963342 801018655 801103652 801189482 801242590 801405430 801690161 802010000 802369595 802701235
1951.9 802701235 802894473 803020656 803257525 803627968 803971946 804128647 804165602 804347992 804699540 804989517
1972.3 804989517 805119753 805181503 805330813 805589974 805811822 805865765 805795372 805769563 805859625 806003571
1992.6 806003571 806101203 806108475 806117058 806182623 806180954 806002140 805725336 805503011 805315316 805006027 804540992
2015.1 804540992 804077268 803732634 803420544 803013504 802484930 801936209 801487088 801105380 800652266 800080895
2035.5 800080895 799506545 799065888 798759997 798473060 798141956 797835410 797669709 797642052 797602117 797476530
2055.9 797476530 797397852 797493756 797670424 797773540 797809482 797871590 798017502 798219562 798352003 798359215 798361659
2078.3 798361659 798491716 798719883 798903942 798981845 799049079 799241602 799531460 799745619 799830437 799936056
2098.7G99936056K40326K79427J82151J13905J36375J83404K06113J30176Q166r060
2119.1H01407039P5698J29283O6578j8656k563P4446J01983K5750n6923j7583Q3685
2141.5H01868737J23441O8843M888M3631J69336K39432J91987J58786K55168M15087
2161.9H03539336M65274M18305M18067N01394O31929O91890O18101N21779N28574O22511
2182.3H08957160O78062O09040N20349N40018O08921O11484N26488M53412M76718N72443
2202.7H14554095O32584N81444N00023N11646N81980N88834N19276M59731M78804N23090
2223.1H19931507N03421M11689L11733L14116M06623M33922L51607K78414K88427L26991
2243.5H23558450L19063K57910K14815K67029L43978L22580K55049K40683K87175L57628
$$ plain form
2098.7 799936056 800176382 800455809 800637960 800751865 800888240 801071644 801277757 801407933 801416099 801407039
2119.1 801407039 801482737 801612020 801678598 801659942 801657379 801731825 801833808 801859558 801802635 801785052 801868737
2141.5 801868737 801992178 802061021 802065909 802109540 802278876 802518308 802710295 802869081 803124249 803539336
2161.9 803539336 804004610 804422915 804840982 805342376 805974305 806666195 807284296 807806075 808334649 808957160
2182.3 808957160 809635222 810244262 810764611 811304629 811913550 812525034 813051522 813504934 813981652 814554095
2202.7 814554095 815186679 815768123 816268146 816779792 817361772 817950606 818469882 818929613 819408417 819931507
2223.1 819931507 820434928 820846617 821158350 821472466 821879089 822313011 822664618 822943032 823231459 823558450
2243.5 823558450 823877513 824135423 824350238 824617267 824961245 825283825 825538874 825779557 826066732 826424360
2263.9H26424360L88682L55601L19899L18110L40640L45230L05355K82824L14295L45469
2284.3H29740465L07023K22147J79887K02000K50756K61486J96517J41382J80721K51532
2304.7H31933916K61724K21550J73986J22964J13726J62840K08974K02775J48415J28508
2325.1H33679378J70827J69516N9604o9737o6579L6419K0027j15275j61112k03371
2345.5H33519697l63767l67939j23501J20640K35438K81036Q9466j36852j59442j72258
2365.9H32922518k74122l50296l69489l67642l38792l14475k95102k59280k30551j92285
2386.3H29930484j40369j60038k20716k28763k08199j86801k00391k74121l27349l15428
2406.7H27668309k94626l12328l71754m24504m33147m26054m28438m58658n24879n68032
$$ plain form
2263.9 826424360 826813042 827168643 827488542 827806652 828147292 828492522 828797877 829080701 829394996 829740465
2284.3 829740465 830047488 830269635 830449522 830651522 830902278 831163764 831360281 831501663 831682384 831933916
2304.7 831933916 832195640 832417190 832591176 832714140 832827866 832990706 833199680 833402455 833550870 833679378
2325.1 833679378 833850205 834019721 834079325 834009588 833943009 833979428 833999455 833884180 833723068 833519697
2345.5 833519697 833155930 832787991 832664490 832785130 833020568 833301604 833391070 833254218 833094776 832922518
2365.9 832922518 832648396 832298100 831928611 831560969 831222177 830907702 830612600 830353320 830122769 829930484
2386.3 829930484 829790115 829630077 829409361 829180598 828972399 828785598 828585207 828311086 827983737 827668309
2406.7 827668309 827373683 827061355 826689601 826265097 825831950 825405896 824977458 824518800 823993921 823425889
2427.1H23425889n65827n68330n94020o35624o40631n86450n50449n88000o49333o33239
2447.5H17413986n53966n38289n98550o35147n88954m91559m64380n33164n61118n18799
2467.9H11930060m80413m52220m41731m56929m40478l85523l77774m19915m35412m02570
2488.3H07637095l16619k30134k36571l00765l02911k41458k19643k34127k34843k43961
2508.7H05076063k56479k57731k87354l60250l88682l35753l23892l99589n02825n62847
2529H01400661n01394m46617n41866o42240o40095o09278o00279o26504o67572o40750
2549.4G95484066n67555n48184n94497o35803o03974n36620n13315n64695o38842o21260
2569.8G89659321n31792n06878n60761n99205n65887m83513m27961m46260n12540n22793
$$ plain form
2427.1 823425889 822860062 822291732 821697712 821062088 820421457 819835007 819284558 818696558 818047225 817413986
2447.5 817413986 816860020 816321731 815723181 815088034 814499080 814007521 813543141 813009977 812448859 811930060
2467.9 811930060 811449647 810997427 810555696 810098767 809658289 809272766 808894992 808475077 808039665 807637095
2488.3 807637095 807320476 807090342 806853771 806553006 806250095 806008637 805788994 805554867 805320024 805076063
2508.7 805076063 804819584 804561853 804274499 803914249 803525567 803189814 802865922 802466333 801963508 801400661
2529 801400661 800899267 800452650 799910784 799268544 798628449 798019171 797418892 796792388 796124816 795484066
2549.4 795484066 794916511 794368327 793773830 793138027 792534053 791997433 791484118 790919423 790280581 789659321
2569.8 789659321 789127529 788620651 788059890 787460685 786894798 786411285 785983324 785537064 785024524 784501731
2590.2G84501731m19318l07083l25501m36724m76956m21882m07815n26547o76811p27355
2610.6G79775739p06792p20024q07166r24051j024246j057685j063347j140594j247227
2629G71084607j276195j241506j243472j289606j334369j348138j301348j244307j268684
2647.3G59536982j329780j312077j218855j156271j196980j271725j278818j182735
2663.7G49589741j059890j072585j163840j136601j003981r12845r27389r89258j002908
2682G40320444r26793q36968q50618r45687j004398r69470r27150j007974j159906
2700.4G31691480j208425j126468j070023j147210j281739j302957j190543j108587
2716.7G22255528j152933j218080j189590j113474j033068j004219j075625j130939
$$ plain form
2590.2 784501731 784082413 783775330 783449829 783013105 782536149 782114267 781706452 781179905 780503094 779775739
2610.6 779775739 779068947 778348923 777541757 776617706 775593460 774535775 773472428 772331834 771084607
2629 771084607 769808412 768566906 767323434 766033828 764699459 763351321 762049973 760805666 759536982
2647.3 759536982 758207202 756895125 755676270 754519999 753323019 752051294 750772476 749589741
2663.7 749589741 748529851 747457266 746293426 745156825 744152844 743239999 742312610 741323352 740320444
2682 740320444 739393651 738556683 737706065 736760378 735755980 734786510 733859360 732851386 731691480
2700.4 731691480 730483055 729356587 728286564 727139354 725857615 724554658 723364115 722255528
2716.7 722255528 721102595 719884515 718694925 717581451 716548383 715544164 714468539 713337600
2733G13337600j070261r45925r04441r79424j000464r00686q24511q42511q82149q76606
2753.4G04110622p89523o71327o68704p66874p81655p01666o56903p28070q51870q72791
2773.8F96621239q27133q65698j001001j150489j208603j167297j165986j294971j482487
2792.2F86457574j579880j567543j590252j709461j853228j962006k016604k051115
2808.5F72127485k157926k324760k407074k390146k412439k543390k695202k768815
2824.8F52427733k807260k887725l025055l163696l247142l293633l366411l508270
2841.1F27128541l679275l813684l903449l995299m081726m132509m200399m337311
2857.4E94984889m598796n035103n555987o018043o428539o820858p092416p168830
$$ plain form
2733 713337600 712267339 711321414 710416973 709437549 708437085 707536399 706711888 705869377 704987228 704110622
2753.4 704110622 703321099 702649772 701981068 701214194 700432539 699730873 699073970 698345900 697494030 696621239
2773.8 696621239 695794106 694928408 693927407 692776918 691568315 690401018 689235032 687940061 686457574
2792.2 686457574 684877694 683310151 681719899 680010438 678157210 676195204 674178600 672127485
2808.5 672127485 669969559 667644799 665237725 662847579 660435140 657891750 655196548 652427733
2824.8 652427733 649620473 646732748 643707693 640543997 637296855 634003222 630636811 627128541
2841.1 627128541 623449266 619635582 615732133 611736834 607655108 603522599 599322200 594984889
2857.4 594984889 590386093 585350990 579795003 573776960 567348421 560527563 553435147 546266317
2873.7E46266317p053494o688356o075025n348027m570663l721535k853513k091527
2890.1E07864177j527011j124680q22783o97851p96020j034677j374185j813054k288401
2908.4D96385515k745211l223002l700167l993810l977954l731549l319323k713084
2924.7D68981415j889676q94099J53690J232535K312809L306091M225343N054594N708724
2943.1D88191426O174952O515294O818592P077218P167697P077991O948591O854236
2959.4E42825997O689906O381869O026268N724907N501807N367637N296707N232572
2975.7E89047670N191207N125642M926443M645467M345059L984154L589630L188669
2992F24043941K731026K249896J784384J309634Q44776M01676k6286l95059o91056
$$ plain form
2873.7 546266317 539212823 532524467 526449442 521101415 516530752 512809217 509955704 507864177
2890.1 507864177 506337166 505212486 504389703 503691852 502895832 501861155 500486970 498673916 496385515
2908.4 496385515 493640304 490417302 486717135 482723325 478745371 475013822 471694499 468981415
2924.7 468981415 467091739 466197640 466351330 467583865 469896674 473202765 477428108 482482702 488191426
2943.1 488191426 494366378 500881672 507700264 514777482 521945179 529023170 535971761 542825997
2959.4 542825997 549515903 555897772 561924040 567648947 573150754 578518391 583815098 589047670
2975.7 589047670 594238877 599364519 604290962 608936429 613281488 617265642 620855272 624043941
2992 624043941 626774967 629024863 630809247 632118881 632963657 633365333 633339047 632943988 632252932
3010.4F32252932j014054j405955j759290k010703k196432k354383k519429k708494
3026.7F16284192k870739k953172k981364l090382l277004l331065l300607l381908
3043E91097951l546596l675401l693640l682196l736556l777385l788709l811479l794551
3061.4E57591438l724992l691435l785014l935456l970802l867984l719747l653824
3077.7E27242184l780365l928364l905594l843367l841102l868163l918886l912389
3094D96243954l779829l637999l648728l742069l727645l608018l545642l599435l548056
3112.4D63406533l326148l249287l412337l646135l751546l587991l325045l194928
3128.7D35913116l216952l278345l241092l088236l010452l130704l199667l056973
$$ plain form
3010.4 632252932 631238878 629832923 628073633 626062930 623866498 621512115 618992686 616284192
3026.7 616284192 613413453 610460281 607478917 604388535 601111531 597780466 594479859 591097951
3043 591097951 587551355 583875954 580182314 576500118 572763562 568986177 565197468 561385989 557591438
3061.4 557591438 553866446 550175011 546389997 542454541 538483739 534615755 530896008 527242184
3077.7 527242184 523461819 519533455 515627861 511784494 507943392 504075229 500156343 496243954
3094 496243954 492464125 488826126 485177398 481435329 477707684 474099666 470554024 466954589 463406533
3112.4 463406533 460080385 456831098 453418761 449772626 446021080 442433089 439108044 435913116
3128.7 435913116 432696164 429417819 426176727 423088491 420078039 416947335 413747668 410690695
3145D10690695k900332k774745k655059k747983k959192k926677k729416k632380k611816
3163.4C85753095k545953k464682k442091k436489k388209k313435k260268k230316
3179.7C66671652k217502k170056k051949j937837j921117j975387j981587j954436
3196C50461781j916885j822293j724571j666755j639545j645535j612186j526833j484305
3214.3C35422873j487761j480937j434267j357049j290172j272946j256526j141578
3230.7C24701637j052469j197964j347661j245290j113474j059264r39519q71747r77040
3249C14897209j031160r23574q28594q60065q88348q27133p56622o88463n94914n12183
3269.4C06986153o26892q36163q40575p75367p71254p26313o65903o44982o09338n36978
$$ plain form
3145 410690695 407790363 405015618 402360559 399612576 396653384 393726707 390997291 388364911 385753095
3163.4 385753095 383207142 380742460 378300369 375863880 373475671 371162236 368901968 366671652
3179.7 366671652 364454150 362284094 360232145 358294308 356373191 354397804 352416217 350461781
3196 350461781 348544896 346722603 344998032 343331277 341691732 340046197 338434011 336907178 335422873
3214.3 335422873 333935112 332454175 331019908 329662859 328372687 327099741 325843215 324701637
3230.7 324701637 323649168 322451204 321103543 319858253 318744779 317685515 316745996 315874249 314897209
3249 314897209 313866049 312942475 312113881 311253816 310365468 309538335 308781713 308093250 307498336 306986153
3269.4 306986153 306359261 305523098 304682523 303907156 303135902 302409589 301743686 301098704 300489366 299952388
3289.8B99952388n17100o02722p20025p97480p70390o11901m58181n19455p78406r77338
3310.2B93199390r97752q99732q15451p75427p08341o66201o99312q10236r13202r03875
3330.6B85009861q37833p61032o83397p31855r06259r76682r52303q97199p58201q13097
3351B76692003j089513j152218r84877q54582q35746q46177p48009o53863q23259j129866
3371.4B67573893j159221r27836p83979p79808q38786q24660o58751m35293k38925
3389.7B60926634l25560o75977p51436m10914j53959m24027q36134p44164m04298k57314
3410.1B55942851l13461m50432m82499l72768k83182k63780j64926O020R7305O1989
3430.5B53777117Q6784J80781K8550k56449k65806k1428J71214J89245J85609K70634
$$ plain form
3289.8 299952388 299435288 298832566 298112541 297315061 296544671 295932770 295474589 294955134 294176728 293199390
3310.2 293199390 292201638 291301906 290486455 289711028 289002687 288336486 287637174 286826938 285913736 285009861
3330.6 285009861 284172028 283410996 282727599 281995744 281089485 280112803 279160500 278263301 277505100 276692003
3351 276692003 275602490 274450272 273465395 272610813 271775067 270928890 270180881 269527018 268703759 267573893
3371.4 267573893 266414672 265486836 264702857 263923049 263084263 262259603 261600852 261165559 260926634
3389.7 260926634 260601074 259925097 259173661 258762747 258608788 258184761 257348627 256604463 256200165 255942851
3410.1 255942851 255629390 255178958 254696459 254323691 254040509 253776729 253611803 253617823 253715128 253777117
3430.5 253777117 253863901 254044682 254073232 253816783 253550977 253529549 253700763 253890008 254075617 254346251
3450.9B54346251L25948L32028L80814M61638M21435L99798O39498Q01176N54532J69515
3471.3B58832633J18584L91006O75619O83397M19825L84272O09427O12498N11676N98043
3491.7B63836980O82682P18206P66367P91341P29411N35399M43459N69910P70390R66578
3512.1B70810723R63867P83056P47383R02861J075238J005828P69079P61598J035452
3530.5B78855085J268447J307308J220406J160979J298070J417130J299590J146406
3546.8B88973421J255303J442522J532078J639247J736492J811176J845420J728535
3563.1C01964194J534909J795500K490938K722144K530426K485424K615213K823800
3579.4C20962548L010422K967626K717793K703995L204673L485948L443867L538191
$$ plain form
3450.9 254346251 254672199 255004227 255385041 255846679 256268114 256667912 257307410 258108586 258663118 258832633
3471.3 258832633 258951217 259342223 260017842 260701239 261121064 261505336 262114763 262727261 263238937 263836980
3491.7 263836980 264519662 265237868 266004235 266795576 267524987 268060386 268503845 269073755 269844145 270810723
3512.1 270810723 271774590 272557646 273305029 274207890 275283128 276288956 277058035 277819633 278855085
3530.5 278855085 280123532 281430840 282651246 283812225 285110295 286527425 287827015 288973421
3546.8 288973421 290228724 291671246 293203324 294842571 296579063 298390239 300235659 301964194
3563.1 301964194 303499103 305294603 307785541 310507685 313038111 315523535 318138748 320962548
3579.4 320962548 323972970 326940596 329658389 332362384 335567057 339053005 342496872 346035063
3595.7C46035063L718764L825992L913760L848106L559411L559559L897548M085064
3612.1C76443267M193246M144162M124552M577577M699469M145563L499895L727883
3628.4D09555614M846036M981667M660845M528344M350155M265637M157900L751040
3644.7D45097238L392696M024863N201459N029530M418403M702299M858733M322856
3661D81048077L939510L726572L242492L193647L812045L544330L471375M337132M301667
3679.4E14616847L835201L443539K913177K701164L058076L417313L356993L046453
3695.7E40388763K638459K318919K410471K647400K328158J707196J544714K291977
3712E58276057K968967K605856J987755J666248J659989J805306J981496J892090J319468
$$ plain form
3595.7 346035063 349753827 353579819 357493579 361341685 364901096 368460655 372358203 376443267
3612.1 376443267 380636513 384780675 388905227 393482804 398182273 402327836 405827731 409555614
3628.4 409555614 414401650 419383317 424044162 428572506 432922661 437188298 441346198 445097238
3644.7 445097238 448489934 452514797 457716256 462745786 467164189 471866488 476725221 481048077
3661 481048077 484987587 488714159 491956651 495150298 498962343 502506673 505978048 510315180 514616847
3679.4 514616847 518452048 521895587 524808764 527509928 530568004 533985317 537342310 540388763
3695.7 540388763 543027222 545346141 547756612 550404012 552732170 554439366 555984080 558276057
3712 558276057 561245024 563850880 565838635 567504883 569164872 570970178 572951674 574843764 576163232
3730.3E76163232R41336J360655K259553K409518J389563M45783J013040J797498J191020
3748.7E88971198J343011K404809K302945J565933J381278J672089J573086J273155
3765F02487504J182497J229167J533449J674115J350880J033187J086235J260698J156270
3783.4F13994002J133204J282990J252711J038849P12454N87106O58512N32270Q64982
3801.7F22057080J338065J173019J386166J486421Q33392K40385M23670P64966P20322
3820.1F30423486J313150J594544J093089P46787N31673N02110N65350M82678O60479
3838.4F37913346J099408J325548J354038J029551K36214p02620n13315J527607K143681
3856.8F45413458J148463L77476J96457N15997N43952M17292Q35419J097560J078546
$$ plain form
3730.3 576163232 577104568 578465223 580724776 583134294 584523857 584969640 585982680 587780178 588971198
3748.7 588971198 590314209 592719018 595021963 596587896 597969174 599641263 601214349 602487504
3765 602487504 603670001 604899168 606432617 608106732 609457612 610490799 611577034 612837732 613994002
3783.4 613994002 615127206 616410196 617662907 618701756 619414210 620001316 620659828 621192098 622057080
3801.7 622057080 623395145 624568164 625954330 627440751 628274143 628514528 628938198 629703164 630423486
3820.1 630423486 631736636 633331180 634424269 635171056 635702729 636204839 636770189 637252867 637913346
3838.4 637913346 639012754 640338302 641692340 642721891 642958105 642255485 641742170 643269777 645413458
3856.8 645413458 646561921 646939397 647135854 647651851 648195803 648613095 649448514 650546074 651624620
3875.2F51624620P16507K16306M43756O63698O68824Q31604N65707M75407P97689N59866
3895.5F57563984m4524k08676J68800P45714J190364J125038P35819L80993J17481
3913.9F61774993Q2314L48508N35786M05252L43264M59373L31759J58131M05848O73652
3934.3F65518880N20885K39849J28806K47657M16219M09663L87370M58420M40717L13043
3954.7F69081509K40445K89500L58999L85225L40998K42769K02716K19285K52009L34740
3975.1F71948195L88205L48448L40343L35216K10762J16885J94609K85089K79844K80917
3995.5F74728513L01480
3997.5F75029993
$$ plain form
3875.2 651624620 652341127 652557433 653001189 653664887 654333711 655165315 655731022 656206429 657004118 657563984
3895.5 657563984 657519460 657310784 657479584 658225298 659415662 660540700 661276519 661657512 661774993
3913.9 661774993 661857307 662205815 662741601 663146853 663490117 663949490 664281249 664439380 664845228 665518880
3934.3 665518880 666039765 666279614 666408420 666656077 667072296 667481959 667869329 668327749 668768466 669081509
3954.7 669081509 669321954 669611454 669970453 670355678 670696676 670939445 671142161 671361446 671613455 671948195
3975.1 671948195 672336400 672684848 673025191 673360407 673571169 673688054 673882663 674167752 674447596 674728513
3995.5 674728513 675029993
3997.5 675029993
##END=$$ End of the data block
