##TITLE=Amostra 1 $$ Begin of the data block
##JCAMP-DX=5.00 $$ ACD/SpecManager v 10.08
##SPECTROMETER/DATA SYSTEM=Alpha
##DATE=23 Aug 2016 09:05:00
##DATA TYPE=INFRARED SPECTRUM
##DATA CLASS=XYDATA
##ORIGIN=
##OWNER=
##NPOINTS=1765
##FIRSTX=399.77209473
##LASTX=3997.72216797
##MAXX=3997.72216797
##MINX=399.77209473
##MAXY=0.83682489
##MINY=0.49469182
##XFACTOR=1.0000000000
##YFACTOR=1.000000000000000e-9
##FIRSTY=0.75868034
##DELTAX=2.03965425
##XUNITS=1/CM
##YUNITS=ARBITRARY UNITS
##XYDATA=(X++(Y..Y))
399.8G58680344P56085O15298k49028l96490k41578l95476l96073p74920j538813q11279
$$ 758680344 759436429 760051727 759802699 759406209 759164631 758769155 758373082 757598162 756059349 755248070
420.2G55248070K51055j29521k37108K1935l61443q14676r72271q11160k52902j97530
$$ 755248070 755499125 755369604 755132496 755154431 754792988 753978312 753006041 752194881 751941979 751744449
440.6G51744449o35385m26114k42114p67291q91506o18458r61959j211524p01786m90009
$$ 751744449 751109064 750682950 750440836 749673545 748782039 748163581 747201622 745990098 745288312 744798303
461G44798303l82483k21074n16295m25995j55747l44038j23799J52111k66730m83215
$$ 744798303 744415820 744194746 743678451 743252456 743096709 742752671 742628872 742780983 742514253 742031038
481.4G42031038l58045n36979m55021j68026l87430l66628P5340n0783k74539p5162
$$ 742031038 741672993 741136014 740680993 740512967 740125537 739758909 739834249 739783466 739508927 739433765
501.8G39433765j33156j32859J69873q0883l69728k73764n93186p28249k85447l57926
$$ 739433765 739300609 739167750 739337623 739256740 738887012 738613248 738020062 737291813 737006366 736648440
522.2G36648440n29110j04308j26124m75049k51054j99020k79248R3043P9989j05798
$$ 736648440 736119330 736015022 735888898 735413849 735162795 734963775 734684527 734777570 734857559 734751761
542.5G34751761J35064q2672m28199k2650J96218l4451N6088N0604q4400L43204O05166
$$ 734751761 734886825 734804153 734375954 734353304 734549522 734515071 734571159 734621763 734537363 734880567 735485733
565G35485733L36408M67837O01590K55823K90155M44651J43886K01940M92811K75791
$$ 735485733 735822141 736289978 736891568 737147391 737437546 737882197 738026083 738228023 738720834 738996625
585.4G38996625K53022M37796K36094L63350O64949L67880K58625N12778K52307J32143
$$ 738996625 739249647 739687443 739923537 740286887 740951836 741319716 741578341 742091119 742343426 742475569
605.8G42475569N01454K70844j02759k4497l06964l71456K93553L96192J87397N15639
$$ 742475569 742977023 743247867 743145108 743120611 742813647 742442191 742735744 743131936 743319333 743834972
626.2G43834972M53651J10150M12285N15282K35796M63605M61638m9233J5974J12235
$$ 743834972 744288623 744398773 744811058 745326340 745562136 746025741 746487379 746438146 746454120 746566355
646.6G46566355k88427j16706K41697M173M8101L90052K42532K69532L0756j788139
$$ 746566355 746277928 746161222 746402919 746407092 746455193 746845245 747087777 747357309 747388065 745599926
667G45599926j315654K008081J724004N50330N78106N00500K94804N87583M91798J27733
$$ 745599926 744284272 746292353 748016357 748566687 749144793 749645293 749940097 750527680 751019478 751147211
687.4G51147211K68876R1970m89056n94199n73158m52638M27485J356542J754165K295375
$$ 751147211 751416087 751508057 751019001 750424802 749851644 749399006 749826491 751183033 752937198 755232573
707.8G55232573K501726J931309J762569J785815J109839Q08358J091420Q16942N46813
$$ 755232573 757734299 759665608 761428177 763213992 764323831 765132189 766223609 767040551 767587364
726.1G67587364P43389O52611N67138Q08358O57559M10259O13630N79655L62575N91218
$$ 767587364 768330753 768983364 769550502 770358860 771016419 771426678 772040308 772619963 772982538 773573756
746.5G73573756P30098O83426J069844J270950J030266J206398J471639J343787J413405
$$ 773573756 774303854 774987280 776057124 777328074 778358340 779564738 781036377 782380164 783793569
764.9G83793569J491785J189232J145780J188933Q27015P67052J073003J029313R71555
$$ 783793569 785285354 786474586 787620366 788809299 789636314 790403366 791476369 792505682 793477237
783.2G93477237J157940J019835Q33571R65893Q50618O62506Q82029Q78096O28710
$$ 793477237 794635177 795655012 796488583 797454476 798305094 798967600 799849629 800727725 801356435
801.6H01356435P71463Q77917P50720Q55386Q67188O60003P27415P18593M20153M40657
$$ 801356435 802127898 803005815 803756535 804611921 805479109 806139112 806866527 807585120 808005273 808445930
822H08445930O03974N06401O42896R96530J071572J265049J654208J640558J428068
$$ 808445930 809049904 809556305 810199201 811195731 812267303 813532352 815186560 816827118 818255186
840.3H18255186J340389J043380O84976O25670M87566J76668O3718K4974J18971N16415
$$ 818255186 819595575 820638955 821323931 821949601 822437167 822613835 822677553 822702527 822821498 823337913
860.7H23337913O81400O01232P65681Q11219N05388L75033L78489K64585L93212O10113
$$ 823337913 824019313 824620545 825386226 826197445 826702833 827077866 827456355 827720940 828114152 828724265
881.1H28724265N20885M70638N07057L18289K41816M00245L89993L50178M30107L44097
$$ 828724265 829245150 829715788 830222845 830541134 830782950 831183195 831573188 831923366 832353473 832697570
901.5H32697570K22504K34008J02997m1067M6312j6749k36868j99199j84298l43263
$$ 832697570 832920074 833154082 833257079 833216012 833262324 833245575 833008707 832809508 832625210 832281947
921.9H32281947k27213m5359j08957r6679q2791k14398j69754q1241k27511k87354
$$ 832281947 832054734 832009375 831900418 831803739 831720948 831506550 831336796 831255555 831028044 830740690
942.3H30740690k25723l54886m77194n11706p22170r02951q66890q91566q90792o92188
$$ 830740690 830514967 830160081 829682887 829171181 828449011 827546060 826679170 825787604 824896812 824204624
962.7H24204624o29247o71803n35250m94063o06656n36680m57764n54621n96404o48976
$$ 824204624 823575377 822903574 822368324 821874261 821267605 820730925 820273161 819718540 819122136 818473160
983.1H18473160p97629q07107q11517r90450j094938j128077j283228j422048j470745
$$ 818473160 817675531 816868424 816056907 815066457 813971519 812843442 811560214 810138166 808667421
1001.5H08667421j567244j679659j852989k205134k479791k496660k506852k488911
$$ 808667421 807100177 805420518 803567529 801362395 798882604 796385944 793879092 791390181
1017.8G91390181k210319j863122j510382r21011j52290P44581J815439K571642K607703
$$ 791390181 789179862 787316740 785806358 784885347 784733057 785477638 787293077 789864719 792472422
1036.1G92472422K285898J817405J164436O42837L47077O2764r5546j01030j92940
$$ 792472422 794758320 796575725 797740161 798382998 798730075 798792839 798697293 798596263 798403323
1054.5G98403323k58625j77502j33753j18256m4346n6028j62721k40862l75688n75960
$$ 798403323 798144698 797967196 797833443 797715187 797670841 797614813 797452092 797211230 796835542 796259582
1074.9G96259582o02543n08249m93348l93808k48909l56793n40555o18279p78853r21727
$$ 796259582 795657039 795148790 794655442 794261634 794012725 793655932 793115377 792497098 791718245 790796518
1095.3G90796518r35495j054883j193344j146674j127661j205980j177073j069903
$$ 790796518 789861023 788806140 787612796 786466122 785338461 784132481 782955408 781885505
1111.6G81885505q93712m77076M5598M46975P74443R72509R37403R16123J080275J110851
$$ 781885505 780991793 780514717 780560315 781007290 781781733 782754242 783691645 784607768 785688043 786798894
1132G86798894Q50678N26786J30892l24786o94156j083255j429021j518369j493931
$$ 786798894 787649572 788176358 788307250 787982464 787288308 786205053 784776032 783257663 781763732
1150.4G81763732j434922j160025p86543n27084l17454j88411k36988l23415l93510
$$ 781763732 780328810 779168785 778382242 777855158 777537704 777349293 777112305 776788890 776395380
1168.7G76395380m27126k12908J23799K11894Q5950o4254k75731n39005p29262q94666
$$ 776395380 775968254 775755346 775879145 776091039 776176989 776112735 775837004 775297999 774568737 773674071
1189.1G73674071j080096j190007j287937j449406j523912j525998j582921j567006
$$ 773674071 772593975 771403968 770116031 768666625 767142713 765616715 764033794 762466788
1205.4G62466788j464367j455903j509845j543462j590371j595319j543641j491308
$$ 762466788 761002421 759546518 758036673 756493211 754902840 753307521 751763880 750272572
1221.8G50272572j370609j164794r72986p89821n64695l51607j38402J04189K78949
$$ 750272572 748901963 747737169 746764183 745974362 745409667 745058060 744919658 745023847 745302796
1240.1G45302796L78132M91500N74231N82993N88298N52178M38153L36171K59697K17915
$$ 745302796 745680928 746172428 746746659 747329652 747917950 748470128 748908281 749244452 749504149 749722064
1260.5G49722064K90691L93033M46797N32865O24061O67274P15733P55906P29859P38978
$$ 749722064 750012755 750405788 750852585 751385450 752009511 752676785 753392518 754148424 754878283 755617261
1280.9G55617261Q85963J086533J286149J530946J749873J864433J942992J938343
$$ 755617261 756503224 757589757 758875906 760406852 762156725 764021158 765964150 767902493
1297.2G67902493J799703J612902J374662J068234P80702N31196K60353L6359j09434
$$ 767902493 769702196 771315098 772689760 773757994 774538696 775069892 775330245 775366604 775257170
1315.6G75257170k76327m38392o04749q85546j174748j317978j301050j129270q53121
$$ 775257170 774980843 774542451 773937702 773052156 771877408 770559430 769258380 768129110 767275989
1333.9G67275989o03855l18646K94208R56774J082957Q14915N41508L31163Q8334j94013
$$ 767275989 766672134 766353488 766647696 767604470 768687427 769502342 770043850 770375013 770463347 770269334
1354.3G70269334l97384o52969j168549j519084j316249j191318j249850j050353j009464
$$ 770269334 769871950 769218981 768050432 766531348 765215099 764023781 762773931 761723578 760714114
1372.7G60714114r83060p12096j005888j933217k206505p98702J315892K375602J872242
$$ 760714114 759731054 759018958 758013070 756079853 753873348 753074646 754390538 756766140 758638382
1391.1G58638382O47664j19686k27690m46796o49035j011610j368583j004338n78284
$$ 758638382 759286046 759166360 758938670 758491874 757842839 756831229 755462646 754458308 753880024
1409.4G53880024m00603j32441m6909m07100j84715P18594N88059r2387o83546j283109
$$ 753880024 753479421 753346980 753300071 752892971 752708256 753426850 754014909 753922522 753238976 751955867
1429.8G51955867j385451j516938k200961j676440k94089j51873n16713p12573n87702
$$ 751955867 750570416 749053478 746852517 745176077 744881988 744730115 744213402 743500829 742913127
1448.2G42913127k31564j69396m50612o90758P72000K276122J271308l21210l45170
$$ 742913127 742681563 742512167 742061555 741370797 742142797 744418919 745690227 745369017 745023847
1466.5G45023847J01804o70910j303911m64439l3975o44147j472235k119064k632141
$$ 745023847 745125651 744454741 743150830 742686391 742652416 742008269 740536034 738416970 735784829
1484.9G35784829l376067l999352l423572k287269k664506l420055k369821j255214
$$ 735784829 732408762 728409410 724985838 722698569 720034063 716614008 714244187 712988973
1501.2G12988973j682341l627778m226923j210808M1961m70459q55684n44668j07228
$$ 712988973 711306632 707678854 703451931 702241123 702283084 701812625 700956941 700412273 700305045
1519.6G00305045j35661M03762P57754O27697N61893r418k10464M11630k52783j481057
$$ 700305045 700169384 700573146 701330900 701958597 702520490 702511072 702300608 702712238 702459455 700978398
1539.9G00978398J7226J849890K069533J548111J045406R79841Q16941K00927l02076
$$ 700978398 700995624 702845514 704915047 706463158 707508564 708488405 709305346 709506273 709204197
1558.3G09204197K004266L848731L029168K065122J525641J948595K423644J521110
$$ 709204197 711208463 715057194 718086362 720151484 721677125 723625720 726049364 727570474
1574.6G27570474J065135J935423J755595Q11577J86562l63231r95099j587629k109886
$$ 727570474 728635609 730571032 732326627 733138204 733324766 732961535 731966436 730378807 728268921
1593G28268921k509534k687335k935469l361821l660500l875792m251123m593372m592836
$$ 728268921 725759387 723072052 720136583 716774762 713114262 709238470 704987347 700393975 695801139
1611.3F95801139m606307n469024n788684m038632l758549m621029m113555l446102
$$ 695801139 691194832 685725808 679937124 675898492 672139943 667518914 663405359 659959257
1627.7F59959257k969087k325594k622962k779067o97314P33971O55413J51813k27272
$$ 659959257 656990170 654664576 652041614 649262547 648565233 649299204 649954617 650106430 649879158
1646F49879158R65297J817286O10709J225650L475786L133058K084911J738846K203703
$$ 649879158 650844455 652661741 653272450 654498100 657973886 661106944 663191855 664930701 667134404
1664.4F67134404K198398J513660J722455K345503K159774K290964K543509J933992
$$ 667134404 669332802 670846462 672568917 674914420 677074194 679365158 681908667 683842659
1680.7F83842659Q74400J181901K899348K981067K427876J877129J025260R97960J584590
$$ 683842659 684717059 685898960 688798308 691779375 694207251 696084380 697109640 698107600 699692190
1699F99692190K749800L853023L666640L718555L964007L657937L108620K580524K966881
$$ 699692190 702441990 706295013 709961653 713680208 717644215 721302152 724410772 726991296 729958177
1717.4G29958177M394292M648805L921092L489196L173113K774238K205730K014100
$$ 729958177 734352469 739001274 742922366 746411562 749584675 752358913 754564643 756578743
1733.7G56578743L291607L631533K863407K727568K791464K465904J993954J895249
$$ 756578743 759870350 763501883 766365290 769092858 771884322 774350226 776344180 778239429
1750G78239429K514601K710283K119958J829207J672923J602769J917184J629710J025975
$$ 778239429 780754030 783464313 785584271 787413478 789086401 790689170 792606354 794236064 795262039
1768.4G95262039O94692Q87751J842916K116621J529455J183331J231015J260877J331567
$$ 795262039 795956731 796844482 798687398 800804019 802333474 803516805 804747820 806008697 807340264
1786.7H07340264J086951M27544O09219J509249J479566Q96633P90655J136780J263917
$$ 807340264 808427215 808854759 809463978 810973227 812452793 813349426 814140081 815276861 816540778
1805.1H16540778R82940O45280O61790R18508Q77619O91592O97494O05583L09110L14593
$$ 816540778 817523718 818168998 818830788 819749296 820626915 821318507 822016001 822621584 822930694 823245287
1825.5H23245287M26769L40641P82490J096010P14242N06520N06342O8962k93314M12047
$$ 823245287 823672056 824012697 824795187 825891197 826605439 827111959 827618301 827687263 827393949 827805996
1845.9H27805996J033366Q57532N81860L73721K82050K87830K87772K78651J81377
$$ 827805996 828839362 829696894 830278754 830652475 830934525 831222355 831510127 831788778 831970155
1864.3H31970155j84357l49760L05891Q14676N48423K40087J66595J45912J31727J01983
$$ 831970155 831785798 831436038 831741929 832556605 833105028 833345115 833511710 833657622 833789349 833891332
1884.7H33891332J5617p7427J19388L12686K08736K02775K52068K06411J63555J17779
$$ 833891332 833906949 833829522 833948910 834261596 834470332 834673107 834925175 835131586 835295141 835412920
1905H35412920N8174O8664J93715K55883L7015k19584j3649K14457J67847K45929K61843
$$ 835412920 835471094 835539758 835733473 835989356 836026371 835806787 835793138 836007595 836175442 836421371 836683214
1927.5H36683214J16169K3008K503j3351n5910j65224k91526j20521J57416J14024
$$ 836683214 836799383 836822391 836824894 836811543 836755633 836590409 836298883 836178362 836335778 836449802
1947.9H36449802k8133l9459k4616n0664o8665o0558n2929p6056j21534o5505M7922
$$ 836449802 836421669 836382210 836357594 836306930 836238265 836177707 836124778 836048722 835927188 835861683 835909605
1970.3H35909605M3929k1339k8133J907k5987p1347m2677o0201j62005j68860m0651
$$ 835909605 835953534 835932195 835904062 835905969 835879982 835808635 835765958 835705757 835543752 835374892 835334241
1992.8H35334241O2347L8326k3127n2094m6492m6432r2566j01805p2002j00911j51634
$$ 835334241 835396588 835434914 835411787 835359693 835313201 835266769 835174203 835072398 835000396 834899485 834747851
2015.2H34747851j38283j81854l93808q48054r18389J21832R35495N55933O0558j5259
$$ 834747851 834609568 834427714 834033906 833185852 832267463 832389295 833324790 833880723 833941281 833926022
2035.6H33926022k265p4923j00076n4121p8619q8334m7266o6996p3612k8967o1334
$$ 833926022 833923757 833848834 833748758 833694637 833616018 833527684 833480418 833413422 833339810 833310843 833249509
2058H33249509r6619p2777j02222j06990m0353o9022j18852m3034n663p1883o6221
$$ 833249509 833152890 833080113 832977891 832870901 832830548 832761526 832642674 832599640 832593977 832522094 832455873
2080.5H32455873j3887l6240n4419n1916o4075k5391J4722l5047o2347j3411j9431
$$ 832455873 832441986 832405746 832351327 832299411 832235336 832209945 832224667 832189620 832127273 832113862 832094431
2102.9H32094431n7578l1054k5392n9426m7504m2737m9591n305J5020l7193m4465M649
$$ 832094431 832036853 832005799 831980407 831920981 831873477 831830740 831781149 831775844 831790864 831753671 831709206 831713855
2127.4H31713855O0k3067k5332l0577j4663J9014L457l5822j7941n365k8610j6570
$$ 831713855 831713915 831690848 831665516 831634939 831620276 831639290 831642747 831606925 831588984 831583619 831555009 831538439
2151.8H31538439j848k2173o556Q404m3392n1380l4809q4340m0055Q5056P3791O795
$$ 831538439 831536591 831514418 831507862 831516266 831472874 831421494 831386685 831302345 831262290 831347346 831421137 831427932
2176.3H31427932P093L576j6153j9491l1173l7908k6763l9518l8206K086o735m3333
$$ 831427932 831435025 831438601 831422448 831402957 831371784 831333876 831307113 831267595 831229389 831231475 831224740 831181407
2200.8H31181407k6226k2888m0889j9729k3127m9293k2828j4425o1691m2974j20l3617
$$ 831181407 831155181 831132293 831091404 831071675 831048548 830999255 830976427 830962002 830900311 830857337 830857217 830823600
2225.3H30823600l6776p927n4836r6262o7234o8963q6426n8472o2883r7633q2254q1122
$$ 830823600 830786824 830778897 830724061 830627799 830560565 830491602 830405176 830346704 830283821 830186188 830103934 830022812
2249.7H30022812j25527j08064r1612j45257j19745n1678j01208j50621j17064r6798
$$ 830022812 829897285 829789221 829697609 829552352 829432607 829380929 829279721 829129100 829012036 828915238
2270.1H28915238o3121l2961r5189j09374k9505o2704j79589k30848k71142l16977
$$ 828915238 828852117 828819156 828723967 828614593 828585088 828522384 828342795 828111947 827840805 827523828
2290.5H27523828l07799l11017l67343l94702m27544n33879o31988o97315q10087q63433
$$ 827523828 827216029 826905012 826537669 826142967 825715423 825181544 824549556 823852241 823042154 822178721
2310.9H22178721p52806o95229q71241j132965j241922j045943p02381p03811r49562
$$ 822178721 821425915 820730686 819859445 818726480 817484558 816438615 815736234 815032423 814082861
2329.3H14082861p96676m51982m91857o13392n42521l91960J21057J334548J975059
$$ 814082861 813286185 812834203 812342346 811728954 811186433 810794473 810915530 812250078 814225137
2347.6H14225137P10488j481474k852678k702594j863062r67741j82569N56171J169979
$$ 814225137 814935625 813454151 810601473 807898879 806035817 805068076 804885507 805441678 806611657
2366H06611657J552999J781821J885653J876414J873135J860500J715779J420617R84788
$$ 806611657 808164656 809946477 811832130 813708544 815581679 817442179 819157958 820578575 821563363
2384.4H21563363M84705J44124P927j00851j98006k02477j90139k19524k31445k27630
$$ 821563363 822048068 822192192 822200119 822099268 821901262 821698785 821508646 821289122 821057677 820830047
2404.7H20830047k07245j49667j59026k52783k59399k09153k50697k80023k44796k47777
$$ 820830047 820622802 820473135 820314109 820061326 819801927 819592774 819342077 819062054 818817258 818569481
2425.1H18569481k44140j86980j83225k12371j86801j84774k18630j92583j48415j55867
$$ 818569481 818325341 818138361 817955136 817742765 817555964 817371190 817152560 816959977 816811562 816655695
2445.5H16655695j75774j91390j99557j76370j68383k07245k15709j73569j68264j96934
$$ 816655695 816479921 816288531 816088974 815912604 815744221 815536976 815321267 815147698 814979434 814782500
2465.9H14782500j88172j85489k31087k45333k32935k51055k61187k52367k39372k25127
$$ 814782500 814594328 814408839 814177752 813932419 813699484 813448429 813187242 812934875 812695503 812470376
2486.3H12470376k17616k21551k38478k50220k45571k36869k31206k33710k34485k10404
$$ 812470376 812252760 812031209 811792731 811542511 811296940 811060071 810828865 810595155 810360670 810150266
2506.7H10150266j98067k10583k17259k34365k55168k46405k24293k17080k23398k35855
$$ 810150266 809952199 809741616 809524357 809289992 809034824 808788419 808564126 808347046 808123648 807887793
2527.1H07887793k35200k25425k41161k68816k69413k57671k63691k82288k99454k87354
$$ 807887793 807652593 807427168 807186007 806917191 806647778 806390107 806126416 805844128 805544674 805257320
2547.5H05257320k54750k58624k92480l03090k88606k88844l06904l20196l19541l02553
$$ 805257320 805002570 804743946 804451466 804148376 803859770 803570926 803264022 802943826 802624285 802321732
2567.9H02321732l05891l29375l29376l18825l19898l25262l14653k73288k54869l00527
$$ 802321732 802015841 801686466 801357090 801038265 800718367 800393105 800078452 799805164 799550295 799249768
2588.3G99249768l39448l15786k68578k87473l29912k86460k44319k82526l13044k91705
$$ 799249768 798910320 798594534 798325956 798038483 797708571 797422111 797177792 796895266 796582222 796290517
2608.7G96290517k44677k01464k12133k68280k84255k56956k60055k67565k27928k05755
$$ 796290517 796045840 795844376 795632243 795363963 795079708 794822752 794562697 794295132 794067204 793861449
2629.1G93861449k35200k49803k16842j99675k21074k43068k58446k45988k32220k73466
$$ 793861449 793626249 793376446 793159604 792959929 792738855 792495787 792237341 791991353 791759133 791485667
2649.5G91485667k82228k31743k46346k77638k60651k84791l22282l11494k94328k68579
$$ 791485667 791203439 790971696 790725350 790447712 790187061 789902270 789579988 789268494 788974166 788705587
2669.9G88705587k45809k87175l44336l47793l31402l54886l72827l51727l54708l52502
$$ 788705587 788459778 788172603 787828267 787480474 787149072 786794186 786421359 786069632 785714924 785362422
2690.3G85362422l39865l51668l29911k99871l37184l82423l75450l79026l89337l69788
$$ 785362422 785022557 784670889 784340978 784041107 783703923 783321500 782946050 782567024 782177687 781807899
2710.7G81807899l79204m19617m29153m21167m13477l88742l75986m19795m60923m44233
$$ 781807899 781428695 781009078 780579925 780158758 779745281 779356539 778980553 778560758 778099835 777655602
2731.1G77655602m30286l96491l48389l86715m26232l91722l48032l34263l55482l92675
$$ 777655602 777225316 776828825 776480436 776093721 775667489 775275767 774927735 774593472 774237990 773845315
2751.5G73845315m06981l78370l78489m34935m52698m26173m24683m14670l80337l86893
$$ 773845315 773438334 773059964 772681475 772246540 771793842 771367669 770942986 770528316 770147979 769761086
2771.9G69761086m19975m66466n25534n38111m88579m43518m47512m70876n21005n73933
$$ 769761086 769341111 768874645 768349111 767811000 767322421 766878903 766431391 765960515 765439510 764865577
2792.3G64865577n51522m78625m83990n90980o42776n96404n45800n18441n46038o15895
$$ 764865577 764314055 763835430 763351440 762760460 762117684 761521280 760975480 760457039 759911001 759295106
2812.7G59295106o24299n63502n11587m94242n12063n49674n60701n59688n93424o31809
$$ 759295106 758670807 758107305 757595718 757101476 756589413 756039739 755479038 754919350 754325926 753694117
2833.1G53694117o52313p14421r56476j314819j541019j673877j818716j805008j496076
$$ 753694117 753041804 752327383 751370907 750056088 748515069 746841192 745022476 743217468 741721392
2851.4G41721392j110435q82268p64668p75277r47714j146257j283467j330197j183092
$$ 741721392 740610957 739728689 738964021 738188744 737241030 736094773 734811306 733481109 732298017
2869.8G32298017q43704n66781l75986l0100L10421L91423K86043P6771k02298m97222
$$ 732298017 731454313 730887532 730511546 730481446 730791867 731183290 731469333 731546104 731343806 730846584
2890.2G30846584p28727q72373j041055j245141j309097j254081j284540j410186j528264
$$ 730846584 730117857 729245484 728204429 726959288 725650191 724396110 723111570 721701384 720173120
2908.5G20173120j627027j797259k069533k223075k050399j691401j360596j082539
$$ 720173120 718546093 716748834 714679301 712456226 710405827 708714426 707353830 706271291
2924.8G06271291p52270m07517k38657j08540J93893N13494P22588Q70287Q38459N11705
$$ 706271291 705519021 705111504 704872847 704764307 704958200 705471694 706194282 707064569 707903028 708414733
2945.2G08414733J6511m49061p42496r66548j168967j119315p61032l07978P3850M24386
$$ 708414733 708431244 707982183 707239687 706273139 705104172 703984857 703223825 702915847 702989697 703414083
2965.6G03414083P75516J060426J317858J499713J464248J389384J361728J172125
$$ 703414083 704189599 705250025 706567883 708067596 709531844 710921228 712282956 713455081
2981.9G13455081R42409Q64863Q23617P43390N63025K76685P6532p0512k83897m12822
$$ 713455081 714397490 715262353 716085970 716829360 717392385 717669070 717745602 717675090 717391193 716978371
3002.3G16978371m44293m99606m89831m21643n37813q46267j098931j208305j247048
$$ 716978371 716534078 716034472 715544641 715122998 714585185 713738918 712639987 711431682 710184634
3020.7G10184634j221895j174152j132489r90331p85649o74843p26581q40008q40903
$$ 710184634 708962739 707788587 706656098 705665767 704880118 704205275 703478694 702638686 701797783
3039G01797783p64370q02040r98020j111805j012028r34422r95755j005471r42707
$$ 701797783 701033413 700231373 699233353 698121548 697109520 696175098 695179343 694173872 693231165
3057.4F93231165q96036p72119n72562m39286m37618n15878n34177m16219k36869j69634
$$ 693231165 692335129 691563010 690990448 690551162 690113544 689597666 689063489 688647270 688410401 688240767
3077.8F88240767k81811l71814l33667l11076k86639k31624k63631l00884k28882j61350
$$ 688240767 687958956 687587142 687253475 686942399 686655760 686424136 686160505 685859621 685630739 685469389
3098.2F85469389k12073l13402l27766k44259k24352l66211m11570k56896k55168m58359
$$ 685469389 685257316 684943914 684616148 684371889 684147537 683781326 683369756 683112860 682857692 682399333
3118.6F82399333p00176q95679q95441p70151p06256p82013r02831q94487p80583p70926
$$ 682399333 681699157 680803478 679908037 679137886 678431630 677649617 676746786 675852299 675071716 674300790
3139F74300790r81450j171768j144826j047075r73463r68755j174807j426101j431465
$$ 674300790 673319340 672147572 671002746 669955671 668982208 668013453 666838646 665412545 663981080
3157.3F63981080j336098j317143j318753j319289j350224j393437j422704j438975
$$ 663981080 662644982 661327839 660009086 658689797 657339573 655946136 654523432 653084457
3173.7F53084457j460314j495778j474023j438499j482963j522601j492322j481950
$$ 653084457 651624143 650128365 648654342 647215843 645732880 644210279 642717957 641236007
3190F41236007j534879j566291j546800j528203j516045j490593j462459j449704j454175
$$ 641236007 639701128 638134837 636588037 635059834 633543789 632053196 630590737 629141033 627686858
3208.3F27686858j437664j410544j416206j412273j402318j417577j408875j369000
$$ 627686858 626249194 624838650 623422444 622010171 620607853 619190276 617781401 616412401
3224.6F16412401j355886j326919j194954j133859j312852j468301j415968j311600
$$ 616412401 615056515 613729596 612534642 611400783 610087931 608619630 607203662 605892062
3241F05892062j230597j153648j168430j291990j310885j182676j089930j114667j176357
$$ 605892062 604661465 603507817 602339387 601047397 599736512 598553836 597463906 596349239 595172882
3259.3E95172882j170456j130700j106620j015961q69334r33826j159847j216888j130224
$$ 595172882 594002426 592871726 591765106 590749145 589879811 588945985 587786138 586569250 585439026
3277.7E85439026j058638j051187j054824j009822r51528q82447q65519r71734j113236
$$ 585439026 584380388 583329201 582274377 581264555 580313027 579430580 578565061 577593327 576480091
3296E76480091j198590j155317r73880q14855r10640j226485j425922j400590j322329
$$ 576480091 575281501 574126184 573152304 572337449 571426809 570200324 568774402 567373812 566051483
3314.4E66051483j273453j247048j256586j224577j186430j342476j544773j537383
$$ 566051483 564778030 563530982 562274396 561049819 559863389 558520913 556976140 555438757
3330.7E55438757j435995j377463j345397j400053j546383j641631j650035j559198
$$ 555438757 554002762 552625299 551279902 549879849 548333466 546691835 545041800 543482602
3347E43482602j414895j531184j846433j888692j688779j588046j627922j615763j441419
$$ 543482602 542067707 540536523 538690090 536801398 535112619 533524573 531896651 530280888 528839469
3365.4E28839469j310468j492560j833141j889705j652658j485706j461446j471042
$$ 528839469 527529001 526036441 524203300 522313595 520660937 519175231 517713785 516242743
3381.7E16242743j439393j313388j114667r29713j005352j297235j288116q90613o84321
$$ 516242743 514803350 513489962 512375295 511445582 510440230 509142995 507854879 506964266 506279945
3400E06279945j002013j323045j169979q69453p55727p81179q32230q11577p14033
$$ 506279945 505277932 503954887 502784908 501915455 501159728 500378549 499546319 498734742 498020709
3418.4D98020709o30528n41598l96579k56747j86444j97917j19030N752j29700l67582
$$ 498020709 497390181 496848583 496452004 496195257 496008813 495810896 495691866 495697618 495567918 495200336
3438.8D95200336l59416j49101M6939J32799J51932J96129K60353L30448M37737N12510
$$ 495200336 494840920 494691819 494738758 494871557 495023489 495219618 495479971 495810419 496248156 496760666
3459.2D96760666M36843M46588P61419R69291O75976K63751K96235O21140Q86857Q86977
$$ 496760666 497197509 497644097 498405516 499374807 500050783 500314534 500610769 501231909 502118766 503005743
3479.6E03005743O42478O26028Q63731R27150Q78215R42350J045048J108646J126111
$$ 503005743 503648221 504274249 505137980 506065130 506943345 507885695 508930743 510039389 511165500
3497.9E11165500J142561J115382R71436R25720J070201J278222J484633J452803J231671
$$ 511165500 512308061 513423443 514394879 515320599 516390800 517669022 519153655 520606458 521838129
3516.3E21838129J186311J324534J467824J431823J297176J361430J587748J733542
$$ 521838129 523024440 524348974 525816798 527248621 528545797 529907227 531494975 533228517
3532.6E33228517J775384J718819J621067J684427J792968J720845J588166J648247
$$ 533228517 535003901 536722720 538343787 540028214 541821182 543542027 545130193 546778440
3548.9E46778440J760245J837075J955986J989483J965464J953721J804530J550079
$$ 546778440 548538685 550375760 552331746 554321229 556286693 558240414 560044944 561595023
3565.3E61595023J817047K587021K766549K400637K205789K252698K425194K567887
$$ 561595023 563412070 565999091 568765640 571166277 573372066 575624764 578049958 580617845
3581.6E80617845K423704J963198J850009K563059K878309K514600K480090K770722
$$ 580617845 583041549 585004747 586854756 589417815 592296124 594810724 597290814 600061536
3597.9F00061536K801418K741039K682626K331376K154827K508819K764166K815008
$$ 600061536 602862954 605603993 608286619 610617995 612772822 615281641 618045807 620860815
3614.2F20860815K683818K438903K857089L313542K920091J994073J629770K953470
$$ 620860815 623544633 625983536 628840625 632154167 635074258 637068331 638698101 641651571
3630.5F41651571L795326L374397K977431K766013K643228K568245K124488J338542
$$ 641651571 645446897 648821294 651798725 654564738 657207966 659776211 661900699 663239241
3646.8F63239241J412391K837837L431022K668977K427399K780020K400160J865626
$$ 663239241 664651632 667489469 670920491 673589468 676016867 678796887 681197047 683062673
3663.2F83062673J677990J117289N07831J076162J262307P41601J713991K470076K029837
$$ 683062673 684740663 685857952 686365783 687441945 688704252 689445853 691159844 693629920 695659757
3681.5F95659757J574218J021802J78039l8147Q95441J491606J181722O06060J41263
$$ 695659757 697233975 698255777 698433816 698395669 699291110 700782716 701964438 702570498 702711761
3699.9G02711761J27733O67214P24614K1398n92649j46806J047372J127780L09467
$$ 702711761 702839494 703506708 704231322 704252720 703660071 703513265 704560637 705688417 705997884
3718.2G05997884k62499l38018k15709Q166K93315o0201p80523p53105K24769J158894
$$ 705997884 705735385 705397367 705181658 705189824 705483139 705422938 704642415 703889310 704114079 705272973
3738.6G05272973P93159q39293j330972K69711J36375p39455M54843J356721O52134
$$ 705272973 706066132 705226839 703895867 704165578 704301953 703562498 704017341 705374062 706026196
3757G06026196p3254K00332L62694q5056l16858l43144L0517N12600K81811k78115
$$ 706026196 705952942 706153274 706515968 706430912 706114054 705770910 705801427 706314027 706595838 706317723
3777.4G06317723m34995j08838q166p0691O8367O5505r2089l80218o37889m92334p25985
$$ 706317723 705882728 705773890 705765724 705695033 705763400 705828905 705736816 705356598 704718709 704226375 703500390
3799.8G03500390p56085J99258J30773n1975N67198L63469o85215j131296n21362n80430
$$ 703500390 702744305 702943563 703074336 703022361 703589559 703953028 703267813 702136517 701615155 701034725
3820.2G01034725k12252P69794M64260p6175l43084m46618l62157p52271q34941K3543
$$ 701034725 700822473 701592267 702056527 701980352 701637268 701190650 700828493 700076222 699241281 699264824
3840.6F99264824M66586M81605M69804k1160j311600k512395o99997J593470J112819
$$ 699264824 699731410 700213015 700682819 700661659 699350059 696837664 696137667 697731137 698843956
3858.9F98843956j00136p18057m54664j56641n85675m07279K41935L83556J82092m93645
$$ 698843956 698743820 698025763 697571099 697414458 696828783 696421504 696663439 697046995 697229087 696735442
3879.3F96735442n13375j46151l39746l0577l8743m68612K0921K73943m58419j021087
$$ 696735442 696222067 696075916 695736170 695705593 695666850 695198238 695219159 695493102 695034683 694013596
3899.7F94013596q58367k92599M30345O82354K98143o9857l30388o26505n34415j08302
$$ 694013596 693155229 692862630 693292975 693975329 694273472 694203615 693873227 693246722 692712307 692604005
3920.1F92604005j0490j88887j49012j31488l44872k97666J1981L7491j74463m00424
$$ 692604005 692593515 692404628 692255616 692124128 691779256 691481590 691493571 691531062 691356599 690956175
3940.5F90956175m65810k02596j14918k79128j81497J2041k2591j74820k78533k89082
$$ 690956175 690490365 690287769 690172851 689893723 689712226 689724267 689701676 689526856 689248323 688959241
3960.9F88959241k14100j52349j52767j69039k16722k62678k04921j20640j38819j81138
$$ 688959241 688745141 688592792 688440025 688270986 688054264 687791586 687586665 687466025 687327206 687146068
3981.3F87146068j90854k40326k62678k07365j93774k16365j89960j25289
$$ 687146068 686955214 686714888 686452210 686244845 686051071 685834706 685644746 685519457
3997.6F85519457
$$ 685519457
##END=$$ End of the data block
