##TITLE=Amostra 1 - Marcela $$ Begin of the data block
##JCAMP-DX=5.00 $$ ACD/SpecManager v 10.08
##SPECTROMETER/DATA SYSTEM=Alpha
##DATE=24 Oct 2013 10:57:42
##DATA TYPE=INFRARED SPECTRUM
##DATA CLASS=XYDATA
##ORIGIN=
##OWNER=
##NPOINTS=1765
##FIRSTX=399.75695801
##LASTX=3997.56933594
##MAXX=3997.56933594
##MINX=399.75695801
##MAXY=0.83324397
##MINY=0.15998206
##XFACTOR=1.0000000000
##YFACTOR=1.000000000000000e-9
##FIRSTY=0.45736071
##DELTAX=2.03957629
##XUNITS=1/CM
##YUNITS=ARBITRARY UNITS
##XYDATA=(X++(Y..Y))
399.8D57360715l545910j960844j089722k52187O11156J763642K230584J165241l07053
$$ 457360715 453814805 451853961 450764239 450512052 451123208 452886850 455117434 456282675 455975622
418.1D55975622j211464j452297j988233k998411l384590k724111j679838j044512
$$ 455975622 454764158 453311861 451323628 448325217 444940627 442216516 440536678 439492166
434.4D39492166q53717k90633J396657L665894M705161L891319K673983K361685K520681
$$ 439492166 438638449 438347816 439744473 443410367 448115528 452006847 454680830 457042515 459563196
452.8D59563196J552760m16636j752198j834750j768321k386123l599673m352272l984839
$$ 459563196 461115956 460699320 458947122 457112372 455344051 452957928 449358255 445005983 441021144
471.1D41021144l200441k861321k933741k398759r95338J49965K77251k67416p56502
$$ 441021144 437820703 434959382 432025641 429626882 428631544 428781509 429058760 428791344 428034842
489.5D28034842o57171l84629q59350j710623k116949k039969j850396k265751l345162
$$ 428034842 427377671 426993042 426133692 424423069 422306120 420266151 418415755 416150004 412804842
507.9D12804842m073590l978759l720850m067004m767924m821986l743559k045602
$$ 412804842 408731252 404752493 401031643 396964639 392196715 387374729 383631170 381585568
524.2C81585568p29054N1737J014918K480864M167825N455673N852878N403251M463076
$$ 381585568 380856514 380908251 381923169 384404033 388571858 394027531 399880409 405283660 409746736
542.5D09746736L300101J746744k73407j885116k424508k648592l508091m774481n721837
$$ 409746736 413046837 414793581 414520174 412635058 410210550 407561958 404053867 399279386 393557549
560.9C93557549o234378o588429p127405p407516o441653m157692j276791J400352
$$ 393557549 387323171 380734742 373607337 366199821 359758168 355600476 354323685 355724037
577.2C55724037L547460N366176O975770P936299P701993O197184M090160K314538
$$ 355724037 359271497 364637673 371613443 379549742 387251735 393448919 397539079 399853617
593.5C99853617J241684M18246k67178n05030l67135J22935P27832J211047J723915
$$ 399853617 401095301 401513547 401246369 400741339 400374204 400497139 401224971 402436018 404159933
611.9D04159933K445996L421039M407763M965782N160511N317926N307406M917622
$$ 404159933 406605929 410026968 414434731 419400513 424561024 429878950 435186356 440103978
628.2D40103978M091680L129244K484232K265602K082825J653314J208335J023024
$$ 440103978 444195658 447324902 449809134 452074736 454157561 455810875 457019210 458042234
644.5D58042234J165062J498580J574248J191318R22889J182377J613826J631737J180261
$$ 458042234 459207296 460705876 462280124 463471442 464394331 465576708 467190534 468822271 470002532
662.9D70002532P12335Q02696J860142K051055J319766R57579J299023J916260K020389
$$ 470002532 470714867 471517563 473377705 475428760 476748526 477706105 479005128 480921388 482941777
681.2D82941777J566797J027673Q44002J012802P36982n84215k202123l049791l156990
$$ 482941777 484508574 485536247 486380249 487393051 488130033 487545818 485343695 482293904 479136914
699.6D79136914l398687l910064l680408k061576L29882K417117L689289M561156N721242
$$ 479136914 475738227 471828163 468147755 466086179 466416061 468833178 472522467 477083623 482804865
717.9D82804865P278680Q278400P931233O983399O517708O548703O035090M446387
$$ 482804865 490083545 498361945 506293178 513276577 519794285 526342988 532378078 536824465
734.2E36824465K608895J508176J074970J29342k049505m558742o051481o378711o434738
$$ 536824465 539433360 540941536 542016506 542145848 540096343 535537601 529486120 523107409 516672671
752.6E16672671p007897p542670o767690m580855k011657J83850K364725N282790Q617729
$$ 516672671 509664774 502122104 495354414 490773559 488761902 488945752 491310477 496593267 505210996
771E05210996J0993182J1393428J0331929R319842Q922338Q359671O992340N332291
$$ 505210996 516204178 527597606 537929535 547249377 556171715 564531386 571523726 576856017
787.3E76856017M557610M960477N730033N934715N639851N783797O398439O399155
$$ 576856017 581413627 586374104 592104137 598038852 603678703 609462500 615860939 622260094
803.6F22260094N119979L285170K371668K609432K684832J761973K68817p28905r79186
$$ 622260094 627380073 630665243 633036911 635646343 638331175 640093148 640361965 639633060 638653874
821.9F38653874j553535l302455n646348p310748p875860q000374q394658q767426
$$ 638653874 637100339 633797884 628151536 620840788 612964928 604964554 596569896 587802470
838.3E87802470q268535o751001n096615m183828l869057l478229k811432k244473
$$ 587802470 579533935 572782934 567686319 563502491 559633434 556155205 553343773 551099300
854.6E51099300k066969j652539L17752M296422Q884132J2039959J3072312J2565077
$$ 551099300 549032331 547379792 547697544 551993966 560878098 572918057 585990369 598555446
870.9E98555446J1097133Q742332N378485J297951k699495n774855p699073q928418
$$ 598555446 609652579 618394911 623773396 625071347 622371852 616596997 608897924 599969506
887.2E99969506r710490r665430q614421p191896o324828o362796o935596p538617
$$ 599969506 590259016 580593586 571979165 564787269 558462441 552099645 545164049 537625432
903.5E37625432q175611r217382j0696471j2074709j2621641j2151956j1044175r524613
$$ 537625432 529449821 520232439 509535968 497461259 484839618 472687662 461643487 452118874
919.8D52118874p478387m907876k320736l71159Q28535J767605K930761M374861N795092
$$ 452118874 444640487 439732611 437411875 437040716 437869251 439636856 442567617 446942478 452737570
938.2D52737570O673217O323069M041910l11345n907833j1380434j5592456j8108666
$$ 452737570 459410787 465733856 469775766 469464421 463556588 452176154 436583698 418475032
954.5D18475032j9290507j9965142k0639062k1180451k1353274k1171421k0808131
$$ 418475032 399184525 379219383 358580321 337399870 316046596 294875175 274067044
968.8B74067044k0354718j9600495j8221543j6140803j3569340j0714651p731661m890293
$$ 274067044 253712326 234111831 215890288 199749485 186180145 175465494 167733833 162843540
985.1A62843540k419740m41745R35734J756608K231434K475858K540320K385020J923815
$$ 162843540 160423800 159982055 160917789 162674397 164905831 167381689 169922009 172307029 174230844
1003.5A74230844J255154O30364K86639K20776L17364N64427R87142J541913K105906
$$ 174230844 175485998 176116362 176403001 176623777 176941141 177505568 178492710 180034623 182140529
1021.8A82140529K536968K794534K974092L104032L030136K652839K104953J626357
$$ 182140529 184677497 187472031 190446123 193550155 196580291 199233130 201338083 202964440
1038.1B02964440J443923J546949J751586J983241K297163K785787L499582M376039
$$ 202964440 204408363 205955312 207706898 209690139 211987302 214773089 218272671 222648710
1054.5B22648710N309850O395161P829249R478033J0456085R190798M469216k669782
$$ 222648710 227958560 234353721 242182970 251661003 262117088 271307886 275777102 273107320
1070.8B73107320q750707j0843694r137616n856752k660245m9516J921907L284648
$$ 273107320 264356613 253512919 244375303 238518551 235858306 235808790 237730697 241015345
1087.1B41015345M212215M923627N378157N345017M632711L376931K128869J431168
$$ 241015345 245227560 250151187 255529344 260874361 265507072 268884003 271012872 272444040
1103.4B72444040J410931J866490K502679L093005L507852L616423L314912K748012
$$ 272444040 273854971 275721461 278224140 281317145 284824997 288441420 291756332 294504344
1119.7B94504344K297938K256543K690255L413409M046411M027813K892912O36667
$$ 294504344 296802282 299058825 301749080 305162489 309208900 313236713 316129625 316766292
1136C16766292k361000n388230p615000q587450q455902p678568o633878n423993m034042
$$ 316766292 314405292 309017062 301402062 292814612 284358710 276680142 270046264 264622271 260588229
1154.4B60588229k566815j184374O1423J342326K857953M673124O699622Q739620J0640115
$$ 260588229 258021414 256837040 256898463 258240789 261098742 265771866 272471488 281211108 291851223
1172.7B91851223J2380331J3885051J4955581J5425175J5277833J4680922J3732731
$$ 291851223 304231554 318116605 333072186 348497361 363775194 378456116 392188847
1187C92188847J2325704J0342062P951617N670190L976553K931029K380580K280354
$$ 392188847 404514551 414856613 422808230 428478420 432454973 435386002 437766582 440046936
1203.3D40046936K698094L635019M777968N685121O149351O189347N811602M945427
$$ 440046936 442745030 446380049 451158017 456843138 462992489 469181836 474993438 479938865
1219.7D79938865L599703K030581O68556k54989q36551j211673j378447j277715q93652
$$ 479938865 483538568 485569149 486237705 485982716 485146165 483934492 482556045 481278330 480384678
1238D80384678l42310K24292P59513J318693J938581K508849K829731K823293K682835
$$ 480384678 480042368 480266660 481026173 482344866 484283447 486792296 489622027 492445320 495128155
1256.4D95128155K620220K633095K634346K629698K674937K754807K726496K361714
$$ 495128155 497748375 500381470 503015816 505645514 508320451 511075258 513801754 516163468
1272.7E16163468J649261Q96037L26454j03652m46022p27832j007915j300633j574158
$$ 516163468 517812729 518708766 519035220 518931568 518485546 517757714 516749799 515449166 513875008
1291E13875008j828850k058386k160550k034783j664639j177787q32081p54416q51452
$$ 513875008 512046158 509987772 507827222 505792439 504127800 502950013 502117932 501363516 500512064
1309.4E00512064j038850j317710j707136k233654k801001l285081l827423m533737
$$ 500512064 499473214 498155504 496448368 494214714 491413713 488128632 484301209 479767472
1325.7D79767472n189747n517602n334854m629582l656954k740562j955747j219690
$$ 479767472 474577725 469060123 463725269 459095687 455438733 452698171 450742424 449522734
1342D49522734o90341n47797p48813j088530j334548j457959j511187j566380j672983
$$ 449522734 448832393 448284596 447535783 446447253 445112705 443654746 442143559 440577179 438904196
1360.4D38904196j706898j404226r20445n21213q0734M73112J119405J614034J791805
$$ 438904196 437197298 435793072 434872627 434351414 434270680 434743792 435863197 437477231 439269036
1378.7D39269036J765519J946867K745002L889800M264473L485740K508670J616418
$$ 439269036 441034555 442981422 445726424 449616224 453880697 457366437 459875107 461491525
1395.1D61491525P17431j12205p58410j265943j698047j825839j823962j871258j737863
$$ 461491525 462208956 462096751 461338341 460072398 458374351 456548512 454724550 452853292 451115429
1413.4D51115429j358568j020849p55608l36617N4598L78191P23958R93043J169294
$$ 451115429 449756861 448736012 447980404 447643787 447698385 448076576 448800534 449793577 450962871
1431.8D50962871J294345J507223J769304J735181J577317J261384P17610k2263p39038
$$ 450962871 452257216 453764439 455533743 457268924 458846241 460107625 460825235 460802972 460063934
1450.1D60063934j225859j566439k210558k298623p75695N92738J931519L566652M920751
$$ 460063934 458838075 457271636 455061078 452762455 451986760 452579498 454511017 458077669 462998420
1468.5D62998420O495595Q895040R944319R419084R080559Q995950Q881867Q303881
$$ 462998420 469494015 478389055 488333374 497752458 506833017 515828967 524710834 533014715
1484.8E33014715P879495P916510P784486O772042O147742O308496N963921N281449
$$ 533014715 540894210 548810720 556595206 563367248 569514990 575823486 581787407 587068856
1501.1E87068856M722655M774808N289376M540921L870964L867924L802240L650069
$$ 587068856 591791511 596566319 601855695 606396616 610267580 614135504 617937744 621587813
1517.4F21587813L375053L410459L395796L090501K936542K693235K663434K872050
$$ 621587813 624962866 628373325 631769121 634859622 637796164 640489399 643152833 646024883
1533.7F46024883K711832K416849K516807K364456K195657K242386K038419J856923
$$ 646024883 648736715 651153564 653670371 656034827 658230484 660472870 662511289 664368212
1550.1F64368212J873970K046585K039671J869083J595735J426637J549781J641989
$$ 664368212 666242182 668288767 670328438 672197521 673793256 675219893 676769674 678411663
1566.4F78411663J374244J031280R34958R66192Q97884N62549J95086p6831j22607
$$ 678411663 679785907 680817187 681752145 682718337 683616221 684178770 684373856 684297025 684174418
1584.7F84174418k55882p19548j339435j725555j895487k115190k578378l281414l851116
$$ 684174418 683918536 683198988 681859553 680133998 678238511 676123321 673544943 670263529 666412413
1603.1F66412413m089594m271984m828215n379319n493223n999089o821215n887389
$$ 666412413 662322819 658050835 653222620 647843301 642350078 636350989 629529774 623642385
1619.4F23642385n346179o093681n845904n166710m843473m196823l872812m103362
$$ 623642385 618296206 612202525 606356621 601189911 596346438 592149615 588276803 584173441
1635.7E84173441l063023j670420j058102n90324K4378R46224J509428J888513K629698
$$ 584173441 581110418 579439998 578381896 577791572 577815950 578762174 580271602 582160115 584789813
1654.1E84789813K895355L170132L701032M113555M249751M168511M760265N537510
$$ 584789813 587685168 590855300 594556332 598669887 602919638 607088149 611848414 617385924
1670.4F17385924N132377M996002N380273N268812N123973N317151N917251N427957
$$ 617385924 622518301 627514303 632894576 638163388 643287361 648604512 654521763 659949720
1686.7F59949720M851878N012989M591584M361033M385531M360080M782021M039586
$$ 659949720 664801598 669814587 674406171 678767204 683152735 687512815 692294836 696334422
1703F96334422L262519L288627L293574L276527L080189K725661K647579K725601K633929
$$ 696334422 699596941 702885568 706179142 709455669 712535858 715261519 717909098 720634699 723268628
1721.4G23268628K472639K195120J911998J993477K132833K161622J947582J597941
$$ 723268628 725741267 727936387 729848385 731841862 733974695 736136317 738083899 739681840
1737.7G39681840J680434J955092J960337J676202J373231J421392J755655J726806
$$ 739681840 741362274 743317366 745277703 746953905 748327136 749748528 751504183 753230989
1754G53230989J356065J088381J117885J383364J478613J214683R37343R24050J150608
$$ 753230989 754587054 755675435 756793320 758176684 759655297 760869980 761807323 762731373 763881981
1772.4G63881981J294375J087367Q03829P57694R80019J164616J076817Q10444O68407
$$ 763881981 765176356 766263723 767067552 767825246 768805265 769969881 771046698 771857142 772525549
1790.7G72525549Q80718J118958J028299P42019O02305Q38577J115323J053810P35223
$$ 772525549 773406267 774525225 775553524 776295543 776897848 777736425 778851748 779905558 780640781
1809.1G80640781N47349P08223R54747R21249O55830M53353N23687Q00371Q42571M90427
$$ 780640781 781188130 781896353 782851100 783772349 784428179 784881532 785405219 786205590 787048161 787538588
1829.5G87538588K37465L99232O43432O61731M03523R4712N0128L75747N58615L46363
$$ 787538588 787776053 788175285 788818717 789480448 789883971 789978683 790028811 790404558 790963173 791309536
1849.9G91309536N3048K2530L05891N16355L61264N4181K0086K60890M54724M15027
$$ 791309536 791362584 791385114 791691005 792207360 792568624 792622805 792642891 792903781 793358505 793773532
1870.3G93773532K15471J48773L54886N84483N08845K49565J72913L67045N59211M87745
$$ 793773532 793989003 794137776 794492662 795077145 795585990 795835555 796008468 796375513 796934724 797422469
1890.7G97422469J86622O378J85370M52340M64499J83701p5638J5497L08096L95418
$$ 797422469 797609091 797615469 797800839 798253179 798717678 798901379 798825741 798841238 799149334 799544752
1911.1G99544752J49786j08600m1723K95103L97265J38223n6923L5525K71261L77535
$$ 799544752 799694538 799585938 799544215 799839318 800236583 800374806 800317883 800353408 800624669 801002204
1931.5H01002204J98424n8055l6239K47001M14312K71857M8935N2631L07620N01156
$$ 801002204 801200628 801142573 801106334 801353335 801767647 802039504 802088439 802141070 802448690 802949846
1951.9H02949846L57747P5340M7386L12149N27442L92496L4929p1287K01404M43816
$$ 802949846 803307593 803382933 803430319 803742468 804269910 804662406 804697335 804626048 804827452 805271268
1972.3H05271268L48031N2631o6757J05500L15905K78234K7478j31547n842K45095
$$ 805271268 805619299 805671930 805605173 805710673 806026578 806304812 806332290 806200743 806194901 806439996
1992.6H06439996K74718O854k32577j54317Q1301Q5473k25305m85540m04239j66118
$$ 806439996 806714714 806721568 806488991 806334674 806415975 806501448 806276143 805790603 805386364 805220246
2013H05220246j48296m03345o35445n98788l63588k69056m81665p28011o79374m17948
$$ 805220246 805071950 804668605 804033160 803434372 803070784 802801728 802320063 801592052 800912678 800494730
2033.4H00494730k79843m04358n96941n76019l16203j08123j62661l15666l16560q6665
$$ 800494730 800214887 799810529 799213588 798637569 798321366 798213243 798050582 797734916 797418356 797331691
2053.8G97331691J65224J42336n6625r4533Q8990K64466K40862N3525m8578O9142K43425
$$ 797331691 797496915 797639251 797582626 797488093 797577083 797841549 798082411 798135936 798087358 798156500 798399925
2076.3G98399925K53439Q9467r597J07944K93196L18765J58668J6391Q9467K91943
$$ 798399925 798653364 798742831 798733234 798841178 799134374 799453139 799611807 799628198 799717665 800009608
2096.7H00009608L59714K10524Q0585J43648K60710K82646J73568K0981L398J35839
$$ 800009608 800369322 800579846 800660431 800804079 801064789 801347435 801521003 801541984 801545382 801681221
2117.1H01681221K28226J24693o2347q2075P2538J78159J20818r477o3240J6570J49667
$$ 801681221 801909447 802034140 801971793 801889718 801962256 802140415 802261233 802251756 802188516 802205086 802354753
2139.5H02354753J55270R000p1764K6882J92523K49803J45972P6473K13504M32729
$$ 802354753 802510023 802519023 802447259 802474141 802666664 802916467 803062439 803138912 803352416 803785145
2159.9H03785145N27621M39107L46065M41432O33001P31110O54758M95135M74274O47128
$$ 803785145 804312766 804751873 805097938 805539370 806172371 806903481 807558239 808053374 808527648 809174776
2180.3H09174776P78735O92785N24938N19037O79135P63774O39379M51446M26590N77808
$$ 809174776 809953511 810646296 811171234 811690271 812369406 813133180 813772559 814224005 814650595 815228403
2200.7H15228403P19547O85036N08249M30524N80609P45356O79374M69565L79861M94897
$$ 815228403 815947950 816632986 817141235 817571759 818152368 818897724 819577098 820046663 820426524 820921421
2221.1H20921421O30140N86808L99351K75433L55065N14746M91857K87176J80780K70129
$$ 820921421 821551561 822138369 822537720 822813153 823168218 823682964 824174821 824461997 824642777 824912906
2241.5H24912906M11093M42028K99275J44005K09093M08888M48525K87413J58310K40505
$$ 824912906 825323999 825766027 826065302 826209307 826418400 826827288 827275813 827563226 827721536 827962041
2261.9H27962041M35591M83870L34501K00630K69293M79222N29229L35992K01642K91169
$$ 827962041 828397632 828881502 829216003 829416633 829685926 830165148 830694377 831030369 831232011 831523180
2282.3H31523180M10557L48925J60039J1444N1022K29001K56955P8023o7890j9789
$$ 831523180 831933737 832282662 832442701 832454145 832505167 832734168 832991123 833069146 833001256 832981467
2302.7H32981467J17362J36792Q345j12474q1122P5042J10567j06573k82049j87159
$$ 832981467 833098829 833235621 833243966 833131492 833050370 833125412 833235979 833129406 832847357 832660198
2323.1H32660198m3034m2498j18733j76668j65224m1664O7175j25826m17053l19005
$$ 832660198 832617164 832574666 832455933 832279265 832114041 832072377 832139552 832013726 831596673 831277668
2343.5H31277668J06812L11017L9637l88980o02543m59075k22743k22623l51012k57671
$$ 831277668 831384480 831695497 831735134 831346154 830743611 830284536 830061793 829839170 829488158 829230487
2363.8H29230487O8784L07143K78890K07603K81692L69787L54707L15428K69294J63555
$$ 829230487 829299271 829606414 829885304 830092907 830374599 830744386 831099093 831414521 831683815 831847370
2384.2H31847370N4836k3365j29342k07842k00331j61230j39714k03788l35276l84510
$$ 831847370 831902206 831878841 831749499 831541657 831341326 831180096 831040382 830836594 830501318 830116808
2404.6H30116808l21984k86877l52740m30405m46380m42683m41909m64916n37694n85198
$$ 830116808 829794824 829507947 829155207 828724802 828278422 827835739 827393830 826928914 826391220 825806022
2425H25806022n57006n30481n73993o25610o41346o42657o20187o17563o53983o48141
$$ 825806022 825249016 824718535 824144542 823518932 822877586 822234929 821614742 820997179 820343196 819695055
2445.4H19695055o18398o35326o49273o21259o00755n88298n49496n31077n40554n31495
$$ 819695055 819076657 818441331 817792058 817170799 816570044 815981746 815432250 814901173 814360619 813829124
2465.8H13829124n29707n29706m93765m75228n01871m88698m39227m18246m10676l92377
$$ 813829124 813299417 812769711 812275946 811800718 811298847 810810149 810370922 809952676 809542000 809149623
2486.2H09149623l73364l69727l46959k85685k52247k80857k94626k65538k46048k55406
$$ 809149623 808776259 808406532 808059573 807773888 807521641 807240784 806946158 806680620 806434572 806179166
2506.6H06179166k79725k85327k71440k89917l48627l80814l74675l75331m23073n09322
$$ 806179166 805899441 805614114 805342674 805052757 804704130 804323316 803948641 803573310 803150237 802640915
2527H02640915n45740n30482n47647n91815o26802o74486o85394o31154o00755o28590
$$ 802640915 802095175 801564693 801017046 800425231 799798429 799123943 798438549 797807395 797206640 796578050
2547.4G96578050o76513o84440o15418n48184n86093o73353o80804o05226n61357n93781
$$ 796578050 795901537 795217097 794601679 794053495 793467402 792794049 792113245 791508019 790946662 790352881
2567.8G90352881o08981n81205n73217n84186n87105n58138n18620n06699m75109m38988
$$ 790352881 789743900 789162695 788589478 788005292 787418187 786860049 786341429 785834730 785359621 784920633
2588.2G84920633m63307m79817m39823m00007m23670n01990n28693m87685m87149n75185
$$ 784920633 784457326 783977509 783537686 783137679 782714009 782212019 781683326 781195641 780708492 780133307
2608.6G80133307p03871q03829q65101r08792r52781j012861j089633j155495j194895
$$ 780133307 779429436 778625607 777760506 776851714 775898933 774886072 773796439 772640944 771446049
2626.9G71446049j251817j329779j379132j363755j308083j302541j375556j454114
$$ 771446049 770194232 768864453 767485321 766121566 764813483 763510942 762135386 760681272
2643.3G60681272j435101j332045j265586j280605j317084j320183j294554j253247
$$ 760681272 759246171 757914126 756648540 755367935 754050851 752730668 751436114 750182867
2659.6G50182867j226902j223743j198947j151622j119256j093209j053631j049220
$$ 750182867 748955965 747732222 746533275 745381653 744262397 743169188 742115557 741066337
2675.9G41066337j060367j007438r46939r66727j008213r96232r61721r51529r83178
$$ 741066337 740005970 738998532 738051593 737084866 736076653 735080421 734118700 733167171 732183993
2694.3G32183993j048446j095652j099110j130879j214862j273990j265525j234293
$$ 732183993 731135547 730039895 728940785 727809906 726595044 725321054 724055529 722821236
2710.6G22821236j233161j246095j246154j224995j184821j161277j173377j184702
$$ 722821236 721588075 720341980 719095826 717870831 716686010 715524733 714351356 713166654
2726.9G13166654j149714j061559r94205j024008j071274j032412r59575r39370r57608
$$ 713166654 712016940 710955381 709961176 708937168 707865894 706833482 705873907 704934537 703976929
2745.2G03976929r69350r59993r04381q06033p64549q07047q06928p24077o61254p13110
$$ 703976929 703007579 702047586 701143205 700337172 699572623 698765576 697958648 697234571 696573317 695860207
2765.6F95860207q43286r02832q45850p97212q52108r89914j117825j121044j068771
$$ 695860207 695016921 694114089 693268239 692471027 691618919 690629005 689511180 688390136 687321365
2784F87321365j141906j328409j470863j507462j512050j601577j788914j914919j898169
$$ 687321365 686179459 684851050 683380187 681872725 680360675 678759098 676970184 675055265 673157096
2802.3F73157096j866520j985192k212226k340317k341866k337575k430976k606153
$$ 673157096 671290576 669305384 667093158 664752841 662410975 660073400 657642424 655036271
2818.7F55036271k729714k758861k770483k869547l032684l143668l188849l228009
$$ 655036271 652306557 649547696 646777213 643907666 640874982 637731314 634542465 631314456
2835F31314456l338635l515720l665626l773987l887177m019916m140556m196882m188716
$$ 631314456 627975821 624460101 620794475 617020488 613133311 609113395 604972839 600775957 596587241
2853.3E96587241m199922m328072m617513n048334n526245n962253o378710o801903
$$ 596587241 592387319 588059247 583441734 578393400 572867155 566904902 560526192 553724289
2869.7E53724289p110834p180810p010520o624043o048262n325913m505038l621519
$$ 553724289 546613455 539432645 532422125 525798082 519749820 514423907 509918869 506297350
2886E06297350k776980k094031j543104j079649p77126p03066q11041j039564j381427
$$ 506297350 503520370 501426339 499883235 498803586 498026460 497323394 496512353 495472789 494091362
2904.3D94091362j802713k254665k751648l300220l773361l978104l902018l668547
$$ 494091362 492288649 490033984 487282336 483982116 480208755 476230651 472328633 468660086
2920.6D68660086l231883k561181j730979p69764K56330J282185K297461L304362M235059
$$ 468660086 465428203 462867022 461136043 460366279 460622609 461904794 464202255 467506617 471741676
2939D71741676N022109N672932O172239O529570O821275P029593P088184P064402P030964
$$ 471741676 476763785 482436717 488608956 495138526 501959801 508989394 516077578 523141980 530172944
2957.4E30172944O938994O709516O374300O043374N786836N595923N439639N330801
$$ 530172944 537111938 543821454 550195754 556239128 562025964 567621887 573061526 578392327
2973.7E78392327N264163N224645N148590M915058M557133M234850L952504L613472
$$ 578392327 583656490 588881135 594029725 598944783 603501916 607736766 611689270 615302742
2990F15302742L182590K660393K142191J708210J284182Q23676L59178r3043m76003
$$ 615302742 618485332 621145725 623287916 624996126 626280308 627103984 627463162 627370119 626894116
3008.3F26894116p62820j088679j515686j869381k065599k233982k418160k625227
$$ 626894116 626131296 625042617 623526931 621657550 619591951 617357969 614939809 612314582
3024.7F12314582k861142k980590k968788l000439l183305l397882l430068l377855
$$ 612314582 609453440 606472850 603504062 600503623 597320318 593922436 590492368 587114513
3041E87114513l455222l641188l777385l742218l670215l735245l814697l837704l855885
$$ 587114513 583659291 580018103 576240718 572498500 568828285 565093040 561278343 557440639 553584754
3059.3E53584754l798365l725767l778994l913403l980815l912449l823936l764510
$$ 553584754 549786389 546060622 542281628 538368225 534387410 530474961 526651025 522886515
3075.6E22886515l716886l796161l903210l879487l864885l852307l780485l817826
$$ 522886515 519169629 515373468 511470258 507590771 503725886 499873579 496093094 492275268
3092D92275268l890634l795117l661126l645837l665596l629506l540039l496498l565520
$$ 492275268 488384634 484589517 480928391 477282554 473616958 469987452 466447413 462950915 459385395
3110.3D59385395l498644l268539l249228l395886l499955l557771l490180l332883
$$ 459385395 455886751 452618212 449368984 445973098 442473143 438915372 435425192 432092309
3126.6D32092309l223479l208369l209561l104955k945483k913504l048063l110468
$$ 432092309 428868830 425660461 422450900 419345945 416400462 413486958 410438895 407328427
3143D07328427k989382k853661k707750k563477k642661k830267k819598k704382k595305
$$ 407328427 404339045 401485384 398777634 396214157 393571496 390741229 387921631 385217249 382621944
3161.3C82621944k486378k455652k466082k421886k308548k221196k209604k188057
$$ 382621944 380135566 377679914 375213832 372791946 370483398 368262202 366052598 363864541
3177.6C63864541k149016k130031k102643k040953j939237j867354j874149j882255
$$ 363864541 361715525 359585494 357482851 355441898 353502661 351635307 349761158 347878903
3193.9C47878903j837104j784593j745343j679153j612514j580179j594811j605809
$$ 347878903 346041799 344257206 342511863 340832710 339220196 337640017 336045206 334439397
3210.3C34439397j540005j437635j358687j342446j379430j397610j363903j295001
$$ 334439397 332899392 331461757 330103070 328760624 327381194 325983584 324619681 323324680
3226.6C23324680j203328j077324r93848j115263j265853j199454j074046j003295
$$ 323324680 322121352 321044028 320050180 318934917 317669064 316469610 315395564 314392269
3242.9C14392269r28045r09716j006007j029014q72583p50839p88599q44539q21769
$$ 314392269 313464224 312554508 311548501 310519487 309646904 308896065 308107466 307262927 306441158
3261.2C06441158p62194p00236o13600n13404n96077p96467q32855p62850p11292o91355
$$ 306441158 305678964 304978728 304365128 303851724 303255647 302459180 301626325 300863475 300152183 299460828
3281.6B99460828o64860o18159o20187n87731n18233o00010p64609q31514p51197n74112
$$ 299460828 298795968 298177809 297557622 296969891 296451658 295851648 295087039 294255525 293504328 292930216
3302B92930216m57108n50747q13246j009345j012176q85815p95990p88421p57485p05719
$$ 292930216 292473108 291922361 291109115 290099770 289087594 288201779 287405789 286617368 285859883 285154164
3322.4B85154164p29352q84086j006216r61840r00328q56132p59393p91102r81152
$$ 285154164 284424812 283540726 282534510 281572670 280672342 279816210 279056817 278265715 277284563
3340.8B77284563j062036j034915r93431r09150r54806j146794j185506j062751r81242
$$ 277284563 276222527 275187612 274194181 273285031 272330225 271183431 269997925 268935174 267953932
3359.1B67953932r77874r50008p90864p10398r56953j318395j362294j067221q52823
$$ 267953932 266976058 266026050 265235186 264524788 263567835 262249440 260887146 259819925 258967102
3377.5B58967102q85547r42200q26716o73414n69999m05550m32253p42733q18640m88580
$$ 258967102 258081555 257139355 256312639 255639225 255069226 254663676 254231423 253488690 252670050 252181470
3397.9B52181470k49177n04047q47756p01204m03300l53366m13761m82440m84019l83959
$$ 252181470 251932293 251428246 250580490 249879286 249475986 249122620 248708859 248226419 247742400 247358441
3418.3B47358441l15189k79918j57774N305J03518M1366j2547R3490M3631k06694k27243
$$ 247358441 247043252 246763334 246605560 246610865 246714383 246755749 246743202 246836692 246880323 246673629 246446386
3440.7B46446386J8686K09019K43514K02537K17900L05280L91423M66899N32135M64961
$$ 246446386 246465072 246674091 246917605 247120142 247338042 247643322 248034745 248501644 249033779 249498740
3461.1B49498740M18097O94707R46015O73353J90586J37776M07994O58661P22856N43743
$$ 249498740 249916837 250611544 251557559 252230912 252421498 252559274 252967268 253625929 254348785 254892528
3481.5B54892528M87834O47992O38694N51849O69897P86215P68304P14600P64757Q15541
$$ 254892528 255380362 256028354 256667048 257218897 257888794 258675009 259443313 260157913 260922670 261738211
3501.9B61738211O30230M92841O11186P77632R57518R79841P72327P30426R32276J130223
$$ 261738211 262368441 262861282 263472468 264250100 265207618 266187459 266959786 267690212 268622488 269752711
3522.3B69752711J101941R04530Q37803R78798J186818J334041J272082J114488J251936
$$ 269752711 270854652 271759182 272596985 273575783 274762601 276096642 277368724 278483212 279735148
3540.7B79735148J520216J523227J285702J194268J326442J443863J534760J666218
$$ 279735148 281255364 282778591 284064293 285258561 286585003 288028866 289563626 291229844
3557B91229844J848847J961350J886904J786769K003610K390593K460361K387047K471774
$$ 291229844 293078691 295040041 296926945 298713714 300717324 303107917 305568278 307955325 310427099
3575.3C10427099K590925K740949K974064L124505L060728K941728L137797L343463
$$ 310427099 313018024 315758973 318733037 321857542 324918270 327859998 330997795 334341258
3591.7C34341258L392309L544956L753036L811688L808260L823310L761768L820509
$$ 334341258 337733567 341278523 345031559 348843247 352651507 356474817 360236585 364057094
3608C64057094M028410M185944M297525M227400M126578M353643M476666M304856M031629
$$ 364057094 368085504 372271448 376568973 380796373 384922951 389276594 393753260 398058116 402089745
3626.3D02089745M049361M597097M690826M478693M427016M421651M413694M433483
$$ 402089745 406139106 410736203 415427029 419905722 424332738 428754389 433168083 437601566
3642.6D37601566M417777M273951M258097M566431M607737M377067M514456M668742
$$ 437601566 442019343 446293294 450551391 455117822 459725559 464102626 468617082 473285824
3659D73285824M330993M012018M070431M020453L794431L949076L868103L478289L628075
$$ 473285824 477616817 481628835 485699266 489719719 493514150 497463226 501331329 504809618 508437693
3677.3E08437693L788054L664017L607571L570676L373086K942801K798259K996326
$$ 508437693 512225747 515889764 519497335 523068011 526441097 529383898 532182157 535178483
3693.6E35178483L026068K828181K551078K392590K489448K580881K404928K034247
$$ 535178483 538204551 541032732 543583810 545976400 548465848 551046729 553451657 555485904
3709.9E55485904J935542K396703K592265K300740J935958J767815J769006J866221
$$ 555485904 557421446 559818149 562410414 564711154 566647112 568414927 570183933 572050154
3726.3E72050154K074003K032578J719356J456439J594246K038717K057076J344323
$$ 572050154 574124157 576156735 577876091 579332530 580926776 582965493 585022569 586366892
3742.6E86366892Q78155J544952J608611J019537J344681J973986J825512J386642
$$ 586366892 587245047 588789999 590398610 591418147 592762828 594736814 596562326 597948968
3758.9E97948968J377941J513123J427770J312315J128555J142501J452685J540422
$$ 597948968 599326909 600840032 602267802 603580117 604708672 605851173 607303858 608844280
3775.2F08844280J348436J141012J116752J103878J079441J186847J264155J230359
$$ 608844280 610192716 611333728 612450480 613554358 614633799 615820646 617084801 618315160
3791.5F18315160J094580R83179J073360Q98004O30378J012624J067698R20176J291037
$$ 618315160 619409740 620392919 621466279 622364283 622994661 624007285 625074983 625995159 627286196
3809.9F27286196J403928R36150O07669Q96097Q24928P04050J057386J074732R88185
$$ 627286196 628690124 629626274 630233943 631130040 631954968 632659018 633716404 634791136 635779321
3828.2F35779321R42350Q50796Q82626O52194L87311O88553R57846J007319J067996
$$ 635779321 636721671 637572467 638455093 639107287 639494598 640183151 641140997 642148316 643216312
3846.6F43216312J060963O99937j22011N8353J184702J300097Q60750N14746N77629
$$ 643216312 644277275 644977212 644855201 644913554 646098256 647398353 648259103 648773849 649351478
3865F49351478P67290N23806M00424N85615P27237Q57591P12634O54459P29441N18739
$$ 649351478 650118768 650642574 651042998 651628613 652355850 653213441 653926075 654580534 655309975 655828714
3885.4F55828714N27382N51701L49521N29349P88510O01173L03626K24292K16544M10497
$$ 655828714 656356096 656907797 657257318 657786667 658575177 659176350 659479976 659704268 659920812 660331309
3905.7F60331309P34389P30395N33938M14908L00944K90573M55379N04196L83496L17037
$$ 660331309 661065698 661796093 662330031 662744939 663045883 663336456 663791835 664296031 664679527 664996564
3926.1F64996564L35694K89082K77996M01497M54843M23730L73065K91646L15904L59655
$$ 664996564 665332258 665621340 665899336 666300833 666755676 667179406 667552471 667844117 668160021 668519676
3946.5F68519676L05176L18765L96848L98159L32296L12090L56555M05788L68595K44856
$$ 668519676 668824852 669143617 669540465 669938624 670270920 670583010 670939565 671345353 671713948 671958804
3966.9F71958804K41220L31521L11911K26498J92046K24948L29971M25041L62277K33412
$$ 671958804 672200024 672531545 672843456 673069954 673262000 673486948 673816919 674241960 674604237 674837649
3987.3F74837649K56419L23296K67923K10702K12431
$$ 674837649 675094068 675417364 675685287 675895989 676108420
3997.5F76108420
$$ 676108420
##END=$$ End of the data block
