##TITLE=Amostra 1 - Marcela $$ Begin of the data block
##JCAMP-DX=5.00 $$ ACD/SpecManager v 10.08
##SPECTROMETER/DATA SYSTEM=Alpha
##DATE=24 Oct 2013 10:57:42
##DATA TYPE=INFRARED SPECTRUM
##DATA CLASS=XYDATA
##ORIGIN=
##OWNER=
##NPOINTS=1765
##FIRSTX=399.75695801
##LASTX=3997.56933594
##MAXX=3997.56933594
##MINX=399.75695801
##MAXY=0.83448416
##MINY=0.16028588
##XFACTOR=1.0000000000
##YFACTOR=1.000000000000000e-9
##FIRSTY=0.46054393
##DELTAX=2.03957629
##XUNITS=1/CM
##YUNITS=ARBITRARY UNITS
##XYDATA=(X++(Y..Y))
399.8D60543931l351689k430767j913398j029074M88758K162665K491444J063675p98136
418.1D57227409j686663j338601j589030k866417l520191k577751j324386j266122
434.4D41058248j573831n67138J665980L856540M691124L933101K850652K511352K353937
452.8D60779965J230359m13597j448184j577079j723498k475113l512830m157215m028648
471.1D42674160l376752k956569l001333k549439j154721K62916N02437k29954p29293
489.5D29441452n96553m01795r48042j980871k552330k322406j843333k105504l156215
507.9D13534403m014075m118174l893018m160225m849434m754573l430039j796633
524.2C82518232p34747K7776J046658K345472L957451N393564N877376N476624M656523
$$ plain form
399.8 460543931 457192242 454761475 452848077 451819003 452307761 454470426 456961870 458025545 457227409
418.1 457227409 455540746 454202145 452613115 449746698 446226507 443648756 442324370 441058248
434.4 441058248 439484417 438917279 440583259 444439799 449130923 453064024 455914676 458426028 460779965
452.8 460779965 462010324 461596727 460148543 458571464 456847966 454372853 450860023 446702808 442674160
471.1 442674160 439297408 436340839 433339506 430790067 429635346 429898262 430400699 430170745 429441452
489.5 429441452 428844899 428443104 427495062 425514191 422961861 420639455 418796122 416690618 413534403
507.9 413534403 409520328 405402154 401509136 397348911 392499477 387744904 384314865 382518232
524.2 382518232 381783485 381811261 382857919 385203391 389160842 394554406 400431782 405908406 410564929
542.5D10564929L372729J495808m69297j759082k234638k544105l404945m806816n865664
560.9C94348919o258785o560535p147520p558048o659746m191816j132727J551509
577.2C56391251L626734N379647O961197P923960P665217O057442L951966K388060
593.5D00345474J432062N65678k72215o80864m33474K13682P76947J220435J719385
611.9D04887110K446860L453732M411101M972130N158246N237013N316168N088448
628.2D40970808M211486L131121K465040K217620K060831J700431J194984R88900J210660
646.5D60151881J543760J568347J133889Q17210J120239J641065J650840J143396P06345
664.9D71476972R06468J942366J999199J367837J123965J344681J823783J944542J479328
$$ plain form
542.5 410564929 413937658 415433466 414964169 413205087 410970449 408426344 405021399 400214583 394348919
560.9 394348919 388090134 381529599 374382079 366824031 360164285 355972469 354839742 356391251
577.2 356391251 360017985 365397632 372358829 380282789 387948006 394005448 397957414 400345474
593.5 400345474 401777536 402343214 402070999 401390135 400956661 401170343 401947290 403167725 404887110
611.9 404887110 407333970 410787702 415198803 420170933 425329179 430566192 435882360 440970808
628.2 440970808 445182294 448313415 450778455 452996075 455056906 456757337 457952321 458941221 460151881
646.5 460151881 461695641 463263988 464397877 465215087 466335326 467976391 469627231 470770627 471476972
664.9 471476972 472383440 474325806 476325005 477692842 478816807 480161488 481985271 483929813 485409141
683.3D85409141R94503R70036J110792O39617p21514k184689k947032l152550l454267
701.6D76664037l887058l661543k153546K44737K456397L753066M547060N730092P363856
720D91057098Q323103P919222O949485O435811O495118O063521M505992K656281J511514
738.3E41917145J060069J43707k036572m618108o113708o357193o468415p142365p607758
756.7E02776802o739051m578650k062767J75863K421379N337656Q688003J1064291
773E17083526J1444807J0386407R332419Q914530Q350730O915748N234659M536748
789.3E82199574N072772N873680N921960N573452N753338O380200O446719N154372
805.6F28376067L276229K365708K583265K650857J745403K54750p85052j045406j567722
$$ plain form
683.3 485409141 486403644 487373680 488484472 489124089 488402575 486217886 483270854 480118304 476664037
701.6 476664037 472776979 469115436 466961890 467206627 469663024 473416090 477963150 483693242 491057098
720 491057098 499380201 507299423 514248908 520684719 527179837 533243358 537749350 540405631 541917145
738.3 541917145 542977214 543120921 541084349 536466241 530352533 523995340 517526925 510384560 502776802
756.7 502776802 496037751 491459101 489396334 489572197 491993576 497331232 506019235 517083526
773 517083526 528528333 538914740 548247159 557161689 565512419 572428167 577662826 582199574
789.3 582199574 587272346 593146026 599067986 604641438 610394776 616774976 623221695 628376067
805.6 628376067 631652296 634018004 636601269 639252126 640997529 641252279 640467227 639421821 637854099
824F37854099l368556n813301p420838p867574p965148q417487q815289q252799o708443
842.3E73224664n088389m168749l846467l516972k848327k182603j999020j658023
858.7E47916114L37780M326999Q839726J2008131J3067424J2508095J1044085Q767783
875F18816137N382598J171767k864360n864680p725537q921146r696603r671569q645475
893.3E71981132p252455o385922o406546o951511p523000q148730r196996j0688961
909.6E09427011j2036294j2568027j2148410j1094451r572774p453859m837155k277881
926D37438160l42160Q63194J769930K932847M407257N792826O607980O236255L947377
944.3D69653666m12554n958676j1371553j5573770j8098443j9294858j9973904k0624101
$$ plain form
824 637854099 634485543 628672242 621251404 613383830 605418682 597001195 588185906 579933107 573224664
842.3 573224664 568136275 563967526 560121059 556604087 553755760 551573157 549574137 547916114
858.7 547916114 548253894 552580893 561420619 573428750 586496174 599004269 610048354 618816137
875 618816137 624198735 625370502 622506142 616641462 608915925 599994779 590298176 580626607 571981132
893.3 571981132 564728677 558342755 551936209 544984698 537461698 529312968 520115972 509427011
909.6 509427011 497390717 484822690 472674280 461579829 452007055 444553196 439716041 437438160
926 437438160 437096000 437959194 439729124 442661971 447069228 452862054 459470034 465706289 469653666
944.3 469653666 469241112 463282436 451910883 436337113 418238670 398943812 378969908 358345807
960.6C58345807k1146208k1324009k1148920k0786852k0307153j9518763j8142611
974.9B15971291j6080618j3530940j0672956p662923m834502k419770m83707R45062
991.2A61230937J836419K273723K481863K535194K330423J873746J262114O54369K87131
1009.6A76765919K14532L10704N35667R65774J554355K117932K531200K798632K978653
1027.9A90773368L081307K998307K622753K095432J680657J513451J566723J761243
1044.3B08093241J998424K288670K762735L490552M396751N336076O403953P809699
1060.6B42580101R417847J0387867R157300M471422k665699q753270j0820031r094387
1076.9B44681150n827278k649352n2557J905650L272504M205018M921109N405158N356907
$$ plain form
960.6 358345807 337199599 315875590 294726670 273939818 253632665 234113902 215971291
974.9 215971291 199890673 186359733 175686777 168023854 163189352 160769582 160285875 161230937
991.2 161230937 163067356 165341079 167822942 170358136 172688559 174562305 175824419 176478788 176765919
1009.6 176765919 176980451 177291155 177826822 178792596 180346951 182464883 184996083 187794715 190773368
1027.9 190773368 193854675 196852982 199475735 201571167 203251824 204765275 206331998 208093241
1044.3 208093241 210091665 212380335 215143070 218633622 223030373 228366449 234770402 242580101
1060.6 242580101 251997948 262385815 271543115 276014537 273348838 264595568 253775537 244681150
1076.9 244681150 238853872 236204520 236151963 238057613 241330117 245535135 250456244 255861402 261218309
1095.2B61218309M590899L337264K127618J458674J449138J899004K496392L031760
1111.6B81609058L450185L611654L340096K733171K231955K225280K726317L460347
1127.9C05388063M046828L994375K877146O40124k367347n391896p582098q532077
1144.2B93073118q423507p672042o607235n373448l995120k560765j212776K6763J321077
1162.6B58576065K870381M717231O711960Q703083J0606676J2370616J3875038J4930516
1178.9C33361566J5412271J5289545J4704675J3778805J2355477J0311604P911682
1193.1D23125625N669832L986090K918780K368450K296001K748072L682256M775345
1209.5D51570451N660028O131917O170124N799830M937708L588110K021432O35654
$$ plain form
1095.2 261218309 265809208 269146472 271274090 272732764 274181902 276080906 278577298 281609058
1111.6 281609058 285059243 288670897 292010993 294744164 296976119 299201399 301927716 305388063
1127.9 305388063 309434891 313429266 316306412 316946536 314579189 309187293 301605195 293073118
1144.2 293073118 284649611 276977569 270370334 264996886 261001766 258441001 257228225 257254988 258576065
1162.6 258576065 261446446 266163677 272875637 281578720 292185396 304556012 318431050 333361566
1178.9 333361566 348773837 364063382 378768057 392546862 404902339 415213943 423125625
1193.1 423125625 428795457 432781547 435700327 438068777 440364778 443112850 446795106 451570451
1209.5 451570451 457230479 463362396 469532520 475332350 480270058 483858168 485879600 486515254
1225.8D86515254l05772q53598j192123j345277j250326q85547l24308K63989P83711
1244.1D81406003J316726J908541K452851K801120K865404K736091K617359K618075
1260.4E00722170K644777K644479K679289K722978K675474K362847J692415R08076
1276.8E19052505L10183j00315m24444p16150j015663j305044j544356j776457k019882
1295.1E10460377k160669k064943j684010j188636q57770p70331q41915j039535j338840
1313.5D98513728j702964k206355k802879l316909l839076m501462n152314n494118
1329.8D69497651n306602m606604l656507k762973j975298j228869p16299n72324p42614
1348.1D47929561j066923j331717j473456j501501j545191j686752j743465j420170
$$ plain form
1225.8 486515254 486209482 485355884 484163761 482818484 481568158 480682611 480358303 480622292 481406003
1244.1 481406003 482722729 484631270 487084121 489885241 492750645 495486736 498104095 500722170
1260.4 500722170 503366947 506011426 508690715 511413693 514089167 516452014 518144429 519052505
1276.8 519052505 519362688 519262373 518837929 518121779 517106116 515801072 514256716 512480259 510460377
1295.1 510460377 508299708 506234765 504550755 503362119 502504349 501734018 500892103 499852568 498513728
1313.5 498513728 496810764 494604409 491801530 488484621 484645545 480144083 474991769 469497651
1329.8 469497651 464191049 459584445 455927938 453164965 451189667 449960798 449244499 448672175 447929561
1348.1 447929561 446862638 445530921 444057465 442555964 441010773 439324021 437580556 436160386
1364.5D36160386r06140n07891r1195M59045J136631J645654J797825J765400J967878
1382.8D43427593K744823L838986M228562L481150K482504J580000O92367j29699p58231
1401.2D61588055j253247j676202j810074j834065j884669j720905j344085j073539
1417.5D48991269q22812l16740J18256M03881O92606R70096J195609J315832J512677
1435.9D54060674J805037J773596J583785J239419O94453j0609p11918j222015j582861
1454.2D57629561k213984k263993p67261N52654J900464L582865M938245O479293Q879334
1472.6D78717178R956360R425282R080619R007573Q883774Q277655P850289P925213
1488.9E49123943P827997O776214O107151O303847O005168N301833M702449M721522
$$ plain form
1364.5 436160386 435254246 434746355 434655160 435114205 436250836 437896490 439694315 441459715 443427593
1382.8 443427593 446172416 450011402 454239964 457721114 460203618 461783618 462475985 462346286 461588055
1401.2 461588055 460334808 458658606 456848532 455014467 453129798 451408893 450064808 448991269
1417.5 448991269 448168457 447851717 447969973 448373854 449066460 450036556 451232165 452547997 454060674
1435.9 454060674 455865711 457639307 459223092 460462511 461156964 461146355 460434437 459212422 457629561
1454.2 457629561 455415577 453151584 452384323 452936977 454837441 458420306 463358551 469837844 478717178
1472.6 478717178 488673538 498098820 507179439 516187012 525070786 533348441 541198730 549123943
1488.9 549123943 556951940 563728154 569835305 576139152 582144320 587446153 592148602 596870124
1505.2E96870124N270720M589021L904283L847301L726006L593981L407538L479838
1521.5F28688812L416837L081500K950251K703965K653479K880574K715170K341390
1537.8F51431978K412915K386749K299666K337933K085685J858116J863181K027810
1554.1F68704033J971006J781881J649976J529276J587689J630306J347125J031399
1570.5F81232691R42647R54449R10938O02842K12490p6294j24872k72512p23720j316309
1590.9F82342350j733779j929880k127587k580405l294050l855825m055440m221916
1607.2F58543468m806936n390108n521655o017089o781280n837083n346417o115973
1623.5F12726927n843222n121291m787624m177213l890037m104912k995313j595974
$$ plain form
1505.2 596870124 602140844 606729865 610634148 614481449 618207455 621801436 625208974 628688812
1521.5 628688812 632105649 635187149 638137400 640841365 643494844 646375418 649090588 651431978
1537.8 651431978 653844893 656231642 658531308 660869241 662954926 664813042 666676223 668704033
1554.1 668704033 670675039 672456920 674106896 675636172 677223861 678854167 680201292 681232691
1570.5 681232691 682175338 683129787 684040725 684643567 684856057 684779763 684654891 684382379 683658659 682342350
1590.9 682342350 680608571 678678691 676551104 673970699 670676649 666820824 662765384 658543468
1607.2 658543468 653736532 648346424 642824769 636807680 630026400 624189317 618842900 612726927
1623.5 612726927 606883705 601762414 596974790 592797577 588907540 584802628 581807315 580211341
1639.8E80211341j038789o09577L4809J013458J553833J904607K718210K989292L198088
1658.2E91975272L705859M137635M284144M160404M735708N549788N139351M990936
1674.5F28679097N409538N278230N055487N227685N914331N478620M874289N013168
1690.8F70930445M566550M307926M314482M306436M802287M069387L254295L292918
1707.1G03844726L311753L275454L026724K644182K656996K821922K672553K426207
1723.4G26680517K126634J889110J999438K097487K100587J950443J633048J702666
1739.7G42179930J956821J926899J639247J343965J396656J793564J788795J375854
1756.1G55401731J070022J088560J392603J508057J199722Q86440Q83758J149118J320541
$$ plain form
1639.8 580211341 579172552 578562975 578597784 579611242 581165075 583069682 585787892 588777184 591975272
1658.2 591975272 595681131 599818766 604102910 608263314 612999022 618548810 623688161 628679097
1674.5 628679097 634088635 639366865 644422352 649650037 655564368 661042988 665917277 670930445
1690.8 670930445 675496995 679804921 684119403 688425839 693228126 697297513 700551808 703844726
1707.1 703844726 707156479 710431933 713458657 716102839 718759835 721581757 724254310 726680517
1723.4 726680517 728807151 730696261 732695699 734793186 736893773 738844216 740477264 742179930
1739.7 742179930 744136751 746063650 747702897 749046862 750443518 752237082 754025877 755401731
1756.1 755401731 756471753 757560313 758952916 760460973 761660695 762547135 763430893 764580011 765900552
1774.4G65900552J100302Q04663P80582J011849J169979J057625P76768O29127Q81195
1792.8G74112642J156330J022518P07686O12258Q57056J095354J044035P48754N53667
1811.1G81910300P01785R46224R28879O71208M47809M81546P54774Q23259N03660L02553
1831.5G88471997M50671O36219O43850L94761P8440K7180L65972N76020L77059O8843
1851.9G92091012L4511L16262N01216L54945P2480R536K19763M47869M53472K41876
1872.3G94742942J48356L53694N88417N11348K42412J47343L36230N45323N03361K20775
1892.7G98340201K9683K01524M65750M35055J31011q4400L1411L00706L75092J55449
1913.1H00381482q2672k9206K87771L84629J38283n8651K5749K82168M02630K19702
$$ plain form
1774.4 765900552 767000854 767805517 768586099 769597948 770767927 771825552 772602320 773231447 774112642
1792.8 774112642 775268972 776291490 776999176 777611434 778468490 779563844 780607879 781356633 781910300
1811.1 781910300 782612085 783558309 784487188 785158396 785606205 786087751 786842525 787665784 788169444 788471997
1831.5 788471997 788922668 789558887 790202737 790597498 790675938 790703118 791069090 791645110 792022169 792091012
1851.9 792091012 792125523 792441785 792943001 793297946 793370426 793379962 793599725 794047594 794501066 794742942
1872.3 794742942 794891298 795244992 795833409 796344757 796587169 796734512 797070742 797616065 798119426 798340201
1892.7 798340201 798369884 798571408 799037158 799472213 799603224 799518824 799550235 799850941 800226033 800381482
1913.1 800381482 800298810 800269604 800557375 800942004 801080287 801021636 801047385 801329553 801732183 801951885
1933.5H01951885m2379k7179K41398M05491K86043N6028M0650L09527M99368L40938
1953.9H04061770O4433L0041K87890N14567L90768N2214k9147K42591M47035L20315
1974.3H06382477L7968n7041J16169L16680K74718J8477j37091j788K52068K63095
1994.7H07465732k4319k38835j38879R2804J05798j94072m70162m17411j76191j47462
2015.1H05857003m10199o54281o22749l65734k54273m54963o92188o76930m47214l02672
2035.5H00975800m04060n85020n63681l11196j14977j65344l15606k97904n0903J68682
2055.9G98335791J28626n2332r5427O4611K43902K41339M8697o4551O4671K57194K85625
2078.3G99458146J14620k0027R0241K78890L01123J73211O9797J28448K83659L29077
$$ plain form
1933.5 801951885 801909506 801882327 802123725 802529216 802815259 802871287 802911937 803221464 803720832 804061770
1953.9 804061770 804126203 804156244 804444134 804958701 805349469 805401683 805372536 805615127 806062162 806382477
1974.3 806382477 806420445 806363404 806479573 806796253 807070971 807089448 806952357 806950569 807202637 807465732
1994.7 807465732 807441413 807202578 807063699 807156503 807262301 807068229 806598067 806180656 806004465 805857003
2015.1 805857003 805446804 804792523 804169774 803804040 803549767 803094804 802402616 801725686 801278472 800975800
2035.5 800975800 800571740 799986720 799423039 799111843 798996866 798831522 798515916 798218012 798167109 798335791
2055.9 798335791 798464417 798412085 798316658 798381269 798625171 798866510 798915207 798850656 798915327 799172521 799458146
2078.3 799458146 799572766 799552739 799642980 799921870 800222993 800396204 800466001 800594449 800878108 801207185
2098.7H01207185J96278R0957J54733K74241L15249K12193L6776k4438R3162K12431
2119.1H02768767J47104k0325o8605L5644J41859J36077J5199o0677K7120J52051J35958
2141.5H03410172o258p1585N7459K29656K46168J29461P8678K22862M42028N25117
2161.9H05263758M17351L19243M44412O66678P48038O43433M82022M67778O47604P88212
2182.3H10888529P03931N42938N41568O69539P15077O08325M68314M52935N89371P11978
2202.7H16892505O57379N05090M72546O09636P36654O77824M89652L96729N00500O18219
2223.1H22556734N47290L51369K68340L86537N28276M77731K60770J55449K91109M82202
2243.5H26305807M88519K86401J18255K11418M33743M65393K79009J34766K25246M27604
$$ plain form
2098.7 801207185 801403463 801494420 801649153 801923394 802238643 802450836 802487612 802463174 802556336 802768767
2119.1 802768767 802915871 802895546 802826941 802862585 803004444 803140521 803155720 803095043 803122163 803274214 803410172
2141.5 803410172 803403914 803332329 803389788 803619444 803865612 803995073 804073751 804296613 804738641 805263758
2161.9 805263758 805681109 806000352 806444764 807111442 807859480 808502913 808984935 809452713 810100317 810888529
2182.3 810888529 811592460 812135398 812676966 813346505 814061582 814669907 815138221 815591156 816180527 816892505
2202.7 816892505 817549884 818054974 818527520 819137156 819873810 820551634 821041286 821438015 821938515 822556734
2223.1 822556734 823104024 823455393 823723733 824110270 824638546 825116277 825377047 825532496 825823605 826305807
2243.5 826305807 826794326 827080727 827198982 827410400 827844143 828309536 828588545 828723311 828948557 829376161
2263.9H29376161M71354L31342K22504L04341M96805N28276L37720K04444K82764L99709
2284.3H32955420L45886J62959L4869R2923K48134K39075N8174p4506j8239J29282
2304.7H34173977J46747J6212p2240n007J17659J06812j06812k75433j20043Q3744
2325.1H34065616L8266o3479j36137j88291j02997j1026j31309l39926l42190N245
2345.5H32793772K82049O5625l28481n19574m25756k04503j55628l17812l21269l0518
2365.9H30837905K41399K44737J79052K22922K91526L05176K82168K21372J31607M6909
2386.3H33004773m3214j45673k13445k15590j76429j60814k30908l52502l98934l31581
2406.7H30735683k81691l21865l82424m24802m51565m63307m94182n29825n19634n17666
$$ plain form
2263.9 829376161 829847515 830178857 830401361 830705702 831202507 831730783 832068503 832272947 832555711 832955420
2284.3 832955420 833301306 833464265 833499134 833592057 833840191 834079266 834137440 834062934 834044695 834173977
2304.7 834173977 834320724 834336936 834264696 834259689 834377348 834484160 834377348 834101915 833981872 834065616
2325.1 834065616 834103882 834040403 833904266 833715975 833612978 833601952 833470643 833130717 832788527 832793772
2345.5 832793772 833075821 833141446 832812965 832293391 831867635 831663132 831507504 831189692 830868423 830837905
2365.9 830837905 831079304 831324041 831503093 831726015 832017541 832322717 832604885 832826257 832957864 833004773
2386.3 833004773 832961559 832815886 832602441 832386851 832210422 832049608 831818700 831466198 831067264 830735683
2406.7 830735683 830453992 830132127 829749703 829324901 828873336 828410029 827915847 827386022 826866388 826348722
2427.1H26348722n49912n78344o18518o56247o54220o30737o26385o52969o56962o21796
2447.5H20102632o21617o49214o24358n83947n81920n70774n49376n36025n16474n11289
2467.9H14357638n18679m99606m69506m82500m95195m67062m31538l94344l68655l67284
2488.3H09863269l71813l38793k83540k72154k69592k53856k72632k83957k65419k61724
2508.7H06989789k56002k49267k89857l56495l82185l95894m11451m10021m52339n23865
2529H03262413n64158n87464n89490n71787n99682o55353o74546o61850o40750o47485
2549.4G97069848o55115o01351n70000o29305o72698o45340n89073n71429o05822o12199
2569.8G90917516n92888n85556n69939n59867n66303n54741n14150m63962m24802m23909
$$ plain form
2427.1 826348722 825798810 825220466 824601948 823945701 823291481 822660744 822034359 821381390 820724428 820102632
2447.5 820102632 819481015 818831801 818207443 817623496 817041576 816470802 815921426 815385401 814868927 814357638
2467.9 814357638 813838959 813339353 812869847 812387347 811892152 811425090 810993552 810599208 810230553 809863269
2488.3 809863269 809491456 809152663 808869123 808596969 808327377 808073521 807800889 807516932 807251513 806989789
2508.7 806989789 806733787 806484520 806194663 805838168 805455983 805060089 804648638 804238617 803786278 803262413
2529 803262413 802698255 802110791 801521301 800949514 800349832 799694479 799019933 798358083 797717333 797069848
2549.4 797069848 796414733 795813382 795243382 794614077 793941379 793296039 792706966 792135537 791529715 790917516
2569.8 790917516 790324628 789739072 789169133 788609266 788042963 787488222 786974072 786510110 786085308 785661399
2590.2G85661399m48942m37438l89755m06146m93825n34296n05507n03718n86987p17759
2610.6G80637026q04186q42273q98838r58801j018464j099944j149416j172900j242996
2629G71449208j330018j364231j349568j318693j314342j359761j404286j379072j304329
2647.3G59324908j281142j326561j359522j341641j296163j249313j213849j206338
2663.7G49050379j212061j193881j142442j073956j038254j051604j048625r89854
2680G40299702r30906r50038j015067j011133r36509r12666r81867j086772j151800
2698.3G31322944j125693j086772j161754j268685j262784j215696j206517j228273
2714.6G21766770j262784j239717j182795j166343j172722j178980j157820j078188
$$ plain form
2590.2 785661399 785212457 784775019 784385264 783979118 783485293 782950997 782445490 781941772 781354785 780637026
2610.6 780637026 779832840 778990567 778091729 777132928 776114464 775014520 773865104 772692204 771449208
2629 771449208 770119190 768754959 767405391 766086698 764772356 763412595 762008309 760629237 759324908
2647.3 759324908 758043766 756717205 755357683 754016042 752719879 751470566 750256717 749050379
2663.7 749050379 747838318 746644437 745501995 744428039 743389785 742338181 741289556 740299702
2680 740299702 739368796 738418758 737403691 736392558 735456049 734543383 733561516 732474744 731322944
2698.3 731322944 730197251 729110479 727948725 726680040 725417256 724201560 722995043 721766770
2714.6 721766770 720503986 719264269 718081474 716915131 715742409 714563429 713405609 712327421
2731G12327421j000405j005768j052380j032829r45151q91388r34183j022101j027286
2749.3G03415930r03666p53343p20560q07822q38161p51793o78837p12812q26061q94129
2769.7F95528746q49545p96914q47042r68635j063585j086414j100600j203239j377404
2788.1F86235368j473188j446843j462043j620650j817107j902163j887381j898527
2804.4F72727466k012313k192259k295911k301514k334654k439499k586246k705574
2820.7F53859496k753258k792954k891243l042817l180206l219485l226578l346443
2837F29406512l521979l650308l750324l877759m048407m201055m244566m177212m149139
2855.4E93785763m298747m642665n084932n524397n978763o456435o882846p153094
$$ plain form
2731 712327421 711327016 710321248 709268868 708236039 707290888 706399500 705465317 704443216 703415930
2749.3 703415930 702512264 701758921 701038361 700230539 699392378 698640585 697961748 697248936 696422875 695528746
2769.7 695528746 694679201 693882287 693035245 692066610 691003025 689916611 688816011 687612772 686235368
2788.1 686235368 684762180 683315337 681853294 680232644 678415537 676513374 674625993 672727466
2804.4 672727466 670715153 668522894 666226983 663925469 661590815 659151316 656565070 653859496
2820.7 653859496 651106238 648313284 645422041 642379224 639199018 635979533 632752955 629406512
2837 629406512 625884533 622234225 618483901 614606142 610557735 606356680 602112114 597934902 593785763
2855.4 593785763 589487016 584844351 579759419 574235022 568256259 561799824 554916978 547763884
2871.7E47763884p180393o991982o644189o117285n391955m536033l660858k835690
2888E04405499k109170j520813j059711p51436o85811q28713j077175j410991j800030
2906.4D93161649k240539k761781l309548l759831l965289l911704l679216l237485
2922.7D66296256k566815j732379p81685K36034J268983K310246L344775M285246N053133
2941D77713794N650699O119787O502629O831854P071495P152438P107795P047057O972790
2959.4E38170338O754458O412565O102860N844653N623341N459487N336821N275190
2975.7E84979713N271018N189955M934370M603923M300356L982424L615082L208816
2992F20085657K751410K248346J745165J265108Q01981L45647q1002m26949p22289
$$ plain form
2871.7 547763884 540583491 533591509 526947320 520830035 515438080 510902047 507241189 504405499
2888 504405499 502296329 500775516 499715805 498964369 498278558 497449845 496372670 494961679 493161649
2906.4 493161649 490921110 488159329 484849781 481089950 477124661 473212957 469533741 466296256
2922.7 466296256 463729441 461997062 461215377 461451411 462720394 465030640 468375415 472660661 477713794
2941 477713794 483364493 489484280 495986909 502818763 509890258 517042696 524150491 531197548 538170338
2959.4 538170338 544924796 551337361 557440221 563284874 568908215 574367702 579704523 584979713
2975.7 584979713 590250731 595440686 600375056 604978979 609279335 613261759 616876841 620085657
2992 620085657 622837067 625085413 626830578 628095686 628897667 629243314 629162312 628735363 628013074
3010.4F28013074j060545j482785j878917k099812k220631k387881k614558k842128
3026.7F11425817k969086k987445l018260l181517l384709l396452l339767l467560
3043E85681021l670454l762245l750563l725648l747880l785968l822684l841758l796756
3061.4E51777065l770709l815949l898859l952623l920972l883004l808737l695667
3077.7E21030545l760755l918767l927767l881335l838003l797710l848910l870607
3094D90186691l783345l697604l669560l694177l693342l599435l519535l563940l528864
3112.4D57436889l320664l256351l398358l538102l588945l492981l317595l220111
3128.7D30303782l232538l254652l166348l001035k935886l045678l123313l019631
$$ plain form
3010.4 628013074 626952529 625469744 623590827 621491015 619270384 616882503 614267945 611425817
3026.7 611425817 608456731 605469286 602451026 599269509 595884800 592488348 589148581 585681021
3043 585681021 582010567 578248322 574497759 570772111 567024231 563238263 559415579 555573821 551777065
3061.4 551777065 548006356 544190407 540291548 536338925 532417953 528534949 524726212 521030545
3077.7 521030545 517269790 513351023 509423256 505541921 501703918 497906208 494057298 490186691
3094 490186691 486403346 482705742 479036182 475342005 471648663 468049228 464529693 460965753 457436889
3112.4 457436889 454116225 450859874 447461516 443923414 440334469 436841488 433523893 430303782
3128.7 430303782 427071244 423816592 420650244 417649209 414713323 411667645 408544332 405524701
3145D05524701k856314k697051k589851k683551k852678k848059k737641k637536k552151
3163.4C81069869k455622k376080k374440k368599k289504k211183k190590k175212
3179.7C62628639k141536k100706k049118j976788j913905j910746j917452j864552
3196C46753836j767010j728922j729369j678646j621455j597166j575052j530648j473278
3214.3C32052290j410931j362890j360327j386046j371682j291782j182735j071065
3230.7C21614832j041293j194060j328439j237243j084298r92090r22620r15319j002818
3249C11896652j022041q79705p82370q47429r07213q49187p61122o98507n91665m74960
3269.4C04082453n68747p96944q69095p95216p08997o69986o76304o85811o60092n69761
$$ plain form
3145 405524701 402668387 399971336 397381485 394697934 391845256 388997197 386259556 383622020 381069869
3163.4 381069869 378614247 376238167 373863727 371495128 369205624 366994441 364803851 362628639
3179.7 362628639 360487103 358386397 356337279 354360491 352446586 350535840 348618388 346753836
3196 346753836 344986826 343257904 341528535 339849889 338228434 336631268 335056216 333525568 332052290
3214.3 332052290 330641359 329278469 327918142 326532096 325160414 323868632 322685897 321614832
3230.7 321614832 320573539 319379479 318051040 316813797 315729499 314737409 313814789 312899470 311896652
3249 311896652 310874611 309994906 309212536 308365107 307457894 306608707 305847585 305149078 304557413 304082453
3269.4 304082453 303513706 302716762 301847667 301052451 300343454 299673468 298997164 298311353 297651261 297081500
3289.8B97081500n14477o01709p30664q00609p79838o46561m92543n08547p55757j012206
3310.2B90238589j047939r10163q33809q48264q02427p11561p15613q89003j023650
3328.6B82456160r70126r04470q55029p70450q16315r87291j067967j071333r96530
3346.9B74016649q42929r24886j195877j208634j015812r66429j046539j027971q35240
3365.3B64952332p17014r28015j279145j334936j084298r05096r00835r33081q53062
3383.6B56016850p04526n63831l80575m39465p87854q35687m34190j77473m75914q62956
3404B50354379p67424m94093m17635m48301n02229m94346l47033k36288k65792k33143
3424.4B46148095p5236P1689O8843O4239J66387P0080k21297k89336n6073K00704K99438
$$ plain form
3289.8 297081500 296567023 295965314 295234650 294434041 293654203 293007642 292515099 292006552 291250795 290238589
3310.2 290238589 289190650 288280487 287446678 286598414 285795987 285084426 284368813 283479810 282456160
3328.6 282456160 281486034 280581564 279726535 278956085 278139770 277152479 276084512 275013179 274016649
3346.9 274016649 273173720 272248834 271052957 269844323 268828511 267862082 266815543 265787572 264952332
3365.3 264952332 264235318 263307303 262028158 260693222 259608924 258703828 257802993 256869912 256016850
3383.6 256016850 255312324 254748493 254367918 253928453 253140599 252304912 251870722 251693249 251217335 250354379
3404 250354379 249586955 249092862 248675227 248226926 247724697 247230351 246883318 246647030 246381238 246148095
3424.4 246148095 246072859 246144548 246213391 246277630 246444017 246514097 246292800 246003464 245947391 246148095 246447533
3446.8B46447533K55555K52605L38003L96564M48898N23627M61667M14014O79270R14514
3467.2B51132250O55949K07633J71989M19885O63400P44670N20796M20063O35893P04258
3487.6B56276786N89103O23911P30843P59095P51227P94709P99358O33329N49554O70553
3508B63178468Q18550R63986R54390P68453P43240R45806J164317J121968Q90226Q40306
3528.4B72389710J010895J173347J269877J276731J203359J323461J533449J473516
3544.7B82654345J209229J202017J453013J586794J607091J663059J798659J911521
3561.1B95085728J867503J803488K041310K422481K482713K405822K516329K679169
3577.4C13304543K811909L011704L142565L005356K859294L169418L472983L487438
$$ plain form
3446.8 246447533 246703088 246955693 247293696 247690260 248139158 248662785 249124452 249538466 250217736 251132250
3467.2 251132250 251788199 251995832 252167821 252587706 253251106 253995776 254516572 254936635 255572528 256276786
3487.6 256276786 256865889 257489800 258220643 258979738 259730965 260525674 261325032 261958361 262507915 263178468
3508 263178468 263997018 264961004 265915394 266683847 267427087 268372893 269537210 270659178 271549404 272389710
3528.4 272389710 273400605 274573952 275843829 277120560 278323919 279647380 281180829 282654345
3544.7 282654345 283863574 285065591 286518604 288105398 289712489 291375548 293174207 295085728
3561.1 295085728 296953231 298756719 300798029 303220510 305703223 308109045 310625374 313304543
3577.4 313304543 316116452 319128156 322270721 325276077 328135371 331304789 334777772 338265210
3593.7C38265210L564090L780723L871321L857315L863156L781855L819734M061579
3610C68864983M238427M335880M277349M186064M383772M499346M377544M136384M088700
3628.4D07388449M520148M659325M587143M547030M430294M377812M424244M389614
3644.7D43324059M213989M243910M644335M713565M450440M528731M654229M379004
3661D79152262M126132M109472L929198L704041L922015L833503L473580L707111L843545
3679.4E13800859L668130L614306L558576L321588K920807K826691L038108L102600
3695.7E39851665K905250K550840K315403K427518K580404K394676K021194J968324
3712E59015274K392471K528190K262474J952886J781464J771688J896024K110899K023339
$$ plain form
3593.7 338265210 341829300 345610023 349481344 353338659 357201815 360983670 364803404 368864983
3610 368864983 373103410 377439290 381716639 385902703 390286475 394785821 399163365 403299749 407388449
3628.4 407388449 411908597 416567922 421155065 425702095 430132389 434510201 438934445 443324059
3644.7 443324059 447538048 451781958 456426293 461139858 465590298 470119029 474773258 479152262
3661 479152262 483278394 487387866 491317064 495021105 498943120 502776623 506250203 509957314 513800859
3679.4 513800859 517468989 521083295 524641871 527963459 530884266 533710957 536749065 539851665
3695.7 539851665 542756915 545307755 547623158 550050676 552631080 555025756 557046950 559015274
3712 559015274 561407745 563935935 566198409 568151295 569932759 571704447 573600471 575711370 577734709
3730.3E77734709J657963J432895J661778K093494K013087J216531P72893J574576
3746.7E90157926J675904J034617J340211J942575J793802J441240J471460J528382
3763F02386117J386702J326680J243770J239360J420378J471639J325607J106263J074314
3781.3F13980830J115381J118303J201153J225590J169026J070619R97960J095832
3797.7F22974694R26971O92487J076996J097262R26197J265466J385033R62734O16253
3816F31924093Q32021P50482O72579J064718J118421J006425Q84771Q00610R18269
3834.4F39972389P62403N02348P17520Q81494Q99195J059056J133263O39915l40342
3852.7F46227241J1622J294017J356125Q79348N06222N14388P15077N45621M55439
$$ plain form
3730.3 577734709 579392672 580825567 582487345 584580839 586593926 587810457 588583350 590157926
3746.7 590157926 591833830 592868447 594208658 596151233 597945035 599386275 600857735 602386117
3763 602386117 603772819 605099499 606343269 607582629 609003007 610474646 611800253 612906516 613980830
3781.3 613980830 615096211 616214514 617415667 618641257 619810283 620880902 621878862 622974694
3797.7 622974694 623901665 624594152 625671148 626768410 627694607 628960073 630345106 631307840 631924093
3816 631924093 632756114 633506596 634179175 635243893 636362314 637368739 638253510 639054120 639972389
3834.4 639972389 640734792 641237140 641954660 642836154 643735349 644794405 645927668 646567583 646227241
3852.7 646227241 646238863 647532880 648889005 649768353 650274575 650788963 651504040 652049661 652505100
3871.1F52505100O33597Q01146R29654P39276O62863O98686M74751N45442N75602L48151
3891.5F58914268N32091Q06331O23584K73824J44482J77741M32431P55131P58410N76556
3911.9F63994849L94225K31445K36213M24623M85421L94523M02868M14490K95758K70010
3932.3F67544425L91542M36724M28795L69609K59280L13282L79562L32773L78430M23789
3952.7F71258211L48091L22759L51668L04162L03746L43084K95877K87950L43264L42726
3973.1F74501538L16859K89082K38240K58803L33011L16441K18094K33590L20435K63214
3993.4F77289307J81258J96278
3997.5F77666843
$$ plain form
3871.1 652505100 653138697 653939843 654869497 655608773 656271636 656970322 657445073 657990515 658566117 658914268
3891.5 658914268 659446359 660252690 660876274 661150098 661294580 661472321 661904752 662659883 663418293 663994849
3911.9 663994849 664389074 664620519 664856732 665281355 665766776 666161299 666564167 666978657 667274415 667544425
3932.3 667544425 667935967 668372691 668801486 669171095 669430375 669743657 670123219 670455992 670834422 671258211
3952.7 671258211 671606302 671929061 672280729 672584891 672888637 673231721 673527598 673815548 674158812 674501538
3973.1 674501538 674818397 675107479 675345719 675604522 675937533 676253974 676472068 676705658 677026093 677289307
3993.4 677289307 677470565 677666843
3997.5 677666843
##END=$$ End of the data block
