##TITLE=Amostra 1 - Marcela $$ Begin of the data block
##JCAMP-DX=5.00 $$ ACD/SpecManager v 10.08
##SPECTROMETER/DATA SYSTEM=Alpha
##DATE=24 Oct 2013 10:57:42
##DATA TYPE=INFRARED SPECTRUM
##DATA CLASS=XYDATA
##ORIGIN=
##OWNER=
##NPOINTS=1765
##FIRSTX=399.75695801
##LASTX=3997.56933594
##MAXX=3997.56933594
##MINX=399.75695801
##MAXY=0.83566290
##MINY=0.16028501
##XFACTOR=1.0000000000
##YFACTOR=1.000000000000000e-9
##FIRSTY=0.45841494
##DELTAX=2.03957629
##XUNITS=1/CM
##YUNITS=ARBITRARY UNITS
##XYDATA=(X++(Y..Y))
399.8 458414942 455169529 453581661 452286273 451244116 451611251 453798503 456432939 457730889 457047284
418.1 457047284 455210239 453557938 451698720 448909044 445772111 443346053 441823423 440580547
434.4 440580547 439404249 439091802 440675199 444306195 448631167 452094942 454699308 457257956 459744185
452.8 459744185 461164236 460946202 459541112 457881302 456109077 453697383 450217098 445977807 441937864
471.1 441937864 438653469 435800523 432846010 430315763 429322749 429648519 429974616 429588735 428691119
489.5 428691119 427945644 427601159 426854044 424999744 422493696 420310169 418616146 416537493 413414985
507.9 413414985 409568608 405670345 401808500 397449821 392476112 387766570 384315223 382382333
524.2 382382333 381581664 381557316 382501483 384956568 389174998 394654930 400389194 405662388 410268962
542.5 410268962 413793772 415473551 415066570 413278043 410916150 408173144 404712170 400021791 394243687
560.9 394243687 387967914 381347656 374194652 366759330 360241950 356020868 354684323 356034815
577.2 356034815 359600931 365092844 372311264 380442649 388072461 394052923 398090839 400524765
593.5 400524765 401816308 402185857 401890486 401405841 401145250 401367873 402092427 403303176 405033052
611.9 405033052 407460570 410933524 415469706 420573473 425774515 430946320 436112374 441145420
628.2 441145420 445480287 448699325 451139480 453346014 455409586 457079083 458234012 459208161 460479766
646.5 460479766 462149739 463762313 464901268 465809762 466961265 468476057 469981313 471124440 471922576
664.9 471922576 472878069 474807590 476780117 478099823 479148626 480479628 482367545 484432191 486084878
683.3 486084878 487160951 488045514 489023358 489600509 488886356 486719698 483746320 480534405 477060556
701.6 477060556 473179966 469502777 467360765 467666298 470168322 473939717 478496999 484234422 491613209
720 491613209 499948651 507852852 514807165 521359980 528022110 534134448 538511455 540990472 542455018
738.3 542455018 543566465 543670595 541482449 536768675 530699551 524456680 518002689 510724723 502991736
756.7 502991736 496198952 491616428 489656925 490013987 492565513 497919798 506565988 517612278
773 517612278 529046416 539431453 548820019 557780325 566110790 572990596 578195512 582726240
789.3 582726240 587830007 593744159 599708319 605278015 611014605 617390037 623740613 628791571
805.6 628791571 632058561 634430528 637057424 639836907 641648650 641816139 640932441 639849365 638207138
824 638207138 634764612 628987610 621621251 613730669 605671823 597130477 588258684 580030799 573353231
842.3 573353231 568231225 563981354 560143471 556709766 553866029 551625609 549613774 548007250
858.7 548007250 548416436 552812576 561656296 573538303 586476862 598987520 610084951 618817031
875 618817031 624088883 625165224 622218311 616289198 608554900 599618018 589845359 580118418 571503639
893.3 571503639 564310312 557931185 551470935 544476211 536968887 528832972 519619703 508932233
909.6 508932233 496922851 484386504 472236246 461120486 451545715 444110513 439328551 437123001
926 437123001 436805278 437664390 439455450 442386091 446768194 452577502 459222406 465473056 469401270
944.3 469401270 468935758 462899268 451448113 435805440 417654306 398318976 378326088 357733697
960.6 357733697 336622268 315298826 294168830 273412079 253116608 233643904 215571776
974.9 215571776 199538335 186080724 175514400 167920917 163118958 160728708 160285011 161282808
991.2 161282808 163140431 165385202 167820066 170330882 172687158 174582586 175801873 176413864 176712647
1009.6 176712647 176932201 177237988 177813008 178831547 180380836 182443693 184933379 187753603 190795168
1027.9 190795168 193864182 196782172 199369073 201473296 203159794 204662174 206210181 207940847
1044.3 207940847 209906518 212216973 215079665 218670532 223073989 228364155 234740973 242514789
1060.6 242514789 251897633 262295097 271455705 275872350 273164004 264456034 253713876 244653448
1076.9 244653448 238818124 236160249 236105159 237994239 241254047 245455116 250365108 255766571 261149466
1095.2 261149466 265781313 269150883 271295935 272754818 274207860 276110023 278590798 281620085
1111.6 281620085 285093248 288722724 292058736 294780701 297015518 299233288 301915646 305338740
1127.9 305338740 309364140 313324332 316179037 316831619 314512640 309159875 301569462 293050349
1144.2 293050349 284694970 277066171 270447373 265057772 261056900 258495241 257285804 257316411 258649439
1162.6 258649439 261533350 266252339 272954255 281633556 292207390 304565221 318462312 333419621
1178.9 333419621 348819941 364078373 378774673 392534792 404850304 415140331 423062265
1193.1 423062265 428768724 432798773 435745329 438107908 440382212 443115145 446799308 451616406
1209.5 451616406 457320154 463441789 469565988 475338638 480289042 483887732 485885501 486497492
1225.8 486497492 486186951 485326380 484139651 482815921 481579751 480717093 480417371 480665743 481409997
1244.1 481409997 482737541 484722346 487233162 490025848 492840052 495521456 498125911 500757635
1260.4 500757635 503400981 506034791 508704185 511436760 514128745 516474426 518154621 519094825
1276.8 519094825 519449174 519378006 518949449 518200099 517172754 515888870 514352322 512558103 510520697
1295.1 510520697 508363605 506342947 504720688 503566861 502716541 501929641 501057923 500008166 498665750
1313.5 498665750 496930659 494701356 491927475 488646954 484812468 480311245 475176245 469703048
1329.8 469703048 464399010 459771514 456095219 453340977 451395094 450182647 449460685 448859125 448074490
1348.1 448074490 446993858 445689261 444259524 442775875 441219091 439528435 437797010 436387241
1364.5 436387241 435460776 434917063 434831023 435311288 436426669 438031614 439802617 441571116 443562597
1382.8 443562597 446309119 450134516 454351485 457801521 460229486 461765945 462456822 462335914 461567521
1401.2 461567521 460304797 458632559 456840187 455029964 453155071 451428205 450076759 449021250
1417.5 449021250 448258370 447968215 448048919 448433131 449144334 450112522 451296210 452617168 454114288
1435.9 454114288 455892891 457701474 459354579 460627854 461306274 461274117 460571289 459353924 457722396
1454.2 457722396 455419689 453130722 452415824 453014940 454954207 458582759 463529021 469963372 478803515
1472.6 478803515 488768250 498232096 507364452 516403854 525289953 533552766 541361868 549226165
1488.9 549226165 557027876 563832283 569966972 576260149 582259059 587581277 592274010 596899211
1505.2 596899211 602077425 606738865 610759854 614659488 618365586 621933043 625343204 628831148
1521.5 628831148 632272601 635380268 638345599 641043067 643658519 646514475 649235725 651555181
1537.8 651555181 653930604 656364918 658735871 661099136 663180232 665029943 666890383 668903410
1554.1 668903410 670825362 672536135 674222529 675845325 677462459 679070175 680368245 681378484
1570.5 681378484 682348311 683310688 684210896 684830964 685075521 685022056 684891641 684596300 683842897 682500780
1590.9 682500780 680775464 678868771 676733375 674121857 670815408 666981637 662956774 658740699
1607.2 658740699 653923631 648554981 643080771 637070417 630263805 624434471 619104922 613016844
1623.5 613016844 607234597 602155864 597369850 593193054 589296162 585188329 582257807 580743253
1639.8 580743253 579768360 579205990 579267800 580318987 581869185 583692551 586446226 589606702 592916191
1658.2 592916191 596653104 600785255 605088890 609281778 614026248 619585693 624755681 629775107
1674.5 629775107 635216951 640548408 645616770 650743067 656553090 662068009 666981697 671971679
1690.8 671971679 676480293 680719972 684988022 689254820 694056511 698168814 701419711 704696059
1707.1 704696059 708025515 711309195 714309514 716882885 719434857 722236991 724983335 727467597
1723.4 727467597 729614973 731490850 733442187 735493124 737560332 739504457 741133749 742818356
1739.7 742818356 744795620 746756852 748380840 749693990 751109004 752939403 754727542 756083071
1756.1 756083071 757150710 758256495 759664536 761181235 762359917 763171911 763974011 765117943 766500354
1774.4 766500354 767657220 768477619 769229114 770235121 771437705 772509217 773272395 773870587 774729729
1792.8 774729729 775894225 776930749 777638555 778250515 779136539 780259013 781274617 781976700 782540500
1811.1 782540500 783287406 784251213 785164177 785807490 786231160 786701620 787446856 788266301 788789093 789117694
1831.5 789117694 789583623 790216625 790839076 791221976 791304052 791339397 791727126 792305112 792633176 792666972
1851.9 792666972 792731643 793093383 793602347 793940425 794006526 794030011 794254422 794670105 795097530 795354962
1872.3 795354962 795522094 795878887 796475649 796992719 797217429 797360122 797718346 798265219 798737586 798922837
1892.7 798922837 798945189 799174607 799665570 800109327 800246716 800160825 800186098 800480902 800846815 800992250
1913.1 800992250 800899327 800866783 801165104 801561356 801700175 801653206 801709592 802001774 802383542 802586734
1933.5 802586734 802555263 802551925 802800894 803170681 803401589 803439081 803494334 803813159 804324865 804704130
1953.9 804704130 804790378 804817259 805118799 805645585 806022882 806044340 805983901 806228280 806721747 807077467
1974.3 807077467 807087064 806978822 807092547 807457626 807769358 807764709 807583451 807584822 807850897 808102250 808076680
1996.7 808076680 807853162 807731330 807821989 807903111 807697654 807263613 806905150 806742907 806561351 806124032
2017.1 806124032 805494666 804930925 804586947 804315925 803830922 803117931 802472830 802068114 801758111 801322639
2037.5 801322639 800716937 800126374 799792528 799684703 799530506 799229681 798958302 798927248 799091280 799183846
2057.9 799183846 799100876 799017429 799135387 799441159 799711406 799765587 799713492 799786091 800029516 800281823
2078.3 800281823 800377250 800371289 800468206 800741255 801035047 801180363 801220000 801351666 801671445 802036464
2098.7 802036464 802236199 802303970 802459180 802767038 803082407 803251803 803268194 803274214 803418815 803655684
2119.1 803655684 803794861 803773403 803722799 803776324 803915024 804026961 804017425 803924382 803917408 804080844 804267287
2141.5 804267287 804308653 804259062 804299474 804499626 804727316 804840267 804910481 805135489 805589318 806138754
2161.9 806138754 806580186 806903720 807326734 807977438 808738589 809405744 809903741 810395479 811079562 811882734
2182.3 811882734 812573850 813090682 813583136 814205348 814933181 815601826 816105545 816550672 817124724 817837656
2202.7 817837656 818507612 819003582 819446206 820047379 820798039 821484387 821958065 822336674 822847664 823476434
2223.1 823476434 824018180 824371159 824655652 825069010 825607598 826060474 826309800 826475441 826752186 827208340
2243.5 827208340 827689409 827993989 828154147 828387082 828789651 829219639 829504192 829674959 829934120 830371082
2263.9 830371082 830826283 831136584 831354499 831654429 832121313 832609296 832936883 833166599 833495378 833951950
2284.3 833951950 834309638 834430933 834442258 834539413 834813893 835114360 835219264 835147858 835138083 835317969
2304.7 835317969 835525930 835567236 835482657 835456550 835563242 835662901 835589826 835384130 835248768 835270226 835295141
2327.1 835295141 835175991 834953964 834774315 834754169 834826112 834717512 834334373 833975196 834010065 834307849
2347.5 834307849 834378362 834035158 833515882 833214283 833124757 832906723 832526922 832266808 832287729 832521021
2367.9 832521021 832735658 832821786 832922041 833142340 833406866 833654940 833855391 833957791 833978236 833934247
2388.3 833934247 833805859 833625197 833433330 833258867 833098173 832871079 832549930 832202613 831884265 831573725
2408.7 831573725 831216216 830811799 830397248 829985797 829549909 829043448 828481436 827922165 827374518 826829255
2429.1 826829255 826278746 825685561 825031519 824357331 823714912 823100507 822478414 821846426 821216881 820590794
2449.5 820590794 819980264 819387555 818796039 818212450 817654431 817104220 816554785 816023648 815497041 814980686
2469.9 814980686 814519465 814070404 813557506 813031018 812561214 812162757 811822534 811468840 811069131 810683906
2490.3 810683906 810350180 810049415 809762001 809490263 809243262 808986664 808699250 808412194 808144331 807917953
2510.7 807917953 807725251 807468772 807102263 806702495 806316078 805923879 805489302 804981411 804441154 803927422
2531.1 803927422 803409636 802824676 802180648 801519632 800873995 800259292 799664676 799050152 798386097 797717273
2551.5 797717273 797104180 796526730 795917630 795277834 794654667 794059515 793466151 792843461 792219043 791630626
2571.9 791630626 791056275 790465832 789868712 789299011 788763583 788255632 787787914 787349880 786906958 786459446
2592.3 786459446 786043644 785668314 785270274 784788191 784269273 783779621 783288419 782707870 781993389 781199098
2612.7 781199098 780364394 779467165 778510392 777498543 776416004 775269628 774076164 772825360 771523416
2631 771523416 770187914 768824637 767474174 766150713 764808834 763410866 761989474 760631442 759338975
2649.4 759338975 758057296 756776512 755494833 754214883 752956986 751718640 750494242 749298930
2665.7 749298930 748145163 747024536 745935142 744881451 743836761 742797136 741804183 740861058 739909232
2684.1 739909232 738924444 737951696 737015843 736074209 735072315 734003067 732889473 731766045 730643392
2702.4 730643392 729471624 728237152 727004826 725805998 724604011 723354101 722068846 720827460
2718.7 720827460 719650626 718482435 717300653 716117859 714979649 713935673 712936759 711896181
2735 711896181 710824788 709793925 708835900 707906961 706946313 705951571 704973876 704101503 703373492 702671051
2755.4 702671051 701862991 701003015 700239599 699596345 698924780 698104501 697198689 696332872 695512176 694661319
2775.8 694661319 693713903 692647457 691543818 690444589 689256668 687910914 686450839 684967875
2792.2 684967875 683478117 681885064 680118084 678241313 676356673 674476266 672475815 670250654
2808.5 670250654 667903960 665575802 663260043 660843432 658234298 655476153 652696908 649928272
2824.8 649928272 647050977 644014478 640880704 637687683 634431243 631057441 627529085 623862803
2841.1 623862803 620084167 616185427 612140834 607967734 603737414 599539459 595347524 590991080
2857.4 590991080 586298108 581161261 575569451 569553912 563090384 556178451 548975885 541753709
2873.7 541753709 534727693 528055608 521910667 516481578 511925936 508282185 505457222 503313720
2890.1 503313720 501748800 500656903 499881119 499208748 498404324 497315824 495909035 494135141 491885304
2908.4 491885304 489092588 485755056 481978446 477998108 474069953 470397502 467147738 464530230
2924.7 464530230 462785631 462037653 462274492 463504255 465808421 469193757 473506272 478547364 484177113
2943.1 484177113 490319639 496874571 503722072 510765195 517879009 525001407 532122254 539140940
2959.4 539140940 545912385 552372754 558536887 564441025 570123434 575626194 581027389 586381912
2975.7 586381912 591695786 596922636 601916075 606566906 610901058 614946783 618648946 621924758
2992 621924758 624714196 626998246 628787160 630092442 630934000 631340325 631316543 630908549 630200148
3010.4 630200148 629147649 627675176 625852346 623801470 621571779 619147658 616499960 613668919
3026.7 613668919 610781252 607880890 604875863 601645052 598226547 594833612 591497660 588042378
3043 588042378 584394395 580652475 576950133 573262632 569477737 565620482 561749876 557869852 554014087
3061.4 554014087 550199986 546386659 542497396 538531363 534596264 530728996 526931286 523208559
3077.7 523208559 519416034 515486598 511555314 507642746 503738821 499905258 496070862 492181033
3094 492181033 488332540 484596580 480932325 477234036 473495573 469853312 466330200 462786943 459266096
3112.4 459266096 455903262 452567130 449117512 445558459 441930234 438378245 434996068 431726724
3128.7 431726724 428480625 425247669 422114521 419108301 416118443 413000226 409828931 406803221
3145 406803221 403916955 401156127 398528278 395836443 392983943 390134871 387387186 384723514 382161230
3163.4 382161230 379704565 377273798 374839813 372472316 370164901 367867142 365596652 363398761
3179.7 363398761 361261219 359126478 357024103 355026901 353089184 351146221 349225700 347341061
3196 347341061 345493615 343708336 341987252 340304047 338648200 337022215 335429281 333888113 332391441
3214.3 332391441 330931574 329536408 328196853 326853991 325484753 324127793 322860688 321744919
3230.7 321744919 320694417 319508702 318205595 316995710 315908760 314881533 313938677 313015819 311982572
3249 311982572 310922444 310012162 309220821 308396757 307522833 306699008 305937707 305177391 304476321 303929776
3269.4 303929776 303375542 302639335 301820606 301024586 300271690 299575627 298893005 298175782 297496229 296965659
3289.8 296965659 296466470 295804083 295018792 294203818 293403834 292738527 292259604 291724503 290860951 289780557
3310.2 289780557 288757712 287877530 287067711 286264449 285486251 284731507 283935606 283009529 281966180
3328.6 281966180 280952573 280024976 279189020 278449446 277635396 276613444 275510490 274431735 273406208
3346.9 273406208 272514403 271592289 270401835 269107163 267988861 267044336 266072989 265035242 264140546
3365.3 264140546 263361484 262369812 261055171 259724379 258688748 257823825 256917506 255988896 255126625
3383.6 255126625 254381567 253798366 253425330 253026068 252287775 251434296 250921816 250668645 250143021 249275848
3404 249275848 248538479 248064071 247653052 247227207 246765837 246282294 245884418 245596781 245330095 245107964
3424.4 245107964 245047718 245137513 245179430 245187014 245334879 245400488 245171681 244955733 245010823 245235577 245499417
3446.8 245499417 245721653 245922118 246190950 246554077 247007012 247538298 248014346 248460859 249160081 250044316
3467.2 250044316 250651956 250832617 251007706 251491636 252222687 252953291 253460079 253921866 254568875 255267650
3487.6 255267650 255904377 256573021 257300586 258062094 258829415 259623766 260445058 261090040 261591494 262249082
3508 262249082 263094515 264066547 265042424 265840620 266589016 267536610 268730968 269882172 270775825 271632582
3528.4 271632582 272675782 273888320 275209665 276494712 277662039 278989226 280579597 282114923
3544.7 282114923 283387393 284665734 286130279 287646055 289230555 290971488 292853981 294802219
3561.1 294802219 296699315 298522532 300556988 302994907 305555224 308068246 310643673 313327640
3577.4 313327640 316158056 319209993 322405666 325493693 328414679 331596464 335083902 338603497
3593.7 338603497 342207432 346020043 349931628 353889257 357881486 361740768 365582675 369655639
3610 369655639 373938143 378342062 382661194 386869848 391332835 395933509 400299340 404349983 408454746
3628.4 408454746 413090140 417794436 422380269 426946819 431403369 435819298 440281808 444679916
3644.7 444679916 448911726 453232974 457952142 462673724 467109442 471632868 476291358 480675876
3661 480675876 484778345 488844067 492760718 496475488 500403285 504255533 507773399 511498868 515311658
3679.4 515311658 518968523 522636414 526275635 529622376 532484293 535261512 538300991 541374087
3695.7 541374087 544202507 546724260 549112618 551641703 554265022 556652546 558635652 560590744
3712 560590744 563037217 565611243 567867339 569793344 571564198 573325813 575210452 577315807 579299748
3730.3 579299748 580918074 582378030 584018886 586029947 588037014 589300573 590118170 591693819
3746.7 591693819 593302548 594317555 595761061 597776890 599545240 600944877 602414668 603959382
3763 603959382 605359435 606682062 607886076 609105229 610580087 612113535 613451242 614558637 615646720
3781.3 615646720 616747439 617829561 618998766 620227218 621458590 622590661 623597741 624648094
3797.7 624648094 625496984 626168013 627304018 628409803 629263222 630498052 631908298 632863939 633450687
3816 633450687 634275556 635016203 635745823 636911035 638046086 639020920 639895439 640675008 641525328 642211914
3836.4 642211914 642646432 643342257 644349992 645434856 646530151 647576094 648198068 647906184 647872925
3854.8 647872925 649132848 650536478 651442528 651910782 652427316 653218687 653769553 654134989 654724538
3873.1 654724538 655556500 656555235 657316744 657906175 658535063 658975780 659522295 660144746 660533369 661092520
3893.5 661092520 661876082 662408590 662663758 662887156 663104534 663545549 664341927 665143967 665712118 666085422
3913.9 666085422 666338027 666611910 667031407 667470336 667796373 668122947 668544769 668922544 669266939 669697583
3934.3 669697583 670104802 670480311 670853853 671149313 671489239 671876669 672184944 672544897 672997653 673376083
3954.7 673376083 673634529 673916936 674329758 674789846 675141037 675350010 675560117 675870180 676217377 676522613
3975.1 676522613 676785588 677038133 677323103 677665830 678001881 678297400 678594530 678857625 679057419 679251850
3995.5 679251850 679472327
3997.5 679472327
##END=$$ End of the data block
