##TITLE=$$ Begin of the data block
##JCAMP-DX=5.00 $$ ACD/SpecManager v 10.08
##SPECTROMETER/DATA SYSTEM=Varian
##DATE=24 Apr 2013 09:03:36
##DATA TYPE=INFRARED SPECTRUM
##DATA CLASS=XYDATA
##ORIGIN=
##OWNER=
##NPOINTS=3735
##FIRSTX=399.26403809
##LASTX=4000.35498047
##MAXX=4000.35498047
##MINX=399.26403809
##MAXY=88.92599487
##MINY=45.79116058
##XFACTOR=1.0000000000
##YFACTOR=0.000000100000000
##FIRSTY=45.79116058
##DELTAX=0.96440572
##XUNITS=1/CM
##YUNITS=TRANSMITTANCE
##XYDATA=(X++(Y..Y))
399.3 457911606 599588203 686841660 722507706 733773727 746417847 767965469 790821075
406 790821075 805848541 811006012 810103073 807817612 807247696 809899216 815447083 821561050 825790710
414.7 825790710 828490372 832890472 841047897 849883728 852460098 844049911 826935425 808920364
422.4 808920364 797088394 792930832 792950821 793148499 792581024 793120880 796647644 802932587 810049362
431.1 810049362 816372757 821905975 827725677 834350510 840795517 845194702 846278992 844379272
438.8 844379272 841359253 839846497 842256775 849733353 861219635 873393860 882055969 884346237
446.5 884346237 880169907 871774902 862104568 853447037 847064819 843247375 841194153 839126205
454.2 839126205 835297165 829475784 823433228 819631195 819207535 821251297 824050293 826869278 830264359
462.9 830264359 834660645 838980942 841213837 840668869 839528809 841582794 848775101 858750839 866114960
471.6 866114960 866698074 861025696 853724823 849445572 849179382 850219193 849257812 845246582 839489975
480.3 839489975 833634949 828088837 822317123 816150131 810417252 806407471 805061035 806804733
488 806804733 811867218 820272598 831226044 842622681 851615448 856226044 856740189 855493698 855023880
496.7 855023880 856207047 858130264 859653397 860778275 862203598 863678589 863345261 859188309 851188278
505.3 851188278 841845322 834533691 831392822 832522736 836467056 840916672 843365021 842290344
513.1 842290344 838608398 835742111 837316360 844098434 853180542 860299911 862845078 860606308
520.8 860606308 854304886 844539719 832619705 821545944 814683609 812727127 812493210 809714966
528.5 809714966 803525696 797951965 798530731 807150345 820008545 830442352 833854980 830539932
536.2 830539932 824635239 820779648 821291809 825502167 830972824 835329819 837538910 838132782 838588943
544.9 838588943 840393982 844297256 849975052 856124725 860956192 862987823 861812592 858325043
552.6 858325043 854159546 850731201 848637390 847817917 848088074 849322510 851098251 852400818 852060852
561.3 852060852 849753952 846574326 844419785 844566574 846681366 849138107 850257874 849332809 846733398
570 846733398 843415146 840495224 839052124 839793701 842515945 845937119 848455124 849427185 849767838
578.6 849767838 851110840 854144897 857639465 859114304 856658325 850440979 842773285 836716995
586.4 836716995 834245148 835191269 837634201 839359665 839289093 837840729 836145477 835020981 834669342
595 834669342 835120621 836598663 839220657 842460937 845281219 847058868 848352127 850489731 854224625
603.7 854224625 858787460 862344208 863442154 862055359 859370193 856739349 854882812 853876877
611.4 853876877 853546371 853657227 853815918 853472290 852275085 850497971 849048462 848929214 850546799
620.1 850546799 853401718 856383667 858431931 859110107 858761597 858211365 858264618 859330292 861348801
628.8 861348801 863929443 866495667 868373795 868970032 868109055 866297760 864540024 863670807 863739471
637.5 863739471 864051895 863881607 863150635 862407761 862187195 862476578 862836609 862938232 862862701 862889557
647.1 862889557 863134155 863506012 863974228 864720535 865928879 867447891 868748474 869271393 868857422
655.8 868857422 867883759 867011642 866766205 867252579 868180771 869137955 869858856 870260010 870249100 869590073
665.4 869590073 868069458 865838013 863536072 861977234 861659088 862545090 864241333 866255493 868054504
674.1 868054504 869058762 868870697 867670822 866292343 865677872 866090927 866840439 866825409 865405502
682.8 865405502 862841187 860044098 858024445 857514725 858844528 861848984 865749741 869250641 871050720
691.5 871050720 870578537 868414383 866012268 864839096 865516968 867561264 869861221 871497498 872266541
700.2 872266541 872574387 872906265 873398895 873846893 874014740 873875351 873574371 873262939 873027115 872936401
709.8 872936401 873046188 873283463 873369904 872951508 871865845 870254669 868349609 866106796 863091278
718.5 863091278 858828812 853391037 847698975 843187408 840996933 841301575 843325882 846025925 848821564
727.2 848821564 851729202 854854736 857877731 860155411 861381912 862061996 863190460 865369797 868219223
735.8 868219223 870669250 871838074 871659622 870761032 869877014 869409790 869414062 869777908 870287933 870580978
745.5 870580978 870180969 868689346 865959702 862114105 857455368 852405243 847478104 843195038 839948349
754.2 839948349 837923508 837088089 837081680 836975250 835261459 830528030 822684250 813778534 807412796
762.8 807412796 806820602 812953568 824042282 836880951 848673782 858040390 864804001 869265060
770.6 869265060 871797333 872888031 873203659 873398285 873835373 874518967 875250549 875800247 875988922
779.2 875988922 875769730 875350494 875181580 875671768 876803513 878057327 878816147 878920212 878836288 879253922
788.9 879253922 880472641 882115479 883381500 883585815 882584000 880846252 879217377 878519516 879171448
797.6 879171448 880981064 883218384 884949417 885463562 884572983 882653046 880449829 878762665 878122787
806.2 878122787 878576584 879681549 880745010 881206055 880933914 880254135 879702835 879706116 880382233 881546707
815.9 881546707 882835312 883861313 884372101 884386749 884235001 884396591 885170364 886396790 887485962
824.6 887485962 887788391 887050247 885601883 884142685 883306046 883309174 883886108 884476547 884539261 883840485
834.2 883840485 882600632 881400757 880856705 881225586 882215958 883161240 883447342 882883453 881754303
842.9 881754303 880544662 879568787 878766174 877765884 876101151 873392334 869394150 863969269 857102814
851.6 857102814 848983612 840085068 831168060 823236694 817491379 815202866 817352142 824065018
859.3 824065018 834226837 845730820 856374588 864806442 870816193 874864349 877444458 878908005
867 878908005 879728317 880628433 882203445 884377213 886359100 887285919 886989594 886155243 885742874 886227417
876.7 886227417 887310562 888244019 888402176 887657928 886398621 885279846 884883270 885427094 886637878
885.3 886637878 887877045 888477249 888111267 886965485 885604553 884621735 884296799 884488449 884814682
894 884814682 884963760 884875488 884656296 884336243 883731003 882563095 880730209 878447495 876107330 873970566
903.7 873970566 871948166 869647293 866631165 862697372 857997589 852933273 847879486 842871094
911.4 842871094 837458954 830918655 822818527 813672562 805185089 799751205 799346390 804467087 813844376
920 813844376 825147247 836174774 845703735 853530884 859929428 865130386 869221420 872355881
927.8 872355881 874885941 877222672 879572754 881827011 883699417 884975662 885670471 886008835 886289139
936.4 886289139 886731873 887388458 888148956 888822250 889231644 889259949 888837051 887946472 886690979 885362396
946.1 885362396 884382019 884073792 884424515 885071182 885582733 885811539 885988007 886449738 887266235 888124390
955.7 888124390 888581467 888426590 887800140 887006073 886256409 885600967 885040817 884631042 884446869 884492798
965.4 884492798 884683914 884902649 885042877 884998093 884676285 884078445 883366699 882798233 882553635 882616043
975 882616043 882814636 882978287 883035355 883001099 882916031 882830353 882834625 883061142 883615494 884465790 885379868
985.6 885379868 885976868 885905075 885049057 883616943 882029648 880685120 879774780 879239349 878818054
994.3 878818054 878126373 876806183 874751282 872197037 869413986 866129303 861343307 854090729 844759445
1003 844759445 835689926 830114059 830007477 834627075 841046066 846189957 848599319 848622055 847357407
1011.7 847357407 845627136 843753128 841822739 839788132 837351685 834109039 830123215 826394882
1019.4 826394882 824576111 825982742 830697327 837501831 844625931 850647049 854938812 857575455
1027.1 857575455 859003677 859755783 860279694 860846329 861531219 862275848 862957230 863381882 863231277
1035.8 863231277 862113037 859789429 856425400 852561417 848733292 845057526 841236343 837086563
1043.5 837086563 833124161 830577240 830676346 833770065 839015884 844889526 850042496 853834991 856298294
1052.2 856298294 857802887 858812180 859797821 861143799 862966843 865008316 866763153 867784882
1059.9 867784882 867944260 867487640 866929092 866850967 867644958 869254913 871110611 872430496 872759476
1068.6 872759476 872310257 871762009 871672287 872044983 872445831 872476730 872099915 871532898 870938034 870306168
1078.2 870306168 869618378 869016113 868731537 868857727 869242401 869613953 869784546 869716644 869438171 868950882
1087.9 868950882 868232880 867289276 866172638 864965057 863760757 862650986 861677551 860793228 859890823
1096.5 859890823 858920975 857987442 857300262 857009659 857063446 857227402 857249298 857040558 856765366 856781235
1106.2 856781235 857467499 859013977 861293259 863906631 866373138 868315125 869522247 869928436 869616241
1114.9 869616241 868874893 868179626 867991562 868477554 869394760 870266342 870702744 870609741 870156250 869598007
1124.5 869598007 869109879 868694534 868157196 867158585 865382309 862766876 859647141 856672974 854535980
1133.2 854535980 853680496 854170151 855730896 857889404 860129623 862029343 863362350 864128571 864487534
1141.9 864487534 864638214 864718399 864776154 864783325 864645157 864211121 863335114 861990128 860341797 858669434
1151.5 858669434 857161255 855765457 854244232 852330093 849734497 845948029 840152740 831642456
1159.2 831642456 820658188 808919754 799148331 793684616 793215637 796626892 802015991 807909088
1166.9 807909088 813690491 819168243 824009399 827694855 829895706 830707016 830435791 829223480 826954498
1175.6 826954498 823524094 819132843 814284744 809520416 805151215 801174774 797348404 793307037
1183.3 793307037 788690872 783266830 776998978 769995422 762371140 754169998 745444794 736420593
1191 736420593 727556915 719407120 712376556 706573639 701855392 697993774 694819794 692266617 690333633
1199.7 690333633 689039459 688380966 688303833 688686295 689356537 690135574 690870209 691436081 691747742 691820297
1209.4 691820297 691860123 692272720 693509903 695807953 698989639 702481308 705533981 707501755 708022766
1218 708022766 707039108 704680176 701070404 696144333 689570618 680869141 669685593 656086578
1225.8 656086578 640699463 624659462 609458618 596818771 588594818 586594505 592218933 605977936
1233.5 605977936 627107506 653537979 682332687 710467529 735629044 756680984 773627014
1240.2 773627014 787177887 798214035 807426682 815228195 821829300 827344513 831856308 835468597
1247.9 835468597 838362808 840818100 843137360 845506973 847902451 850134506 852013626 853490372
1255.7 853490372 854658890 855643921 856499939 857214813 857786636 858267746 858722992 859160538 859525070
1264.3 859525070 859762344 859882812 859954224 860046844 860190964 860383377 860607376 860829697 860983429 860974121
1274 860974121 860732346 860262680 859636993 858926163 858125305 857160187 856003647 854829559 854062958 854224548
1283.6 854224548 855628433 858141785 861200333 864089813 866281662 867591476 868111115 868045883 867610321
1292.3 867610321 867006378 866407013 865923004 865600510 865476303 865624313 866110153 866884384 867752228 868495712
1301.9 868495712 869048004 869535446 870130692 870857468 871528625 871879196 871763153 871265030 870661926 870281982
1311.6 870281982 870341949 870835419 871526337 872060242 872151260 871739960 871026001 870361099 870065231 870268097
1321.2 870268097 870851364 871516190 871937714 871932983 871545944 871013184 870631561 870604935 870940399 871439209
1330.9 871439209 871788177 871721954 871166687 870260773 869229202 868206329 867165375 866012802 864743805
1339.6 864743805 863503342 862488174 861793976 861341019 860931549 860371704 859557571 858480377 857168198
1348.2 857168198 855619507 853783875 851606750 849106979 846413269 843727951 841252060 839131927
1355.9 839131927 837428055 836062012 834739838 832956924 830173035 826081848 820748062 814480438
1363.7 814480438 807579498 800243454 792748260 785692902 779988861 776534729 775827408 777815399
1371.4 777815399 782038879 787855530 794571609 801495056 808044205 813919525 819194641 824182434
1379.1 824182434 829141922 834051590 838627167 842547531 845679016 848125458 850109253 851831284
1386.8 851831284 853424911 854973221 856491547 857852478 858768997 858935165 858255615 856959915 855473709
1395.5 855473709 854167633 853233566 852771454 852916260 853787003 855292206 857046738 858568802 859602585
1404.2 859602585 860247040 860766525 861297684 861743240 861923141 861770248 861379623 860905914 860442429 859969635
1413.8 859969635 859354706 858398666 856945267 855018539 852842026 850655212 848434067 845778427 842081680
1422.5 842081680 836847534 829933701 821663971 812906570 805098419 800003128 799069290 802656021
1430.2 802656021 809691086 818091660 825712891 831193466 834241714 835373993 835417328 835071106 834663696
1438.9 834663696 834158707 833375473 832251282 830905914 829465637 827891617 826065292 824040833 822100525
1447.6 822100525 820449295 818881683 816855240 813923645 809958496 804802780 797774124 787835846
1455.3 787835846 774613647 759356842 744698410 733111038 725301285 720002823 715395355 710879974
1463 710879974 707642822 707574005 711599426 718921967 727763367 736837158 746192551 756723328 768876572
1471.7 768876572 781804047 793749237 803303452 810388947 816121445 821765213 827755966 833582153
1479.4 833582153 838445358 841980896 844436264 846329117 848024521 849581375 850873566 851789093
1487.1 851789093 852369003 852849808 853587494 854853973 856600952 858410950 859750671 860368423 860480347
1495.8 860480347 860559540 860934219 861609192 862455521 863463516 864681854 865874634 866389999 865589676
1504.5 865589676 863540497 861221390 859894791 860160599 861585846 863221664 864406891 865061188 865354614
1513.1 865354614 865336456 864991226 864491882 864142685 863986130 863627548 862651443 861233521 860194168
1521.8 860194168 860309753 861567307 863153152 864176178 864382401 864187393 864110641 864231720 864149246
1530.5 864149246 863384933 861848526 859991226 858531494 857928467 858003693 858084488 857621841 856747208
1539.2 856747208 856189423 856594543 857927475 859567795 860940399 861963501 862888565 863851242 864721222
1547.9 864721222 865343246 865736694 865971603 865985947 865711060 865361710 865367279 865839005 866199875 865604935
1557.5 865604935 863877487 861928558 861055298 861762238 863331223 864588623 865006866 864973755 865060425
1566.2 865060425 865247726 865005417 864058304 862871246 862253571 862525253 863169174 863337784 862659760
1574.9 862659760 861536026 860701370 860551376 860875778 861145630 860985947 860395279 859614563 858853378
1583.5 858853378 858128510 857276230 856061020 854296265 851943130 849187241 846429214 844150085 842688522
1592.2 842688522 842059784 841953964 841910934 841545486 840670929 839281082 837476349 835408325 833253784
1600.9 833253784 831163940 829185638 827215576 825045471 822470093 819379883 815812149 811984482
1608.6 811984482 808319702 805373688 803600006 803054352 803298569 803677444 803807526 803869400 804413071
1617.3 804413071 805816650 807867432 809845657 811042480 811265640 810924759 810652313 810812149 811293030
1626 811293030 811720810 811858521 811843643 812062988 812781677 813851852 814749680 814938965 814291840 813243408
1635.6 813243408 812541962 812760239 813931808 815598984 817221603 818573761 819761734 820886612 821783829
1644.3 821783829 822206268 822288055 822677231 823993073 826048126 827733383 827921371 826640854 825330582
1653 825330582 825778656 828664322 833059540 837292252 840269547 842031250 843226776 844300079 845247421
1661.6 845247421 845996323 846736832 847739410 848922882 849790497 849902725 849398270 848973312 849303436
1670.3 849303436 850480804 851997147 853230972 853925247 854251938 854541245 855035629 855836639 856878510
1679 856878510 857793350 857863617 856409531 853516388 850421066 848925705 850086975 853315887 856811981
1687.7 856811981 859026184 859780731 860025330 860604630 861398773 861664276 861023407 859892883 858917694
1696.4 858917694 858192902 857269821 855922012 854701614 854539566 855787582 857765656 859319153 859792252
1705 859792252 859442062 858993454 858915939 859145813 859360733 859360733 859156418 858808823 858294373 857541351 856551361
1715.6 856551361 855473938 854593964 854215164 854465485 855130920 855716553 855786057 855316772 854696198 854318314
1725.3 854318314 854198074 854022598 853558273 852883987 852155838 851229172 849699020 847393188 844720764
1734 844720764 842363434 840572586 838855820 836426315 832908783 828529282 823639221 818194427 811743317
1742.7 811743317 803764114 793771515 781078873 764796906 744592590 721825867 699925461 683245087
1750.4 683245087 674918594 675200348 681450958 689683151 696488876 700137253 700513992 698465652 695300827
1759 695300827 692685242 692567978 696708832 705870438 719257355 734749069 749869385 762830429
1766.8 762830429 772973251 780500183 785942764 789852295 792785416 795324173 797945175 800850525
1774.5 800850525 803976517 807194595 810500336 814010086 817809830 821840439 825916214 829824982
1782.2 829824982 833404922 836579971 839373856 841893692 844251328 846443405 848308945 849641876
1789.9 849641876 850389786 850761719 851132660 851812592 852865067 854105682 855252304 856097183 856596603
1798.6 856596603 856858597 857060623 857356415 857807159 858378677 858991241 859578781 860104904 860537338 860833893
1808.2 860833893 860975723 861020889 861103897 861353531 861791763 862301178 862693329 862831192 862724304 862532883
1817.9 862532883 862473068 862667236 863043213 863377151 863474426 863339233 863157043 863082962 863054428 862846222
1827.5 862846222 862337723 861708069 861332932 861465073 862027969 862713699 863263779 863638611 863960037 864348755
1837.2 864348755 864838181 865385895 865888748 866184311 866112061 865660629 865063553 864696426 864824829 865423660
1846.8 865423660 866235809 866988220 867541656 867874069 867993546 867921219 867748642 867643738 867752151 868073425
1856.4 868073425 868447495 868670120 868638382 868410645 868159637 868059616 868181992 868444748 868649063 868592529
1866.1 868592529 868206253 867615433 867075500 866824570 866951828 867371368 867892609 868329010 868573151 868611298
1875.7 868611298 868496246 868310242 868138046 868041306 868036194 868087311 868138351 868162460 868181152 868216553 868227234
1886.3 868227234 868113251 867817917 867426300 867134247 867084808 867229996 867367325 867325439 867115173 866901855
1896 866901855 866838074 866936417 867079773 867136765 867058716 866892395 866737595 866681213 866748657 866880951 866963806
1906.6 866963806 866901016 866676559 866362915 866071243 865894318 865864792 865928040 865937729 865720215 865206528
1916.2 865206528 864524612 863931732 863605576 863494873 863397522 863193207 862974319 862922058 863081284 863293991
1925.9 863293991 863378830 863334274 863337326 863545151 863930054 864321060 864569626 864652786 864640961 864620590 864664383
1936.5 864664383 864826508 865105057 865391312 865506439 865331650 864921570 864472122 864168701 864063644 864087906
1946.1 864087906 864158783 864253082 864388657 864564743 864735107 864834976 864821091 864696579 864513474 864358368
1955.8 864358368 864310608 864388885 864525757 864609909 864570618 864431839 864282761 864191284 864151230 864106598 864022903
1966.4 864022903 863922348 863845444 863787384 863684998 863485718 863222961 863021774 863003616 863178940 863424759
1976 863424759 863568497 863509140 863272095 862976913 862759857 862712326 862853546 863126755 863423462 863632660
1985.7 863632660 863699112 863637085 863484573 863247833 862906799 862480011 862064972 861781693 861656647 861575699
1995.3 861575699 861376877 861005478 860574493 860272064 860200653 860306625 860448532 860514984 860484772 860396576
2005 860396576 860297394 860222321 860198898 860244064 860345535 860457764 860526657 860515518 860411911 860222702 859984207
2015.6 859984207 859769211 859664154 859707260 859843826 859959641 859969940 859882736 859771500 859693680 859645309
2025.2 859645309 859593658 859536057 859510803 859550095 859634933 859710541 859737396 859721451 859694519 859676514 859665298
2035.8 859665298 859657593 859668198 859718704 859812775 859924545 860017548 860075302 860116730 860177383 860273132 860376053
2046.4 860376053 860423355 860363007 860196609 859986420 859813843 859726791 859721527 859765549 859834137 859917831 860002594
2057 860002594 860057449 860052795 859990387 859909439 859851913 859818954 859766159 859646301 859461823 859276581 859173584
2067.6 859173584 859198227 859328842 859501495 859654770 859759445 859814758 859826050 859789886 859698410 859555893
2077.3 859555893 859391479 859255753 859198380 859239731 859349594 859458618 859493942 859422989 859271164 859102783
2086.9 859102783 858987732 858971100 859065170 859247360 859458160 859617767 859659271 859570084 859405823 859256210
2096.6 859256210 859188766 859209824 859266129 859282990 859210587 859056244 858885269 858780594 858780594 858838425 858846893 858725510
2108.1 858725510 858489838 858239517 858070145 857998810 857977905 857973785 858015366 858150864 858366318 858565445
2117.8 858565445 858648529 858610001 858548965 858572540 858692627 858818588 858847656 858765793 858656769 858622589 858694000
2128.4 858694000 858811646 858884201 858858185 858744278 858587723 858427505 858286819 858190536 858173447 858259506
2138 858259506 858426056 858600998 858706131 858714371 858665009 858622284 858620758 858652954 858701401 858770142 858870010 858983002
2149.6 858983002 859057541 859057541 859014435 859013062 859113617 859279938 859397964 859370575 859205627 859009705 858901749
2160.2 858901749 858922043 859016571 859095154 859099884 859034653 858940048 858849792 858765182 858663177 858528137 858381271
2170.8 858381271 858277740 858270035 858361511 858492737 858574066 858544388 858408966 858234787 858108292 858089523 858183517
2181.4 858183517 858342896 858497467 858597794 858640366 858651199 858638916 858570023 858402939 858154144 857918625
2191.1 857918625 857810364 857866592 858021698 858173218 858277130 858368835 858497314 858651428 858763504 858780670
2200.7 858780670 858715057 858621826 858534393 858436050 858295898 858125839 857989807 857952652 858020935 858130264 858194580
2211.3 858194580 858169098 858078842 857990723 857952194 857954483 857943573 857870636 857730789 857560501 857397842 857256393
2221.9 857256393 857128296 857006836 856899261 856817932 856771545 856769257 856830444 856973724 857190552 857430649
2231.6 857430649 857620468 857706604 857686081 857603302 857516403 857459488 857421188 857351837 857201385 856960602 856681137
2242.2 856681137 856446609 856317291 856291733 856323318 856365967 856399536 856417923 856400681 856323013 856191864 856063080
2252.8 856063080 856005402 856036072 856103287 856133347 856102219 856054306 856052246 856112366 856188965 856224823 856206436 856172256
2264.4 856172256 856168747 856199493 856216888 856162491 856019135 855829239 855664139 855567474 855523224 855474091 855375519
2275 855375519 855237427 855118866 855083771 855158081 855321884 855532532 855745239 855918808 856016846 856022263 855956650
2285.6 855956650 855876923 855835800 855834503 855818405 855719986 855517273 855252533 855000534 854820023 854735718 854748840
2296.2 854748840 854849777 855007248 855157471 855224915 855169907 855020447 854842834 854681931 854528885 854355087
2305.8 854355087 854171982 854040222 854012070 854062958 854090500 853989792 853740005 853421936 853160019 853038712
2315.5 853038712 853053360 853123016 853141327 853030777 852774887 852418213 852044144 851746826 851601257 851628265
2325.1 851628265 851762085 851855698 851756973 851421356 850971603 850629425 850561600 850766678 851091843 851345673
2334.8 851345673 851390152 851168442 850710526 850162048 849783401 849824677 850321198 850990143 851388931 851250381
2344.4 851250381 850708237 850190659 850068588 850373154 850824203 851107178 851117859 850971222 850818176 850687180
2354.1 850687180 850498581 850187454 849778137 849324417 848806305 848121338 847211151 846199341 845386047
2362.7 845386047 845076752 845376587 846127701 847023315 847797699 848343735 848699875 848963165 849207993 849453735
2372.4 849453735 849669647 849808578 849847488 849818726 849798660 849857864 850007477 850192490 850333862 850384521
2382 850384521 850350571 850273743 850200577 850166397 850193710 850290985 850447235 850627670 850782089 850869904 850886002
2392.6 850886002 850867920 850877533 850957413 851102982 851260681 851358490 851345825 851212616 850992126 850744781 850536270
2403.2 850536270 850407257 850357590 850354385 850365448 850379944 850396500 850394363 850330582 850185165 850004501 849888229
2413.8 849888229 849916382 850083847 850305328 850483704 850575256 850597382 850593109 850596695 850630493 850712357 850844421
2424.5 850844421 850993576 851092224 851075211 850929031 850707855 850501556 850374603 850330048 850322723 850309525 850285339
2435.1 850285339 850273666 850284195 850284882 850226135 850092316 849927673 849802780 849755020 849760513 849766159 849744339 849714508
2446.6 849714508 849715576 849766541 849858017 849975586 850121155 850296783 850477676 850604095 850616379 850503387
2456.3 850503387 850316086 850131912 849992981 849878464 849732285 849524078 849287109 849093628 848999023 848997574
2465.9 848997574 849037094 849067764 849080734 849099350 849141235 849195938 849237366 849253235 849256287 849266663 849290466 849317245
2477.5 849317245 849337616 849352493 849367142 849374619 849358444 849311752 849253082 849215164 849215622 849238739 849246902 849212646
2489.1 849212646 849135971 849036102 848926697 848807144 848677444 848555374 848477402 848472443 848540421 848651962 848772049
2499.7 848772049 848880844 848968201 849017410 849000092 848897705 848727264 848538818 848377686 848248215 848120651
2509.3 848120651 847975082 847832794 847737045 847695541 847655029 847542496 847338028 847101364 846923294 846846390
2519 846846390 846838684 846837692 846815262 846792603 846802216 846847458 846900864 846936111 846948318 846946564 846936798 846918716 846891708
2531.5 846891708 846856308 846811600 846759949 846718597 846716232 846764755 846833725 846866379 846832809 846763382 846721420 846732712
2543.1 846732712 846750946 846696777 846536636 846319275 846133575 846036377 846015015 846015320 845994034 845947571 845894470
2553.7 845894470 845847931 845802002 845748138 845698624 845685120 845726929 845795212 845814362 845714417 845493851 845240326
2564.3 845240326 845079422 845092010 845262146 845488434 845640030 845618134 845397797 845042191 844678726 844434509
2573.9 844434509 844365234 844424133 844507599 844532394 844479980 844383316 844284134 844220810 844228592 844330826 844499664
2584.5 844499664 844639206 844632874 844426193 844073563 843699951 843418045 843274384 843253708 843312378 843397827
2594.2 843397827 843457489 843455582 843402252 843353500 843368835 843453751 843543854 843555222 843453674 843288879 843155441
2604.8 843155441 843119965 843168869 843224030 843212357 843134232 843069687 843113022 843288269 843515472 843662415 843634491
2615.4 843634491 843433609 843144836 842868881 842668152 842551193 842495728 842475739 842474136 842476273 842462616 842414627
2626 842414627 842333145 842253265 842233887 842314911 842475128 842632217 842694702 842628403 842476959 842322235 842221222
2636.6 842221222 842178040 842162094 842141266 842089844 841979446 841779480 841489258 841164703 840909271 840814056
2646.3 840814056 840893631 841071930 841228333 841275482 841209259 841099777 841032333 841044159 841095581 841095047 840964050
2656.9 840964050 840697784 840382996 840153580 840104446 840226440 840410461 840528030 840522232 840439072 840368805
2666.5 840368805 840357132 840365372 840319061 840194778 840057449 840014191 840121918 840336685 840543747 840638046 840582733
2677.1 840582733 840412674 840194092 839991684 839855881 839815979 839857941 839909744 839865494 839659653 839332047
2686.8 839332047 839020691 838868103 838919373 839099350 839284439 839390793 839400711 839325333 839165115 838925400
2696.4 838925400 838654861 838446808 838379059 838451767 838581848 838663330 838638458 838523560 838390045 838314896
2706 838314896 838338318 838437500 838532181 838531570 838395615 838169174 837951050 837823029 837795410 837817764 837831497
2716.6 837831497 837813644 837779388 837747726 837715836 837660141 837559128 837415237 837255325 837115707 837015228
2726.3 837015228 836944199 836865158 836733170 836520081 836236877 835941086 835716019 835626984 835673141 835779343
2735.9 835779343 835840530 835795746 835666885 835539322 835495377 835564575 835719223 835900345 836047363 836114120
2745.6 836114120 836082916 835974197 835836029 835715637 835634232 835592117 835595474 835662918 835796432 835945358 836021576
2756.2 836021576 835962143 835790558 835605850 835504074 835497894 835509109 835438843 835247803 834982452 834731903
2765.8 834731903 834565125 834501877 834526062 834609451 834715347 834792480 834784927 834668427 834482193 834310379 834218063
2776.4 834218063 834197845 834174347 834067841 833858337 833594742 833350906 833177490 833083115 833044434 833019409
2786.1 833019409 832956161 832811127 832583542 832332916 832154694 832112427 832184601 832276917 832288818 832179413
2795.7 832179413 831971970 831710510 831420593 831115875 830824890 830596085 830462799 830411301 830391922 830360565
2805.4 830360565 830305786 830233078 830135117 829989853 829785843 829538269 829273148 828998032 828700638 828375549
2815 828375549 828038330 827709198 827387543 827055817 826711960 826381454 826089020 825814285 825491562 825061951
2824.7 825061951 824524231 823932419 823334732 822724991 822048416 821251297 820318146 819259262 818076096
2833.3 818076096 816747818 815256042 813604660 811793289 809756699 807329025 804277039 800370102
2841.1 800370102 795423126 789298325 781935577 773480377 764449539 755762787 748505859 743505402
2848.8 743505402 740966110 740415268 740971375 741753845 742201004 742199249 742035828 742232819 743310318 745548782
2858.4 745548782 748867874 752888718 757142334 761264038 765046921 768358154 771034622 772872620
2866.1 772872620 773709641 773533707 772548904 771176147 769988098 769573059 770349045 772396698 775419693
2874.8 775419693 778879395 782234955 785141602 787497482 789350052 790764465 791759949 792333984 792518234
2883.5 792518234 792397614 792073441 791597900 790944366 790043488 788861771 787464676 785995483 784579163
2892.2 784579163 783223877 781808548 780171967 778222733 775982056 773536148 770967407 768335648
2899.9 768335648 765702744 763136902 760665436 758219681 755643921 752781372 749559631 745993500
2907.6 745993500 742101364 737819290 732995834 727477188 721208725 714267578 706824646 699097214
2915.3 699097214 691370697 684071579 677788620 673153229 670602875 670186539 671562805 674198151
2923 674198151 677605209 681452026 685511246 689567566 693416672 696951523 700226822 703410873 706656799
2931.7 706656799 710009689 713417282 716810303 720159302 723456192 726660767 729681091 732426605
2939.4 732426605 734884491 737149048 739353180 741544189 743591690 745211487 746084824 745981598 744784851
2948.1 744784851 742424774 738839264 734065094 728438568 722720642 717976074 715205078 714935303
2955.8 714935303 717040253 720879898 725649872 730705643 735713501 740620728 745536728 750597076
2963.5 750597076 755850067 761202087 766453781 771418686 776037903 780382843 784533768 788443756
2971.2 788443756 791925125 794778137 796949081 798572464 799876862 801049576 802178574 803281631
2979 803281631 804356995 805398254 806379471 807267380 808058853 808805771 809580307 810409393 811239777 811970444
2988.6 811970444 812521973 812877350 813075562 813178940 813259201 813395081 813649521 814023209 814426804 814718628
2998.2 814718628 814801102 814695282 814529724 814447021 814516449 814711838 814958572 815189285 815364685 815463943
3007.9 815463943 815474243 815397720 815261765 815118866 815029984 815038528 815146942 815309830 815455246 815523758 815503311
3018.5 815503311 815421982 815314789 815198212 815078506 814978027 814936371 814978867 815081100 815177078 815201035
3028.1 815201035 815131836 815008163 814912262 814929199 815094604 815350037 815554886 815574951 815397644 815166245
3037.8 815166245 815074844 815203171 815444412 815593643 815520020 815253830 814925537 814639587 814416504 814235611
3047.4 814235611 814104462 814064941 814136047 814271774 814379120 814382629 814271851 814095459 813915482 813756866
3057.1 813756866 813594131 813376999 813078308 812722626 812373581 812090302 811901245 811814346 811841278 811986618
3066.7 811986618 812206879 812402420 812478409 812435989 812383347 812430725 812558746 812601395 812382507 811880112
3076.4 811880112 811263123 810761566 810495453 810422134 810423660 810435028 810484924 810632248 810876770 811133423
3086 811133423 811286621 811274338 811137695 810994415 810957947 811052475 811197510 811277695 811244278 811157761 811123657
3096.6 811123657 811186829 811287231 811322403 811247253 811110916 811000824 810960159 810962296 810950470 810890503 810786743
3107.2 810786743 810666351 810555191 810461578 810365753 810220032 809980850 809655609 809323730 809098511 809051208
3116.9 809051208 809160080 809328079 809444885 809438782 809283829 808983917 808563156 808075256 807612915 807288895
3126.5 807288895 807183685 807287521 807484207 807608261 807547989 807322693 807060089 806890717 806849747 806868134
3136.1 806868134 806854706 806773758 806650543 806511841 806339722 806091156 805754318 805384369 805078354 804911652
3145.8 804911652 804880905 804898834 804844055 804641113 804311981 803954468 803663025 803458176 803288727 803096237
3155.4 803096237 802871628 802649918 802459717 802291641 802114182 801907730 801670074 801400833 801092377 800744095
3165.1 800744095 800377426 800027161 799721603 799473038 799284973 799148102 799026871 798859100 798593826 798235016
3174.7 798235016 797845383 797493210 797199554 796938248 796683960 796441803 796219635 795978622 795637131 795141830
3184.4 795141830 794535370 793940582 793464737 793118286 792819672 792481689 792085190 791681519 791334457 791072159
3194 791072159 790880203 790716324 790517349 790204620 789715271 789053192 788318329 787666321 787217484 786983871
3203.6 786983871 786871033 786751480 786547012 786264267 785964584 785705338 785495453 785292969 785041962 784712524
3213.3 784712524 784316711 783889847 783461227 783036194 782599869 782134781 781635361 781120987 780630569 780197830
3222.9 780197830 779812775 779412231 778919296 778315811 777676773 777115479 776688309 776349411 776007614 775624313
3232.6 775624313 775250702 774957428 774740601 774511185 774185028 773778152 773403091 773160858 773035736 772897110
3242.2 772897110 772608109 772136230 771568832 771030045 770587158 770226746 769896088 769549408 769152222 768670883
3251.9 768670883 768088684 767447205 766848984 766395950 766106339 765904388 765698318 765467834 765267181 765139618
3261.5 765139618 765044327 764878464 764571457 764153671 763726120 763372803 763098679 762846451 762555695 762209396
3271.2 762209396 761829681 761449203 761088333 760749664 760424500 760096436 759741898 759335098 758862839 758343582
3280.8 758343582 757832336 757399597 757086487 756871948 756677628 756419373 756069717 755676880 755325012 755055466
3290.4 755055466 754824219 754530106 754098587 753546371 752966461 752444534 751983032 751507263 750941391 750278397
3300.1 750278397 749573822 748883743 748217468 747550583 746870804 746192245 745523758 744841919 744112778 743340454
3309.7 743340454 742577744 741872940 741207886 740502090 739693451 738820267 738012924 737396545 736984177 736658707
3319.4 736658707 736255264 735666885 734893265 734005051 733073730 732124557 731138992 730089111 728969650
3328.1 728969650 727812500 726676865 725621948 724676208 723824615 723024292 722234802 721430435 720589371
3336.7 720589371 719679794 718672333 717570801 716419983 715271835 714141617 713000946 711819458
3344.4 711819458 710606155 709404678 708250046 707137299 706036224 704922562 703788452 702623672
3352.2 702623672 701409454 700141449 698857269 697622604 696475296 695383224 694262314 693043594
3359.9 693043594 691722260 690346451 688963242 687580719 686179962 684757614 683346100 681989822
3367.6 681989822 680702133 679454193 678211136 676980209 675819626 674783859 673854828 672924805 671863174
3376.3 671863174 670617294 669258270 667930450 666749268 665736542 664841232 663997269 663162689 662305298
3384.9 662305298 661387787 660388412 659338226 658322601 657420731 656642303 655921249 655179977 654393158
3393.6 654393158 653597031 652840805 652143936 651492157 650864944 650257263 649673691 649112396 648553543 647959061
3403.3 647959061 647285767 646507492 645640640 644742355 643880768 643092499 642372971 641705627 641093445 640557556
3412.9 640557556 640097733 639672012 639211540 638665161 638027344 637337189 636662521 636078491 635641823 635361938
3422.6 635361938 635191727 635060310 634918938 634759216 634581261 634365540 634090576 633781433 633518486 633371429
3432.2 633371429 633319016 633250504 633061600 632753334 632431908 632210197 632116280 632094116 632083321 632078667 632116928
3442.8 632116928 632221756 632376518 632551537 632739220 632958145 633226929 633549576 633926697 634366951 634875259
3452.5 634875259 635422897 635941086 636354179 636628571 636791878 636907272 637030907 637185860 637372742 637596092
3462.1 637596092 637879601 638253784 638725777 639260826 639794388 640276413 640704651 641119385 641560822 642033615
3471.7 642033615 642512512 642984390 643477783 644038239 644673386 645317230 645860214 646223373 646427231 646594467
3481.4 646594467 646880569 647373352 648028793 648700104 649244995 649633026 649959869 650346985 650826797 651321564
3491 651321564 651743011 652105408 652525177 653105392 653829422 654581985 655269547 655902939 656550369 657225342
3500.7 657225342 657856140 658378677 658841324 659379959 660081024 660876694 661608429 662189255 662694092 663278046
3510.3 663278046 664018707 664847870 665628204 666270981 666775513 667187042 667563553 667990875 668585510 669428558
3520 669428558 670478058 671568604 672526245 673293304 673936386 674538574 675107803 675597610 676006241 676429367
3529.6 676429367 676998672 677771683 678682785 679600601 680429230 681162109 681857147 682567444 683305588 684060364
3539.2 684060364 684841232 685677185 686566010 687426453 688134995 688643646 689062653 689608307 690429840 691473007
3548.9 691473007 692513199 693332520 693888168 694326477 694857941 695609436 696557465 697561417 698452454
3557.6 698452454 699128418 699619446 700083466 700714493 701612396 702695847 703743286 704536362 705015182
3566.2 705015182 705337067 705784836 706593857 707804184 709252472 710694580 711961288 713028030 713963013
3574.9 713963013 714844208 715727615 716668320 717725525 718921051 720204163 721479416 722672882 723743439
3583.6 723743439 724633865 725250092 725554123 725700226 726038971 726915436 728401031 730208130 731880722
3592.3 731880722 733109894 733912277 734552917 735312424 736298981 737428589 738535461 739506226 740349426
3601 740349426 741181793 742146683 743306503 744571838 745734787 746629181 747296906 747994919 748978195
3609.6 748978195 750240021 751489029 752440643 753144913 753977280 755251236 756845398 758264160 759092331
3618.3 759092331 759370041 759511948 759918442 760727386 761903534 763395767 765063324 766492233 767098083
3627 767098083 766613770 765500031 764746780 765144119 766681137 768640671 770249481 771232071 771822128
3635.7 771822128 772370758 773030624 773756180 774486008 775241776 776072845 776966324 777840347 778611755 779236755
3645.3 779236755 779676971 779835510 779586639 778941650 778220596 777982178 778638153 780037689 781467590
3654 781467590 782181702 782019196 781512756 781382294 781928940 782901382 783849030 784516602 784933243 785284119
3663.6 785284119 785778503 786526642 787350006 787712021 787073898 785541077 784091415 783876648 785095062
3672.3 785095062 786628036 786994858 785768661 783993454 783170166 783878174 785415497 786665955 787146149
3681 787146149 787211685 787457047 788117905 789012604 789833984 790349960 790411377 789965134 789158783 788361664
3690.6 788361664 787970734 788145218 788726730 789415436 790011826 790512848 791013489 791535950 791939468 792003174
3700.3 792003174 791639481 791055222 790678329 790852356 791564255 792461853 793130951 793335800 793025436 792226868
3709.9 792226868 791054611 789826126 789028625 789022064 789735565 790700226 791425400 791736908 791773834 791728592
3719.6 791728592 791664581 791560440 791422348 791291504 791177139 791068726 791030273 791223526 791760864 792525101
3729.2 792525101 793159409 793267059 792657318 791455917 790029068 788802109 788082657 787981262 788454971
3737.9 788454971 789400558 790663605 791929855 792678375 792411957 791112747 789479980 788566437 788971863
3746.6 788971863 790292435 791401138 791371841 790219727 788808746 788088684 788410645 789459915 790662537
3755.3 790662537 791561890 791914597 791665115 790995712 790343323 790176392 790616913 791300659 791694641 791585770
3764.9 791585770 791225967 790992889 790972290 790920944 790607529 790100174 789694138 789622116 789896469 790392456
3774.5 790392456 790974045 791493683 791747360 791564713 790993958 790353546 790019760 790127335 790477219 790742493
3784.2 790742493 790762405 790640335 790572739 790609894 790612259 790452271 790233688 790239029 790599136 791048050 791117706
3794.8 791117706 790649948 790042038 789839706 790057220 790044785 789189072 787723160 786661987 786815720
3803.5 786815720 787933350 788945541 789040298 788390198 787817307 787923355 788676224 789702301 790663528
3812.2 790663528 791239853 791024017 789817429 788101654 786911087 786926880 787699814 788003235 787097855
3820.8 787097855 785552521 784684525 785218735 786628799 787802124 788185501 788143234 788294296 788739166
3829.5 788739166 789060364 788952026 788634109 788569260 788875656 789138794 788825455 787822342 786553421
3838.2 786553421 785607300 785280075 785436172 785736694 785949097 786066055 786204224 786460648 786884155 787509613
3847.8 787509613 788301163 788980560 788971710 787704315 785169601 782229919 780238113 780134201 781757050
3856.5 781757050 784007416 785730362 786500626 786638336 786599808 786490479 786189270 785793991 785717850 786238174
3866.2 786238174 787035980 787353745 786713257 785439529 784390717 784148712 784531174 784921799 785009384
3874.8 785009384 785079117 785542374 786302872 786742706 786398239 785546494 784988861 785218430 785885086 786168137
3884.5 786168137 785658569 784789276 784356842 784676361 785272064 785393829 784772110 783853607 783363113 783686371
3894.1 783686371 784618759 785589600 786073990 785885773 785211563 784423752 783793793 783323288 782832794 782244644
3903.8 782244644 781760712 781720657 782269974 783187561 784056320 784588699 784783936 784818649 784846344 784903107
3913.4 784903107 784930038 784829788 784523392 784021530 783469086 783079376 782977524 783096085 783230896 783204880
3923.1 783204880 782986984 782694855 782510834 782569809 782848587 783128281 783108521 782646027 781914062 781307068
3932.7 781307068 781148529 781476135 782076797 782686920 783144684 783400955 783469086 783380356 783159027 782813034
3942.3 782813034 782371445 781939545 781664505 781599121 781613846 781513824 781251144 780971527 780823135 780780945
3952 780780945 780719070 780601120 780501251 780432205 780273819 779943390 779553070 779287796 779156799 779005737
3961.6 779005737 778787537 778679504 778823929 779069672 779134064 778989029 778887100 778952179 778943634 778584900
3971.3 778584900 777989578 777517242 777246704 776878891 776259995 775706024 775539856 775506058 775049591 774165573
3980.9 774165573 773491440 773336639 773079300 772037582 770644073 769949722 769862671 768859558 766177444
3989.6 766177444 763479843 762817917 762974091 759953537 752688828 746372070 745584564 741479492 708549423
3998.3 708549423 620774536 476476707
4000.2 476476707
##END=$$ End of the data block
