##TITLE=Amostra $$ Begin of the data block
##JCAMP-DX=5.00 $$ ACD/SpecManager v 10.08
##SPECTROMETER/DATA SYSTEM=Alpha
##DATE=16 Oct 2014 11:56:34
##DATA TYPE=INFRARED SPECTRUM
##DATA CLASS=XYDATA
##ORIGIN=
##OWNER=
##NPOINTS=1667
##FIRSTX=599.64648438
##LASTX=3997.64306641
##MAXX=3997.64306641
##MINX=599.64648438
##MAXY=1.00105858
##MINY=0.16588141
##XFACTOR=1.0000000000
##YFACTOR=0.000000010000000
##FIRSTY=1.00000000
##DELTAX=2.03961372
##XUNITS=1/CM
##YUNITS=ARBITRARY UNITS
##XYDATA=(X++(Y..Y))
$$ plain form
599.6 100000000 100014436 99978614 99902672 99859190 99844372 99828470 99801034 99762148 99729633 99693763 99622387 99517715
624.1 99517715 99413037 99318802 99250245 99228960 99238491 99255395 99276668 99312443 99355274 99393731 99431258 99474150
648.6 99474150 99520832 99544746 99534649 99541813 99578470 99583471 99542928 99478018 99379784 99332207 99377155 99377841 99343586
675.1 99343586 99328452 99308485 99270713 99221969 99142194 99013627 98868483 98763818 98720765 98677480 98599356
697.5 98599356 98506546 98372436 98152083 97839499 97425771 96870708 96044677 94455546 91096556 86784369
717.9 86784369 85583383 88527900 91253251 90872502 88582981 88293856 91797543 95864183 97915828
736.3 97915828 98607767 98882997 99032605 99126792 99185395 99229181 99257874 99250621 99204695 99155456 99138647
758.7 99138647 99150413 99161541 99160397 99158537 99161410 99170870 99190336 99208391 99200934 99176282 99174869 99208093 99246114
$$ packed form
599.6A00000000J4436l5822p5942m3482j4818j5902k7436l8886l2515l5870p1376j04672
624.1I9517715j04678r4235o8557k1285R531J6904K1273L5775M2831L8457L7527M2892
648.6I9474150M6682K3914j0097P164L6657N001m0543o4910r8234m7577M4948O86l4255
675.1I9343586j5134j9967l7772m8744p9775j28567j45144j04665m3053m3285p8124
697.5I8599356r2810j34110k20353l12584m13728n55063q26031j589131l358990m312187
717.9H6784369j200986K944517K725351l80749k289521k89125L503687M066640K051645
736.3I7915828O91939K75230J49608R4187N8603M3786K8693p253m5926m9239j6809
758.7I9138647J1766J1128j144j860K873R460J9466J8055p457k4652j413L3224L8021
$$ plain form
785.3 99246114 99262774 99269754 99269921 99262041 99252933 99233830 99210393 99189097 99157643 99124688 99108934 99088377 99055523
811.8 99055523 99029827 99009615 98991781 98976886 98965937 98956245 98938411 98915458 98897481 98871768 98824012 98781884
836.2 98781884 98770559 98765284 98749232 98737460 98727959 98707098 98680711 98650658 98609537 98570651 98538911 98499388
860.7 98499388 98454839 98409188 98346227 98269868 98191875 98095888 97969210 97805184 97581440 97265917 96868664
883.2 96868664 96490067 96278465 96301818 96463197 96578294 96497744 96140504 95441884 94269979 92434424
903.5 92434424 90017021 87920123 87578434 89412880 92223722 94619262 96147007 97000444 97469288
921.9 97469288 97744721 97913980 98014182 98074639 98109680 98120672 98112887 98089087 98047340 98002118 97963756
944.3 97963756 97922355 97879958 97836757 97765267 97633761 97411519 97056556 96591324 96184492 96043450 96212298
$$ packed form
785.3I9246114J6660O980J67p880r108j9103k3437k1296l1454l2955j5754k0557l2854
811.8I9055523k5696k0212j7834j4895j0949r692j7834k2953j7977k5713m7756m2128
836.2I8781884j1325n275j6052j1772r501k0861k6387l0053m1121l8886l1740l9523
860.7I8499388m4549m5651o2961p6359p7993r5987j26678j64026k23744l15523l97253
883.2I6868664l78597k11602K3353J61379J15097q0550l57240o98620j171905j835555
903.5I2434424k417403k096898l41689J834446K810842K395540J527745Q53437M68844
921.9I7469288K75433J69259J00202O0457L5041J0992p785k3800m1747m5222l8362
944.3I7963756m1401m2397m3201p1490j31506k22242l54963m65232m06832j41042J68848
$$ plain form
966.8 96212298 96541345 96849322 97057062 97157562 97147405 97025555 96789920 96395540 95779192 95004839
987.2 95004839 94358152 94169372 94498456 95122606 95795834 96383351 96838850 97165221 97376543 97492522
1007.6 97492522 97552532 97590011 97620738 97643375 97648960 97645068 97634733 97605753 97569919 97552884 97549826 97542489
1032 97542489 97527540 97511601 97500628 97489411 97466421 97434014 97402781 97380054 97366071 97346604 97312844 97270221
1056.5 97270221 97225797 97182935 97146857 97121447 97095186 97057825 97019875 96989906 96955556 96916640 96892655 96888930
1081 96888930 96900254 96922284 96938944 96941215 96943033 96944332 96936244 96924114 96908504 96891940 96878850 96861035 96838099
1107.5 96838099 96816522 96797699 96790987 96796638 96797252 96788973 96778363 96761477 96733254 96704185 96691567 96695793 96701121
1134 96701121 96699846 96692055 96675062 96652490 96629572 96603310 96574104 96546632 96520823 96493065 96459508 96428883
$$ packed form
966.8I6212298L29047L07977K07740J00500j0157j21850k35635l94380o16348p74353
987.2I5004839o46687j88780L29084O24150O73228N87517M55499L26371K11322J15979
1007.6I7492522O0010L7479L0727K2637N585l892j0335k8980l5834j7035l058p337
1032I7542489j4949j5939j0973j1217k2990l2407l1233k2727j3983j9467l3760m2623
1056.5I7270221m4424m2862l6078k5410k6261l7361l7950k9969l4350l8916k3985l725
1081I6888930J1324K2030J6660K271J818J299q088j2130j5610j6564j3090j7815k2936
1107.5I6838099k1577j8823o712N651O14q279j0610j6886k8223k9069j2618M226N328
1134I6701121j275p791j6993k2572k2918k6262k9206k7472k5809k7758l3557l0625
$$ plain form
1158.5 96428883 96408421 96385229 96356350 96333158 96320337 96315283 96312773 96308076 96294743 96275634 96265203 96265912 96267295
1185 96267295 96263397 96259612 96263230 96271825 96277070 96273047 96262181 96244889 96220720 96199381 96184880 96174484 96169060
1211.5 96169060 96167219 96166366 96157652 96128851 96090090 96060139 96041244 96024114 95997494 95964003 95935374 95909017
1236 95909017 95882457 95858419 95830953 95801634 95775634 95748889 95719862 95687962 95648342 95604187 95564777 95537990
1260.5 95537990 95524210 95503336 95460945 95412958 95381105 95364469 95344788 95313847 95278752 95239866 95192057 95134509
1285 95134509 95072651 95016944 94967091 94913995 94853628 94796586 94756484 94735801 94734567 94755179 94789845 94823819
1309.4 94823819 94851780 94882345 94915730 94942200 94979328 95028043 95061737 95071077 95055389 95019293 94963151 94863516
1333.9 94863516 94694078 94486856 94343984 94299930 94258857 94163567 94038594 93927753 93861347 93839437 93829578
$$ packed form
1158.5I6428883k0462k3192k8879k3192j2821n054k510m697j3333j9109j0431P09J383
1185I6267295l898l785L618Q595N245m023j0866j7292k4169k1339j4501j0396n424
1211.5I6169060j841q53q714k8801l8761k9951j8895j7130k6620l3491k8629k6357
1236I5909017k6560k4038k7466k9319k6000k6745k9027l1900l9620m4155l9410k6787
1260.5I5537990j3780k0874m2391m7987l1853j6636j9681l0941l5095l8886m7809n7548
1285I5134509o1858n5707m9853n3096o0367n7042m0102k0683j234K0612L4666L3974
1309.4I4823819K7961L0565L3385K6470L7128M8715L3694R340j5688l6096n6142r9635
1333.9I4863516j69438k07222j42872m4054m1073r5290j24973j10841o6406k1910r859
$$ plain form
1356.4 93829578 93757021 93577647 93369424 93244833 93141067 92987007 92783731 92434490 91933906 91617775
1376.7 91617775 91857302 92632705 93483287 94011164 94252831 94394141 94444996 94351012 94202381 94117451
1397.1 94117451 94083554 94065094 93985695 93844628 93706089 93522608 93268716 93036252 92862862 92713350
1417.5 92713350 92649698 92638785 92495817 92194229 91751093 91153949 90531069 89926267 89293981 88850725
1437.9 88850725 88645744 88408667 88046151 87541121 86849946 85944152 84729904 83182442 80915642
1456.3 80915642 76943791 72199982 69760472 72141361 76646227 78262943 76712185 76236326 81951571
1474.7 81951571 89270258 93179673 94478905 94919169 95053023 94970626 94853157 94939291 95100474 95085239
1495.1 95085239 94991374 95049125 95167339 95111942 94746578 94429356 94651431 94933981 94997275 94883913
$$ packed form
1356.4I3829578p2557j79374k08223j24591j03766j54060k03276l49241n00584l16131
1376.7I1617775K39527P75403Q50582N27877K41667J41310N0855r3984j48631q4930
1397.1I4117451l3897j8460p9399j41067j38539j83481k53892k32464j73390j49512
1417.5I2713350o3652j0913j42968l01588m43136n97144o22880o04802o32286m43256
1437.9H8850725k04981k37077l62516n05030o91175r05794j214248j547462k266800
1456.3H0915642l971851m743809k439510K380889M504866J616716j550758m75859N715245
1474.7H1951571P318687L909415J299232M40264J33854q2397j17469Q6134J61183j5235
1495.1I5085239r3865N7751J18214n5397l65364l17222K22075K82550O3294j13362
$$ plain form
1515.4 94883913 94747943 94637567 94548708 94611329 94724649 94815761 94867444 94778836 94659251 94621128 94420010
1537.9 94420010 94027299 93984568 94259757 94515103 94616419 94594866 94542265 94413483 94124919 93759447
1558.3 93759447 93904936 94293803 94436365 94391203 94268149 94214761 94238138 94148153 94046658 94140357 94244629
1580.7 94244629 94259197 94233632 94188476 94119084 94035071 93945390 93873787 93849796 93848783 93825036 93775016 93711078
1605.2 93711078 93635786 93586111 93574280 93513083 93345189 93230617 93252355 93200499 93089366 93062079 93060130
1627.6 93060130 93038368 92922908 92512983 91746628 91013414 90552253 90493983 90885848 91490805 92091936
1648 92091936 92417997 92381942 92469412 92882085 93133867 93144214 93064916 93073040 93065315 92921889 92848593 92931825
1672.5 92931825 93003720 93095708 93181992 93126816 92925459 92892087 93178558 93422014 93547589 93546551 93368727
$$ packed form
1515.4I4883913j35970j10376q8859O2621J13320R1112N1683q8608j19585l8123k01118
1537.9I4420010l92711m2731K75189K55346J01316k1553n2601j28782k88564l65472
1558.3I3759447J45489L88867J42562m5162j23054n3388K3377q9985j01495R3699J04272
1580.7I4244629J4568k5565m5156o9392q4013q9681p1603k3991j013k3747n0020o3938
1605.2I3711078p5292m9675j1831o1197j67894j14572K1738n1856j11133k7287j949
1627.6I3060130k1762j15460m09925p66355p33214m61161n8270L91865O04957O01131
1648I2091936L26061l6055Q7470M12673K51782J0347p9298Q124p725j43426p3296Q3232
1672.5I2931825P1895R1988Q6284n5176k01357l3372K86471K43456J25575j038j77824
$$ plain form
1694.9 93368727 93147075 93018591 93052226 93185818 93223357 93235916 93270415 93205583 92995280 92703527 92549628
1717.4 92549628 92736739 93064266 93395054 93735200 93982476 94056183 93980914 93872947 93939543 94041365
1737.8 94041365 94064897 94128859 94245082 94332945 94370788 94447261 94645000 94829547 94898719 94920659 94924945
1760.2 94924945 94939327 95005310 95011914 94913697 94785166 94746971 94871432 95005661 95039618 95025122 95029801
1782.6 95029801 95044965 95058727 95017791 94892758 94839865 94931179 94998121 94980413 94969314 95022130 95068848
1805.1 95068848 95046985 94977993 94932663 94936073 94925851 94878727 94836748 94806343 94761050 94730455 94730675 94753611
1829.6 94753611 94855303 94977313 95031875 95052087 95053220 94980055 94875425 94888783 94985503 95053440 95073873
1852 95073873 95071429 95067024 95058119 95047134 95035255 94989246 94876015 94775361 94819748 94933981 94986016 94983655
$$ packed form
1694.9I3368727k21652j28484L3635J33592L7539J2559L4499o4832k10303k91753j53899
1717.4I2549628J87111L27527L30788L40146K47276P3707p5269j07967O6596J01822
1737.8I4041365K3532O3962J16223Q7863L7843P6473J97739J84547O9172K1940M286
1760.2I4924945J4382O5983O604r8217j28531l8195J24461J34229L3957j4496M679
1782.6I5029801J5164J3762m0936j25033n2893R1314O6942j7708j1099N2816M6718
1805.1I5068848k1863o8992m5330L410j0222m7124m1979l0405m5293l0595K20K2936
1829.6I4753611J01692J22010N4562K0212J133p3165j04630J3358R6720O7937K0433
1852I5073873k444m405q905j0985j1879m6009j13231j00654M4387J14233N2035k361
$$ plain form
1876.5 94983655 94969350 94949281 94922763 94892222 94842488 94772321 94738531 94738436 94732124 94746560 94775242 94787121
1900.9 94787121 94795871 94800836 94785416 94773924 94795442 94823903 94811004 94766384 94749999 94760931 94781655 94819856
1925.4 94819856 94843990 94843948 94841123 94840366 94839108 94832653 94803864 94751549 94733387 94770271 94808453 94819754 94813800
1951.9 94813800 94802976 94796413 94794846 94784492 94765371 94741547 94712859 94706023 94727564 94745529 94748175 94740820 94727522
1978.5 94727522 94722974 94731694 94734085 94715923 94683403 94653243 94649768 94673777 94693100 94697577 94699460 94700068 94694358
2005 94694358 94682920 94669753 94651467 94618815 94573778 94544542 94549114 94563568 94571495 94577599 94581884 94583815 94585848
2031.5 94585848 94585282 94579768 94575483 94571298 94568437 94571877 94570893 94564617 94564396 94567883 94569874 94572479 94576484 94576836 94562626
2062.1 94562626 94540071 94533759 94540745 94541132 94537067 94536167 94531167 94521016 94516492 94516551 94514251 94509596 94507009 94510877 94513834
$$ packed form
1876.5I4983655j4305k0069k6518l0541m9734p0167l3790r5o312J4436K8682J1879
1900.9I4787121Q750M965j5420j1492K1518K8461j2899m4620j6385J0932K0724L8201
1925.4I4819856K4134m2k825p57j258o455k8789n2315j8162L6884L8182J1301n954
1951.9I4813800j0824o563j567j0354j9121k3824k8688o836K1541J7965K646p355j3298
1978.5I4727522m548Q720K391j8162l2520l0160l475K4009J9323M477J883O08n710
2005I4694358j1438j3167j8286l2652m5037k9236M572J4454P927O104M285J931K033
2031.5I4585848n66n514m285m185k861L440r84o276k21L487J991K605M005L52j4210
2062.1I4562626k2555o312O986L87m065r00n000j0151m524N9k300m655k587L868K957
$$ plain form
2092.7 94513834 94504088 94490629 94486797 94487399 94486129 94485956 94484377 94475597 94467974 94465572 94461066 94453239 94447166 94447327 94447851
2123.3 94447851 94440860 94427907 94415092 94406855 94399047 94387400 94375217 94362366 94348580 94336814 94327801 94323099 94322616
2149.8 94322616 94324046 94322878 94318444 94316798 94319546 94327778 94340503 94346064 94339335 94329977 94326884 94328398 94324565 94315904
2178.3 94315904 94308668 94302952 94299209 94294888 94290018 94286102 94280189 94274747 94278651 94290817 94296092 94291741 94289291 94286197
2206.9 94286197 94278669 94277835 94284570 94288570 94284505 94271934 94259608 94256657 94259250 94261122 94261664 94259721 94251150 94233817
2235.4 94233817 94211400 94192022 94182277 94176513 94168663 94165623 94165754 94159716 94150764 94143748 94137049 94131643 94129527 94128597
2264 94128597 94121766 94101655 94075924 94061983 94062918 94068658 94067633 94051790 94027174 94008005 93996638 93986750 93975317
2290.5 93975317 93962771 93952549 93939811 93914729 93881154 93841815 93793333 93743306 93699652 93664855 93643183 93623477
$$ packed form
2092.7I4513834r746j3459l832O02j270j73j579q780p623k402m506p827o073J61N24
2123.3I4447851o991j2953j2815q237p808j1647j2183j2851j3786j1766r013m702m83
2149.8I4322616J430j168m434j646K748Q232J2725N561o729r358l093J514l833q661
2178.3I4315904p236n716l743m321m870l916n913n442L904J2166N275m351k450l094
2206.9I4286197p528q34O735M000m065j2571j2326k951K593J872N42j943q571j7333
2235.4I4233817k2417j9378r745n764p850l040J31o038q952p016o699n406k116r30
2264I4128597o831k0111k5731j3941R35N740j025j5843k4616j9169j1367r888j1433
2290.5I3975317j2546j0222j2738k5082l3575l9339m8482n0027m3654l4797k1672j9706
$$ plain form
2315 93623477 93580830 93508285 93428344 93371457 93338966 93302345 93259430 93244648 93252659 93246722 93231046 93228972 93239486
2341.5 93239486 93258846 93307686 93363106 93368757 93315095 93241346 93191153 93168312 93180496 93234318 93294060 93342716
2366 93342716 93395317 93458754 93535084 93614978 93687135 93758124 93836564 93907940 93954837 93983358 94000614 94005007
2390.4 94005007 93998671 93987715 93980378 93978626 93975145 93967128 93961626 93955922 93944097 93932498 93921703 93910033 93906641
2417 93906641 93910992 93914723 93924183 93936342 93940395 93940753 93936986 93928063 93921250 93919587 93920469 93919730 93916839 93911666 93903142
2447.6 93903142 93896770 93893564 93888938 93884796 93879229 93874168 93872184 93866074 93858075 93845022 93818057 93791401 93778622
2474.1 93778622 93772948 93771243 93773091 93769068 93760037 93754619 93745959 93727922 93712574 93704009 93696964 93695432 93698978 93699181
2502.6 93699181 93685073 93660599 93646747 93647277 93650711 93640292 93607789 93573707 93555337 93543833 93530244 93513876
$$ packed form
2315I3623477m2647p2545p9941n6887l2491l6621m2915j4782Q011n937j5676k074J0514
2341.5I3239486J9360M8840N5420N651n3662p3749n0193k2841J2184N3822N9742M8656
2366I3342716N2601O3437P6330P9894P2157P0989P8440P1376M6897K8521J7256M393
2390.4I4005007o336j0956p337j752l481q017n502n704j1825j1599j0795j1670l392
2417I3906641M351L731R460J2159M053L58l767q923o813j663Q82p39k891n173q524
2447.6I3903142o372l206m626m142n567n061j984o110p999j3053k6965k6656j2779
2474.1I3778622n674j705J848m023r031n418q660j8037j5348q565p045j532L546K03
2502.6I3699181j4108k4474j3852N30L434j0419l2503l4082j8370j1504j3589j6368
$$ plain form
2527.1 93513876 93492258 93472254 93459338 93446654 93434048 93420005 93396837 93360794 93318266 93280917 93250149 93229133
2551.6 93229133 93218291 93209434 93201798 93193239 93179619 93158919 93132812 93108970 93088102 93066078 93039268 93009597
2576 93009597 92983109 92955047 92919636 92885959 92858744 92824548 92779708 92736256 92697901 92663026 92635232 92616582
2600.5 92616582 92600685 92571580 92525536 92484850 92458886 92431849 92391860 92341727 92288965 92234373 92177916 92120916
2625 92120916 92060804 91996521 91935515 91893125 91879499 91885430 91894025 91898882 91899991 91897136 91893899 91888016 91869670
2651.5 91869670 91843545 91818833 91797870 91782367 91769141 91761404 91766822 91772121 91765511 91765141 91776180 91783965 91793591
2678 91793591 91809326 91823894 91836059 91839260 91827607 91810358 91795808 91785121 91772193 91744292 91701514 91651660
2702.5 91651660 91599268 91547644 91493917 91433108 91365051 91301787 91249651 91196567 91130978 91049856 90964353 90894485
$$ packed form
2527.1I3513876k1618k0004j2916j2684j2606j4043k3168l6043m2528l7349l0768k1016
2551.6I3229133j0842q857p636q559j3620k0700k6107k3842k0868k2024k6810k9671
2576I3009597k6488k8062l5411l3677k7215l4196m4840m3452l8355l4875k7794j8650
2600.5I2616582j5897k9105m6044m0686k5964k7037l9989n0133n2762n4592n6457n7000
2625I2120916o0112o4283o1006m2390j3626N931Q595M857J109k855l237n883j8346
2651.5I1869670k6125k4712k0963j5503j3226p737N418N299o610l70J1039P785R626
2678I1793591J5735J4568J2165L201j1653j7249j4550j0687j2928k7901m2778m9854
2702.5I1651660n2392n1624n3727o0809o8057o3264n2136n3084o5589q1122q5503o9868
$$ plain form
2727 90894485 90846252 90807283 90767831 90725344 90688139 90665984 90646875 90620834 90585446 90538824 90489197 90438408
2751.4 90438408 90374058 90293050 90202564 90107977 90014464 89913768 89801478 89685446 89559114 89411759 89245951
2773.9 89245951 89077747 88909745 88720757 88508910 88289958 88053602 87786579 87502831 87214303 86916858
2794.3 86916858 86608833 86293739 85971147 85638434 85289305 84911096 84503204 84070081 83581960 83010983
2814.7 83010983 82369941 81657219 80847037 79927415 78884852 77677673 76235884 74471503 72276711
2833 72276711 69491386 65875787 61024308 54293567 45243451 34863412 26459935 23767574 27315032
2851.4 27315032 34229818 41690353 48692793 55016881 60372508 64455748 67111307 68426311
2867.7 68426311 68765426 68621427 68306124 67792457 66896242 65529293 63763601 61749661 59624130
$$ packed form
2727I0894485m8233l8969l9452m2487l7205k2155j9109k6041l5388m6622m9627n0789
2751.4I0438408o4350q1008r0486r4587r3513j00696j12290j16032j26332j47355j65808
2773.9H9245951j68204j68002j88988k11847k18952k36356k67023k83748k88528k97445
2794.3H6916858l08025l15094l22592l32713l49129l78209m07892m33123m88121n70977
2814.7H3010983o41042p12722q10182r19622j042563j207179j441789j764381k194792
2833G2276711k785325l615599m851479o730741r050116j0380039q403477k692361L547458
2851.4B7315032O914786P460535P002440O324088N355627M083240K655559J315004
2867.7F8426311L39115j43999l15303n13667q96215j366949j765692k013940k125531
$$ plain form
2886.1 59624130 57483894 55386978 53362322 51427907 49562281 47702992 45798719 43749166
2902.4 43749166 41330701 38259760 34280527 29315051 23824959 19098635 16588141 16642632 18486457
2920.7 18486457 21328403 24816561 28873411 33514452 38677281 44249988 50087607 55951971
2937 55951971 61561638 66615689 70783001 73767257 75370008 75628477 74984396 74174315 73851830
2955.4 73851830 74329215 75597674 77491313 79817402 82363576 84872216 87096041 88878900 90199965
2973.8 90199965 91181588 92011976 92822540 93630248 94370228 94967347 95383996 95622194 95716929 95732766
2994.2 95732766 95730680 95756781 95838565 95946115 96045953 96154600 96265984 96348011 96409649 96478385 96555936
3016.6 96555936 96627527 96683466 96722418 96757853 96803510 96843964 96871364 96899229 96941751 96998817 97037166 97046691
$$ packed form
2886.1E9624130k140236k096916k024656j934415j865626j859289j904273k049553
2902.4D3749166k418465l070941l979233m965476n490092m726324k510494N4491J843825
2920.7A8486457K841946L488158M056850M641041N162829N572707N837619N864364
2937E5951971N609667N054051M167312K984256J602751K58469o44081q10081l22485
2955.4G3851830M77385J268459J893639K326089K546174K508640K223825J782859J321065
2973.8I0199965R81623Q30388Q10564Q07708P39980N97119M16649K38198R4735J5837
2994.2I5732766k086K6101Q1784J07550R9838J08647J11384Q2027O1638O8736P7551
3016.6I6555936P1591N5939L8952L5435M5657M0454K7400K7865M2522N7066L8349R525
$$ plain form
3041.1 97046691 97060949 97090989 97108787 97091752 97044271 96969342 96862340 96736217 96601295 96449155 96292973
3063.5 96292973 96162206 96051395 95900595 95666766 95402122 95216680 95207006 95401758 95734334 96095014
3083.9 96095014 96429908 96725774 96962923 97155356 97317463 97429842 97494203 97549069 97611982 97658622
3104.3 97658622 97665411 97643006 97632563 97631061 97596443 97552460 97541183 97561932 97609055 97657192 97666633 97643292
3128.8 97643292 97632003 97636449 97622991 97585917 97545606 97532851 97546107 97549695 97535092 97499859 97439414 97399867
3153.2 97399867 97415864 97437179 97422731 97394246 97367239 97343653 97325969 97310084 97298008 97283977 97256738 97221720
3177.7 97221720 97193742 97180235 97172469 97158760 97133017 97103757 97091424 97090960 97078425 97055221 97037172 97024971
3202.2 97024971 97020233 97026432 97028971 97022235 97022945 97036326 97042227 97023541 97003460 97007126 97021407 97029883 97026223 97003984
$$ packed form
3041.1I7046691J4258L0040J7798j7035m7481p4929j07002j26123j34922j52140j56182
3063.5I6292973j30767j10811j50800k33829k64644j85442r674J94752L32576L60680
3083.9I6095014L34894K95866K37149J92433J62107J12379O4361N4866O2913M6640
3104.3I7658622O789k2405j0443j502l4618m3983j1277K0749M7123M8137R441k3341
3128.8I7643292j1289M446j3458l7074m0311j2755J3256L588j4603l5233o0445l9547
3153.2I7399867J5997K1315j4448k8485k7007k3586j7684j5885j2076j4031k7239l5018
3177.7I7221720k7978j3507p766j3709k5743k9260j2333m64j2535k3204j8049j2201
3202.2I7024971m738O199K539o736P10J3381N901j8686k0081L666J4281Q476l660k2239
$$ plain form
3230.7 97003984 96975756 96980911 97019100 97042209 97045898 97052002 97043961 97028196 97038412 97062033 97068948 97061884 97069609
3257.3 97069609 97089213 97089261 97075921 97065246 97037619 96990037 96967441 96988606 97036213 97090083 97124076 97137082
3281.7 97137082 97139275 97125340 97093469 97048670 97014183 97005576 97006518 97010791 97006768 96966726 96905839 96874619 96892792
3308.2 96892792 96942663 96991664 97016877 97023898 97015911 96993798 96962935 96927303 96909368 96915424 96915734 96901631 96881098
3334.8 96881098 96842670 96810865 96822304 96855915 96886110 96885127 96829820 96788406 96814030 96840817 96822834 96795481
3359.2 96795481 96793628 96810246 96809089 96785003 96781451 96822733 96875167 96901810 96916246 96936750 96953207 96967226
3383.7 96967226 96985799 96989512 96957523 96921796 96935612 96978968 96989840 96968681 96977657 97040915 97099245 97105294
3408.2 97105294 97087324 97080588 97099161 97132194 97145557 97146940 97159195 97168833 97156149 97131228 97119421 97104377
$$ packed form
3230.7I7003984k8228N155L8189K3109L689O104q041j5765J0216K3621O915p064P725
3257.3I7069609J9604M8j3340j0675k7627m7582k2596K1165M7607N3870L3993J3006
3281.7I7137082K193j3935l1871m4799l4487q607R42M273m023m0042o0887l1220J8173
3308.2I6892792M9871M9001K5213P021p987k2113l0863l5632j7935O056L10j4103k0533
3334.8I6881098l8428l1805J1439L3611L0195r83n5307m1414K5624K6787j7983k7353
3359.2I6795481j853J6618j157k4086l552M1282N2434K6643J4436K0504J6457J4019
3383.7I6967226J8573L713l1989l5727J3816M3356J0872k1159Q976O3258N8330O049
3408.2I7105294j7970o736J8573L3033J3363J383J2255R638j2684k4921j1807j5044
$$ plain form
3432.7 97104377 97077256 97084165 97145009 97211230 97235328 97227222 97221297 97233737 97251230 97265410 97284722 97289282
3457.1 97289282 97269773 97268504 97294939 97300678 97279078 97288179 97339863 97373688 97374141 97377783 97404933 97453982 97494859
3483.6 97494859 97516263 97552931 97604555 97637302 97646981 97648013 97662425 97683340 97695589 97739452 97812837 97873455
3508.1 97873455 97933048 97992313 98033315 98065943 98092937 98093301 98060805 98041898 98077744 98147792 98218250 98255497
3532.6 98255497 98246372 98241478 98267776 98264921 98210096 98177660 98217624 98277360 98309636 98346901 98395085 98404121
3557.1 98404121 98372734 98327559 98261863 98185503 98170233 98263651 98397046 98482162 98503238 98495102 98470378 98417956
3581.5 98417956 98316455 98202586 98194516 98280573 98315543 98278987 98228896 98179156 98130339 98111528 98117554 98116881
3606 98116881 98119158 98144537 98169297 98179454 98219311 98308849 98412418 98480833 98469335 98409635 98401088 98487121
$$ packed form
3432.7I7104377k7121O909O0844O6221K4098q106n925J2440J7493J4180J9312M560
3457.1I7289282j9509j269K6435N739k1600R101N1684L3825M53L642K7150M9049M0877
3483.6I7494859K1404L6668N1624L2747R679J032J4412K0915J2249M3863P3385O0618
3508.1I7873455N9593N9265M1002L2628K6994L64l2496j8907L5846P0048P0458L7247
3532.6I8255497r125m894K6298k855n4825l2436L9964N9736L2276L7265M8184R036
3557.1I8404121l1387m5175o5696p6360j5270R3418J33395Q5116K1076q136k4724n2422
3581.5I8417956j01501j13869q070Q6057L4970l6556n0091m9740m8817j8811O026o73
3606I8116881K277K5379K4760J0157L9857Q9538J03569O8415j1498n9700q547Q6033
$$ plain form
3630.5 98487121 98601872 98696834 98761666 98788708 98772395 98697519 98549032 98365563 98271227 98370719 98562735
3652.9 98562735 98724777 98825556 98902559 98974562 98984534 98892498 98761129 98665869 98612136 98592353 98637664
3675.4 98637664 98788637 98962593 99057931 99054712 98985648 98883575 98839664 98958969 99130028 99217933 99217558
3697.8 99217558 99179220 99147791 99129838 99081844 98994088 98947287 99000090 99099571 99158788 99144185 99095702 99072933
3722.3 99072933 99107862 99162292 99165797 99070787 98894578 98808062 98890352 98955315 98954237 98951352 98881125 98783058
3746.7 98783058 98799992 98900747 99018830 99098814 99130732 99160177 99214685 99263793 99265754 99247962 99273670
3769.2 99273670 99345678 99412566 99421519 99367881 99315190 99329662 99370891 99392778 99423337 99456900 99454314 99405664
3793.7 99405664 99309081 99210465 99170572 99146038 99158680 99239260 99310517 99351156 99355763 99300867 99180835 99080205
$$ packed form
3630.5I8487121J14751R4962O4832K7042j6313p4876j48487j83469r4336R9492J92016
3652.9I8562735J62042J00779P7003P2003R972r2036j31369r5260n3733j9783M5311
3675.4I8637664J50973J73956R5338l219o9064j02073m3911J19305J71059Q7905l75
3697.8I9217558l8338l1429j7953m7994q7756m6801N2803R9481N9217j4603m8483k2769
3722.3I9072933L4929N4430L505r5010j76209q6516Q2290O4963j078k885p0227r8067
3746.7I8783058J6934J00755J18083P9984L1918K9445N4508M9108J961j7792K5708
3769.2I9273670P2008O6888Q953n3638n2691J4472M1229K1887L0559L3563k586m8650
3793.7I9405664r6583r8616l9893k4534J2642Q0580P1257M0639M607n4896j20032j00630
$$ plain form
3818.1 99080205 99086231 99166435 99270350 99344391 99359030 99319750 99229425 99135149 99103475 99138838 99220872 99323428
3842.6 99323428 99386209 99382246 99302220 99189091 99182403 99294788 99390686 99445480 99443823 99383110 99298638 99268425
3867.1 99268425 99298984 99336338 99409634 99492800 99502850 99429095 99351239 99356657 99400604 99456954 99530506 99573988
3891.6 99573988 99575245 99541944 99465531 99390680 99398452 99489301 99616331 99728858 99770916 99751931 99717492 99683273
3916 99683273 99672312 99698436 99734497 99759859 99770778 99765193 99762404 99788767 99841386 99886906 99896276 99880767 99862611
3942.5 99862611 99850386 99840289 99837065 99868637 99930710 99983013 100000000 99989915 99973440 99962819 99963319 99975401
3967 99975401 99994159 100000525 99984896 99976343 99994743 100000834 99977422 99978858 100017035 100046790 100060833 100074816 100089502
3993.5 100089502 100103199 100105858
$$ packed form
3818.1I9080205O026Q0204J03915P4041J4639l9280r0325r4276l1674L5363Q2034J02556
3842.6I9323428O2781l963q0026j13129o688J12385R5898N4794j657o0713q4472l0213
3867.1I9268425L0559L7354P3296Q3166J0050p3755p7856N418M3947N6350P3552M3482
3891.6I9573988J257l3301p6413p4851P772R0849J27030J12527M2058j8985l4439l4219
3916I9683273j0961K6124L6061K5362J0919n585k789K6363N2619M5520R370j5509j8156
3942.5I9862611j2225j0097l224L1572O2073N2303J6987j0085j6475j0621N00J2082
3967I9975401J8758O366j5629q553J8400O091k3412J436L8177K9755J4043J3983J4686
3993.5A00089502J3697K659
$$ plain form
3997.6 100105858
$$ packed form
3997.6A00105858
##END=$$ End of the data block
