##TITLE=Amostra $$ Begin of the data block
##JCAMP-DX=5.00 $$ ACD/SpecManager v 10.08
##DATE=16 Oct 2014 11:56:10
##DATA TYPE=INFRARED SPECTRUM
##DATA CLASS=XYDATA
##ORIGIN=Marcelo Quint
##OWNER=
##NPOINTS=1667
##FIRSTX=599.64648438
##LASTX=3997.64306641
##MAXX=3997.64306641
##MINX=599.64648438
##MAXY=1.00000000
##MINY=0.17076038
##XFACTOR=1.0000000000
##YFACTOR=0.000000010000000
##FIRSTY=0.99894255
##DELTAX=2.03961372
##XUNITS=1/CM
##YUNITS=ARBITRARY UNITS
##XYDATA=(X++(Y..Y))
$$ plain form
599.6 99894255 99918067 99891669 99825168 99791074 99785614 99779046 99760950 99731374 99708176 99681592 99619484 99524069
624.1 99524069 99428612 99343574 99284190 99272078 99290794 99316871 99347305 99392259 99444282 99491906 99538606 99590665
648.6 99590665 99646538 99679589 99678582 99694860 99740660 99754751 99723208 99667227 99577844 99539185 99593240 99602926
673.1 99602926 99577594 99571413 99560362 99531448 99491519 99420458 99300432 99163747 99067634 99033296 98998719 98929155
697.5 98929155 98844838 98719049 98506665 98201674 97795081 97246522 96425802 94838744 91474205 87151819
717.9 87151819 85953307 88918376 91663790 91289335 88997102 88714385 92242831 96337593 98407942
736.3 98407942 99111992 99397272 99556315 99659640 99727201 99779862 99817348 99818665 99781084 99740142 99731821
758.7 99731821 99752218 99771982 99779391 99786055 99797469 99815524 99843627 99870300 99871302 99854970 99862015 99903941 99950689
$$ packed form
599.6I9894255K3812k6398o6501l4094n460o568j8096k9576k3198k6584o2108r5415
624.1I9524069r5457q5038n9384j2112J8716K6077L0434M4954N2023M7624M6700N2059
648.6I9590665N5873L3051j007J6278M5800J4091l1543n5981q9383l8659N4055R686
673.1I9602926k5332o181j1051k8914l9929p1061j20026j36685r6113l4338l4577o9564
697.5I8929155q4317j25789k12384l04991m06593n48559q20720j587058l364539m322386
717.9H7151819j198512K965069K745414l74455k292233k82717L528446M094762K070349
736.3I8407942P04050K85280J59043J03325O7561N2661L7486J317l7581m0942q321
758.7I9731821K0397J9764P409O664J1414J8055K8103K6673J002j6332P045M1926M6748
$$ plain form
785.3 99950689 99975914 99991393 99991393 99991393 99984419 99993026 99981928 99973214 99954522 99934530 99932122 99925089 99905860 99894071
813.8 99894071 99888009 99884546 99884230 99888110 99893427 99890703 99882990 99880463 99870270 99837977 99811494 99816287 99827313 99827600
842.4 99827600 99832326 99839485 99835265 99825561 99812245 99787825 99765748 99750978 99728411 99700820 99672174 99626040 99566370
868.9 99566370 99505073 99425566 99314958 99166483 98957419 98655206 98269999 97903585 97706521 97747862
889.3 97747862 97929353 98063886 97999769 97654563 96962386 95789009 93940711 91500264 89384758
907.6 89384758 89053208 90934664 93809909 96263582 97834998 98720628 99214995 99512517 99701935
926 99701935 99820983 99899465 99951971 99979866 99988502 99980682 99954420 99924469 99901330 99874949 99847364 99818784
950.5 99818784 99761164 99642080 99430186 99082518 98621976 98220736 98090631 98276818 98626500 98954529
$$ packed form
785.3I9950689K5225J5479%To974Q607j1098q714j8692j9992k408p033j9229j1789
813.8I9894071o062l463l16L880N317k724p713k527j0193l2293k6483M793J1026K87
842.4I9827600M726P159m220r704j3316k4420k2077j4770k2567k7591k8646m6134n9670
868.9I9566370o1297p9507j10608j48475k09064l02213l85207l66414j97064M1341
889.3I7747862J81491J34533o4117l45206o92177j173377j848298k440447k115506
907.6H9384758l31550J881456K875245K453673J571416Q85630M94367K97522J89418
926I9701935J19048P8482N2506K7895Q636p820k6262k9951k3139k6381k7585k8580
950.5I9818784n7620j19084k11894l47668m60542m01240j30105J86187L49682L28029
$$ plain form
970.9 98954529 99179977 99295670 99298036 99185973 98957300 98565984 97947335 97166669 96516150 96333641
991.3 96333641 96680641 97329330 98028100 98638988 99114555 99457741 99682879 99810135 99879766 99926013
1011.6 99926013 99964994 99995363 99995363 99995363 99978995 99983633 99960417 99956644 99967355 99973845 99972695 99970686 99973929 99977076 99968290
1042.2 99968290 99949980 99933004 99924886 99925882 99921358 99902284 99874222 99844420 99816322 99795282 99785292 99774522 99752450
1068.8 99752450 99729836 99715513 99696755 99673378 99665421 99678367 99706870 99746466 99780595 99799991 99818957 99837458
1093.2 99837458 99846315 99851060 99852240 99852479 99856323 99855316 99849027 99844176 99842155 99852639 99875879 99893928 99902797 99909246
1121.8 99909246 99909204 99897432 99884760 99889040 99910706 99933469 99949384 99958527 99958116 99951863 99945211 99935031 99921739
1148.3 99921739 99910164 99900240 99888211 99870104 99854934 99850196 99842536 99828893 99821037 99823821 99834549 99847800 99858671
$$ packed form
970.9I8954529K25448J15693K366j12063k28673l91316o18649p80666o50519j82509
991.3I6333641L47000O48689O98770O10888M75567L43186K25138J27256O9631M6247
1011.6I9926013L8981L0369%Tj6368M638k3216l773J0711O490j150k009L243L147q786
1042.2I9968290j8310j6976q118R96m524j9074k8062k9802k8098k1040r990j0770k2072
1068.8I9752450k2614j4323j8758k3377p957J2946K8503L9596L4129J9396J8966J8501
1093.2I9837458Q857M745J180K39L844j007o289m851k021J0484K3240J8049Q869O449
1121.8I9909246m2j1772j2672M280K1666K2763J5915R143m11o253o652j0180j3292
1148.3I9921739j1575r924j2029j8107j5170m738p660j3643p856K784J0728J3251J0871
$$ plain form
1174.8 99858671 99860483 99856168 99860734 99876726 99893272 99904215 99915141 99933589 99957079 99976921 99987000 99989802
1199.3 99989802 99985754 99974394 99965799 99964124 99966538 99973923 99984848 99996614 99979037 99982423 99954528 99935842 99928695
1225.8 99928695 99923438 99908346 99886125 99868995 99854261 99839342 99827087 99811274 99793547 99779296 99764276 99746913
1250.3 99746913 99726534 99698144 99665010 99636811 99621791 99620324 99611455 99580139 99542964 99522609 99518120 99510431
1274.8 99510431 99490976 99467146 99439347 99402183 99354821 99302918 99257398 99217951 99175054 99124527 99077410 99047953
1299.2 99047953 99038744 99049807 99083680 99132204 99179947 99221367 99265456 99312437 99352133 99402922 99465799 99512869
1323.7 99512869 99534386 99529624 99503416 99456114 99363166 99196982 98991090 98852485 98817289 98785138 98696047
1346.2 98696047 98575711 98470062 98410881 98398226 98398101 98332101 98153931 97945344 97824341 97725034 97572815
$$ packed form
1174.8I9858671J812m315M566J5992J6546J0943J0926J8448K3490J9842J0079K802
1199.3I9989802m048j1360q595j675K414P385J0925J1766j7577L386k7895j8686p147
1225.8I9928695n257j5092k2221j7130j4734j4919j2255j5813j7727j4251j5020j7363
1250.3I9746913k0379k8390l3134k8199j5020j467q869l1316l7175k0355m489p689
1274.8I9510431j9455k3830k7799l7164m7362n1903m5520l9447m2897n0527m7117k9457
1299.2I9047953r209J1063L3873M8524M7743M1420M4089M6981L9696N0789O2877M7070
1323.7I9512869K1517m762k6208m7302r2948j66184k05892j38605l5196l2151q9091
1346.2I8696047j20336j05649n9181j2655j25o6000j78170k08587j21003r9307j52219
$$ plain form
1368.6 97572815 97368783 97011399 96494967 96171921 96432006 97254634 98156190 98718888 98980975 99137551
1389 99137551 99198997 99108142 98959714 98878020 98849785 98837578 98761183 98619795 98480880 98294526 98033965
1411.4 98033965 97795725 97619361 97467905 97406507 97400385 97255212 96943033 96481788 95858359 95207602
1431.8 95207602 94575608 93914449 93451858 93239665 92993498 92615151 92086661 91362119 90411562 89136255
1452.2 89136255 87510139 85126978 80949706 75959963 73394233 75899804 80639887 82341158
1468.5 82341158 80709708 80208945 86221689 93921125 98033351 99399096 99860871 99766672 99905670
1486.9 99905670 99767041 99841475 99830461 99988967 99899399 99945909 99853396 99907434 99492729 99132001 99340498
1509.3 99340498 99615282 99662727 99527514 99371165 99244100 99141908 99200702 99314654 99407214 99460196
$$ packed form
1368.6I7572815k04032l57384n16432l23046K60085Q22628R01556N62698K62087J56576
1389I9137551O1446r0855j48428q1694k8235j2207p6395j41388j38915j86354k60561
1411.4I8033965k38240j76364j51456o1398o122j45173l12179m61245o23429o50757
1431.8I5207602o31994o61159m62591k12193k46167l78347n28490p24542r50557j275307
1452.2H9136255j626116k383161m177272m989743k565730K505571M740083J701271
1468.5H2341158j631450n00763O012744P699436M112226J365745M61775r4199J38998
1486.9I9905670j38629P4434j1014J58506q9568M6510r2513N4038m14705l60728K08497
1509.3I9340498K74784M7445j35213j56349j27065j02192N8794J13952R2560N2982
$$ plain form
1529.7 99460196 99367732 99244279 99207610 99001288 98595160 98556972 98853040 99129081 99244195 99230909
1550.1 99230909 99185419 99060190 98767358 98393732 98556119 98973703 99132395 99093485 98972100 98923028
1570.5 98923028 98953629 98865396 98766416 98873693 98993272 99019730 99005026 98970628 98911554 98837805 98758698
1593 98758698 98699111 98690009 98705411 98697162 98661441 98611104 98548800 98513323 98517466 98469329 98308426 98203146
1617.4 98203146 98240882 98200417 98096728 98080534 98090112 98077780 97965550 97541624 96740514 95972878 95491117
1639.9 95491117 95433724 95850617 96491843 97128630 97474921 97438866 97532690 97969157 98235518 98246872
1660.3 98246872 98163295 98171580 98162788 98010552 97931963 98018152 98092103 98186934 98275477 98214549 97999215 97960794
1684.7 97960794 98259425 98512441 98640937 98635709 98443896 98205698 98065585 98096216 98232079 98266524
$$ packed form
1529.7I9460196r2464j23453l6669k06322m06128l8188K96068K76041J15114j3286
1550.1I9230909m5490j25229k92832l73626J62387M17584J58692l8910j21385m9072
1570.5I8923028L0601q8233r8980J07277J19579K6458j4704l4398n9074p3749p9107
1593I8758698n9587r102J5402q249l5721n0337o2304l5477M143m8137j60903j05280
1617.4I8203146L7736m0465j03689j6194R578j2332j12230m23926q01110p67636m81761
1639.9I5491117n7393M16893O41226O36787L46291l6055R3824M36467K66361J1354
1660.3I8246872q3577Q285q792j52236p8589Q6189P3951R4831Q8543o0928k15334l8421
1684.7I7960794K98631K53016J28496n228j91813k38198j40113L0631J35863L4445
$$ plain form
1705.1 98266524 98274523 98305511 98231703 98004496 97691405 97523534 97714925 98054200 98396802 98749208
1725.5 98749208 99003702 99075323 98990023 98870307 98934466 99035728 99054587 99116075 99232638 99319404 99353582
1748 99353582 99428505 99631196 99820089 99887663 99905646 99905181 99915534 99980336 99982834 99875230 99735934 99691910
1772.4 99691910 99819261 99957120 99989718 99971598 99973917 99987549 99942642 99955088 99821800 99764472 99858934
1794.9 99858934 99927819 99907756 99894714 99948990 99996930 99972814 99899232 99850625 99853355 99841845 99791610 99746877
1819.4 99746877 99714416 99666375 99633890 99633920 99657923 99764854 99893248 99950820 99972349 99973917 99897432 99787956
1843.8 99787956 99802673 99905181 99977523 99977523 99975187 99997663 99990630 99981451 99971372 99925423 99808794 99705434
1868.3 99705434 99754691 99877471 99934858 99935049 99922723 99904341 99879217 99849898 99800414 99729460 99696815 99699652
$$ packed form
1705.1I8266524P999L0988p3808k27207l13091j67871J91391L39275L42602L52406
1725.5I8749208K54494P1621q5300j19716O4159J01262J8859O1488J16563Q6766L4178
1748I9353582P4923K02691J88893O7574J7983m65J0353O4802K498j07604j39296m4024
1772.4I9691910J27351J37859L2598j8120K319J3632m4907J2446j33288n7328R4462
1794.9I9858934O8885k0063j3042N4276M7940k4116p3582m8607K730j1510n0235m4733
1819.4I9746877l2461m8041l2485L0K4003J06931J28394N7572K1529J568p6485j09476
1843.8I9787956J4717J02508P2342%k336K2476p033r179j0079m5949j16629j03360
1868.3I9705434M9257J22780N7387J91j2326j8382k5124k9319m9484p0954l2645K837
$$ plain form
1892.8 99699652 99695987 99714190 99747407 99762988 99775285 99783635 99770564 99761659 99787521 99820727 99810410 99766737
1917.3 99766737 99752808 99767661 99792856 99836469 99865294 99868703 99869210 99871898 99874091 99870825 99844068 99792558 99777025
1943.8 99777025 99819481 99863344 99878907 99876302 99868602 99865395 99867475 99860311 99843943 99822599 99796176 99792773 99819291
1970.3 99819291 99842054 99848694 99844801 99834657 99833751 99846840 99853265 99838036 99807686 99779820 99780101 99809355 99833703
1996.8 99833703 99842381 99848348 99852967 99850935 99842882 99832988 99817705 99787277 99743783 99716967 99725795 99745059 99757439
2023.3 99757439 99767894 99776435 99782503 99788666 99792081 99790293 99789786 99789381 99790376 99798030 99800986 99798369 99802136 99809813 99815905
2053.9 99815905 99822634 99830842 99835181 99824142 99804288 99801576 99812895 99817228 99816847 99819815 99818426 99811608 99810708 99814624
2082.5 99814624 99816048 99814969 99816072 99823958 99830872 99824369 99813920 99813616 99817985 99820364 99823880 99825889 99820280 99815869
$$ packed form
1892.8I9699652l665J8203L3217J5581J2297Q350j3071q905K5862L3206j0317m3673
1917.3I9766737j3929J4853K5195M3613K8825L409N07K688K193l266k6757n1510j5533
1943.8I9777025M2456M3863J5563k605p700l207K080p164j6368k1344k6423l403K6518
1970.3I9819291K2763O640l893j0144r06J3089O425j5229l0350k7866K81K9254K4348
1996.8I9833703Q678N967M619k032q053r894j5283l0428m3494k6816Q828J9264J2380
2023.3I9757439J0455Q541O068O163L415j788n07m05R95P654K956k617L767P677O092
2053.9I9815905O729Q208M339j1039j9854k712J1319M333l81K968j389o818r00L916
2082.5I9814624J424j079J103P886O914o503j0449l04M369K379L516K009n609m411
$$ plain form
2111 99815869 99816954 99815804 99811119 99808264 99811971 99816054 99812156 99801946 99791861 99786586 99781740 99772805 99763274 99753028
2139.6 99753028 99741763 99732596 99726319 99724573 99727255 99731928 99733824 99732256 99733579 99739546 99751258 99767709 99776548 99772352
2168.1 99772352 99765348 99764937 99769366 99768102 99761695 99756765 99753404 99752098 99750137 99747556 99745947 99742204 99738908 99745452 99760711
2198.7 99760711 99768639 99766332 99766016 99764961 99759179 99760431 99769652 99775940 99773657 99762315 99751198 99749947 99754524 99758285
2227.3 99758285 99760598 99760228 99752808 99736053 99713892 99694872 99686003 99681300 99674338 99672425 99673808 99668610 99660277 99653935
2255.8 99653935 99647886 99643153 99641836 99641728 99635321 99614799 99588275 99574161 99575746 99582362 99581748 99565405 99539709 99519724
2284.4 99519724 99507928 99497640 99485666 99472445 99461615 99448085 99421400 99385673 99343771 99292147 99238807 99192154
2308.9 99192154 99154806 99131286 99109787 99063945 98986375 98900914 98839796 98804426 98764628 98718089 98701257 98708481
$$ packed form
2111I9815869J085j150m685k855L707M083l898j0210j0085n275m846q935r531j0246
2139.6I9753028j1265r167o277j746K682M673J896j568J323N967J1712J6451Q839m196
2168.1I9772352p004m11M429j264o407m930l361j306j961k581j609l743l296O544J5259
2198.7I9760711P928k307l16j055n782J252R221O288k283j1342j1117j251M577L761
2227.3I9758285K313l70p420j6755k2161j9020q869m703o962j913J383n198q333o342
2255.8I9653935o049m733j317j08o407k0522k6524j4114J585O616o14j6343k5696j9985
2284.4I9519724j1796j0288j1974j3221j0830j3530k6685l5727m1902n1624n3340m6653
2308.9I9192154l7348k3520k1499m5842p7570q5461o1118l5370l9798m6539j6832P224
$$ plain form
2333.3 98708481 98700881 98682904 98679250 98688841 98707724 98757738 98814654 98818803 98760104 98680085 98624909 98598617
2357.8 98598617 98609304 98663992 98724854 98773903 98827058 98891592 98969674 99051452 99124962 99197149 99277139 99349564
2382.3 99349564 99395996 99422920 99437827 99439049 99428833 99413651 99402213 99396592 99389058 99376643 99366808 99356669
2406.8 99356669 99339968 99323392 99307579 99290758 99282575 99282503 99281663 99286789 99294680 99293900 99289125 99279904 99265134 99252510
2435.3 99252510 99245238 99240571 99234092 99225253 99213922 99198961 99186188 99176657 99165565 99154884 99142623 99130821 99122179
2461.8 99122179 99109095 99093932 99073350 99038011 99002928 98982406 98969305 98960310 98954993 98943412 98926461 98913240
2486.3 98913240 98896527 98869860 98845953 98829126 98813826 98804283 98800004 98792136 98769110 98735094 98712188 98704392
2510.8 98704392 98699588 98680097 98637301 98592758 98564714 98543841 98520696 98494577 98462862 98432785 98410112 98387635
$$ packed form
2333.3I8708481p600j7977l654R591J8883N0014N6916M149n8699q0019n5176k6292
2357.8I8598617J0687N4688O0862M9049N3155O4534P8082Q1778P3510P2187P9990P2425
2382.3I9349564M6432K6924J4907J222j0216j5182j1438n621p534j2415r835j0139
2406.8I9356669j6701j6576j5813j6821q183p2q40N126P891p80m775r221j4770j2624
2435.3I9252510p272m667o479q839j1331j4961j2773r531j1092j0681j2261j1802q642
2461.8I9122179j3084j5163k0582l5339l5083k0522j3101q995n317j1581j6951j3221
2486.3I8913240j6713k6667k3907j6827j5300r543m279p868k3026l4016k2906p796
2510.8I8704392m804j9491m2796m4543k8044k0873k3145k6119l1715l0077k2673k2477
$$ plain form
2535.3 98387635 98365176 98341125 98307425 98260123 98205948 98157167 98115265 98083556 98062497 98043489 98025686 98006880
2559.7 98006880 97982699 97951013 97913587 97878510 97846496 97813225 97774881 97733480 97695386 97655594 97608030 97562253
2584.2 97562253 97523224 97476822 97419196 97363007 97312117 97264844 97224975 97194672 97167200 97125834 97066665 97013086
2608.7 97013086 96974915 96935594 96882635 96819031 96752632 96684301 96613973 96543074 96468872 96390283 96315116 96259421
2633.2 96259421 96233833 96228683 96226305 96219969 96209687 96195203 96180308 96162605 96131825 96092898 96055412 96021837
2657.6 96021837 95993942 95968407 95948583 95942503 95936257 95917541 95905328 95905006 95901263 95899415 95903921 95907182 95907921 95899254
2686.2 95899254 95875067 95845032 95817786 95794564 95768988 95727766 95671028 95606887 95540106 95474124 95405942 95330381
2710.7 95330381 95247269 95169151 95102638 95035136 94954610 94857919 94756663 94671708 94609284 94556516 94503248
$$ packed form
2535.3I8387635k2459k4051l3700m7302n4175m8781m1902l1709k1059j9008j7803j8806
2559.7I8006880k4181l1686l7426l5077l2014l3271l8344m1401l8094l9792m7564m5777
2584.2I7562253l9029m6402n7626n6189n0890m7273l9869l0303k7472m1366n9169n3579
2608.7I7013086l8171l9321n2959o3604o6399o8331p0328p0899p4202p8589p5167n5695
2633.2I6259421k5588n150k378o336j0282j4484j4895j7703l0780l8927l7486l3575
2657.6I6021837k7895k5535j9824o080o246j8716j2213l22l743j848M506L261P39q667
2686.2I5899254k4187l0035k7246k3222k5576m1222n6738o4141o6781o5982o8182p5561
2710.7I5330381q3112p8118o6513o7502q0526r6691j01256q4955o2424n2768n3268
$$ plain form
2733.1 94503248 94446826 94395906 94360650 94328558 94289261 94240242 94179535 94115716 94050699 93971586 93875182 93768919
2757.6 93768919 93658441 93549103 93432313 93303514 93170851 93027520 92862397 92678148 92491460 92305028
2778 92305028 92096871 91865039 91625887 91368747 91079855 90773696 90462655 90142447 89811373 89473045
2798.4 89473045 89127040 88770646 88397330 87993979 87559980 87099969 86583108 85980576 85305631 84556657
2818.8 84556657 83706969 82744211 81654459 80394626 78892332 77056646 74776137 71885353 68136543
2837.1 68136543 63110566 56142616 46778369 36041629 27350709 24564619 28227499 35368839
2853.4 35368839 43072236 50300497 56826305 62350315 66559058 69292688 70641690 70983022 70825666
2871.8 70825666 70491576 69952893 69019681 67601097 65771586 63686490 61486846 59272593 57103544
$$ packed form
2733.1I4503248n6422n0920l5256l2092l9297m9019o0707o3819o5017p9113r6404j06263
2757.6I3768919j10478j09338j16790j28799j32663j43331j65123j84249j86688j86432
2778I2305028k08157k31832k39152k57140k88892l06159l11041l20208l31074l38328
2798.4H9473045l46005l56394l73316m03351m33999m60011n16861o02532o74945p48974
2818.8H4556657q49688r62758j089752j259833j502294j835686k280509k890784l748810
2837.1F8136543n025977o967950r364247j0736740q690920k786090L662880P141340
2853.4C5368839P703397P228261O525808N524010M208743K733630J349002L41332j57356
2871.8G0825666l34090n38683r33212j418584j829511k085096k199644k214253k169049
$$ plain form
2890.1 57103544 55009538 53009063 51079977 49157897 47189945 45072797 42576134 39408019
2906.5 39408019 35305223 30187792 24531394 19662647 17076038 17130156 19025807 21948154 25534758
2924.8 25534758 29705638 34476539 39783087 45510009 51508093 57532352 63293439 68482101
2941.1 68482101 72758156 75817376 77456212 77713394 77043223 76202691 75863260 76345497 77640122
2959.5 77640122 79576510 81956583 84562147 87128687 89402372 91223055 92569470 93567353 94409907
2977.8 94409907 95231992 96051049 96800512 97403365 97821075 98055762 98143363 98150116 98138565 98155951 98230469
3000.3 98230469 98331451 98424560 98526746 98631775 98706788 98760939 98822439 98893011 98957533 99006087 99037308
3022.7 99037308 99064970 99103183 99136114 99155760 99175942 99211192 99261391 99292505 99294192 99300790 99323601 99333972
$$ packed form
2890.1E7103544k094006k000475j929086j922080j967952k117148k496663l168115
2906.5C9408019m102796n117431n656398m868747k586609N4118J895651K922347L586604
2924.8B5534758M170880M770901N306548N726922N998084O024259N761087N188662
2941.1F8482101M276055L059220J638836K57182o70171q40532l39431M82237J294625
2959.5G7640122J936388K380073K605564K566540K273685J820683J346415R97883Q42554
2977.8I4409907Q22085Q19057P49463O02853M17710K34687Q7601O753j1551J7386P4518
3000.3I8230469J00982R3109J02186J05029P5013N4151O1500P0572O4522M8554L1221
3022.7I9037308K7662L8213L2931J9646K0182L5250N0199L1114J687O598K2811J0371
$$ plain form
3047.2 99333972 99308777 99252534 99168295 99051356 98914939 98769647 98606837 98439997 98299247 98178983
3067.6 98178983 98017955 97772157 97494996 97298884 97282481 97475022 97808439 98170590 98506457 98802489
3088 98802489 99038589 99229085 99388677 99497515 99557352 99607503 99665904 99707705 99708849 99680215 99663836
3110.4 99663836 99656606 99615622 99565107 99548012 99563628 99606192 99649811 99653989 99624747 99607825 99607003 99587935
3134.9 99587935 99544823 99498451 99480212 99488533 99487042 99467027 99426007 99359316 99313974 99325311 99342096 99322456
3159.4 99322456 99288553 99256182 99227327 99204534 99183619 99166626 99147660 99115288 99075013 99041963 99023700 99011308
3183.8 99011308 98992902 98962289 98928118 98911226 98906469 98889458 98861623 98839068 98822510 98813593 98815840 98814416
3208.3 98814416 98803580 98800361 98810083 98812234 98789388 98765153 98765135 98775971 98780930 98773569 98747337 98715055 98716795
$$ packed form
3047.2I9333972k5195n6243q4239j16939j36417j45292j62810j66840j40750j20264
3067.6I8178983j61028k45798k77161j96112j6403J92541L33417L62151L35867K96032
3088I8802489K36100J90496J59592J08838N9837N0151N8401M1801J144k8634j6379
3110.4I9663836p230m0984n0515j7095J5616M2564M3619M178k9242j6922q22j9068
3134.9I9587935m3112m6372j8239Q321j491k0015m1020o6691m5342J1337J6785j9640
3159.4I9322456l3903l2371k8855k2793k0915j6993j8966l2372m0275l3050j8263j2392
3183.8I9011308j8406l0613l4171j6892m757j7011k7835k2555j6558q917K247j424
3208.3I8814416j0836l219R722K151k2846k4235j8J0836M959p361k6232l2282J740
$$ plain form
3234.8 98716795 98752207 98772287 98772651 98775512 98764020 98744702 98751867 98772722 98776603 98766303 98771101 98788023 98785090
3261.3 98785090 98768580 98754811 98723847 98672622 98646867 98665667 98711401 98763555 98795533 98806208 98805910 98789251
3285.8 98789251 98754400 98706454 98669028 98657984 98656678 98658812 98652560 98609710 98545718 98511934 98528421 98577195
3310.3 98577195 98625112 98648894 98654222 98644340 98620135 98587084 98549217 98529410 98534030 98532850 98517072 98494798
3334.8 98494798 98454374 98420739 98431116 98464066 98493606 98491484 98434198 98391074 98416162 98442459 98423284 98394662
3359.2 98394662 98391992 98408151 98406297 98381174 98376977 98418397 98471206 98497850 98512125 98532623 98549056 98563063
3383.7 98563063 98581749 98585373 98552758 98516405 98530459 98574579 98585731 98564392 98573714 98638284 98697883 98704392
3408.2 98704392 98686546 98680162 98699552 98733711 98747909 98749995 98763174 98773748 98761690 98737246 98726183 98711884
$$ packed form
3234.8I8716795L5412K0080L64K861j1492j9318P165K0855L881j0300M798J6922k933
3261.3I8785090j6510j3769l0964n1225k5755J8800M5734N2154L1978J0675k98j6659
3285.8I8789251l4851m7946l7426j1044j306K134o252m2850o3992l3784J6487M8774
3310.3I8577195M7917K3782N328r882k4205l3051l7867j9807M620j180j5778k2274
3334.8I8494798m0424l3635J0377L2950K9540k122n7286m3124K5088K6297j9175k8622
3359.2I8394662k670J6159j854k5123m197M1420N2809K6644J4275K0498J6433J4007
3383.7I8563063J8686L624l2615l6353J4054M4120J1152k1339R322O4570N9599O509
3408.2I8704392j7846o384J9390L4159J4198K086J3179J0574j2058k4444j1063j4299
$$ plain form
3432.7 98711884 98685348 98693472 98756480 98824996 98850751 98843837 98839170 98853248 98872507 98888457 98909676 98915952
3457.1 98915952 98897821 98898280 98926961 98934668 98914617 98925841 98980433 99016923 99019521 99025428 99055290 99107480 99151438
3483.6 99151438 99175638 99215418 99270463 99306381 99318886 99322653 99340093 99364221 99379569 99427152 99504822 99569571
3508.1 99569571 99633330 99696833 99741805 99778330 99809182 99812996 99783432 99767756 99807847 99882817 99958277 99958277 99942416
3534.6 99942416 99984133 99966788 99982661 99910957 99861068 99884325 99927664 99943572 99965507 99961656 99996150 99952197
3559.1 99952197 99895024 99817598 99729753 99704164 99788946 99914134 99989867 99969918 99980050 99943125 99877965
3581.5 99877965 99762893 99635178 99614716 99689615 99712586 99662912 99599451 99536252 99473953 99441993 99435157
3604 99435157 99421477 99410731 99423349 99435294 99432409 99459577 99537015 99628621 99684626 99659723 99586052 99564165
$$ packed form
3432.7I8711884k6536Q124O3008O8516K5755o914m667J4078J9259J5950K1219O276
3457.1I8915952j8131M59K8681P707k0051J1224N4592L6490K598N907K9862N2190M3958
3483.6I9151438K4200L9780N5045L5918J2505L767J7440K4128J5348M7583P7670O4749
3508.1I9569571O3759O3503M4972L6525L0852L814k9564j5676M0091P4970P5460%j5861
3534.6I9942416M1717j7345J5873p1704m9889K3257M3339J5908K1935l851L4494m3953
3559.1I9952197n7173p7426q7845k5589Q4782J25188P5733j9949J0132l6925o5160
3581.5I9877965j15072j27715k0462P4899K2971m9674o3461o3199o2299l1960o836
3604I9435157j3680j0746J2618J1945k885K7168P7438R1606N6005k4903p3671k1887
$$ plain form
3628.5 99564165 99637991 99740875 99823731 99876153 99890387 99860817 99772120 99609107 99410850 99302787 99390662
3650.9 99390662 99572080 99723268 99812639 99878091 99938583 99936563 99831682 99687254 99579448 99513716 99482405
3673.3 99482405 99516940 99658203 99822807 99908251 99894464 99814475 99701422 99647218 99757785 99920702 99911177
3695.8 99911177 99990469 99942786 99902147 99875182 99818039 99720949 99665207 99709868 99801612 99852884 99829894 99772865
3720.2 99772865 99741822 99768937 99815750 99811369 99707925 99522853 99428141 99503356 99561197 99552667 99542379 99464417
3744.7 99464417 99358535 99368387 99462616 99574310 99647743 99672890 99695611 99743581 99786180 99781436 99756885 99776113
3769.2 99776113 99841940 99902654 99905199 99844903 99785620 99793863 99829030 99844819 99869370 99896967 99888289 99833405
3793.7 99833405 99730438 99625480 99579537 99549067 99555951 99631083 99696875 99731970 99730927 99670190 99544114
$$ packed form
3628.5I9564165P3826J02884Q2856N2422J4234k9570q8697j63013j98257j08063Q7875
3650.9I9390662J81418J51188Q9371O5452O0492k020j04881j44428j07806o5732l1311
3673.3I9482405L4535J41263J64604Q5444j3787p9989j13053n4204J10567J62917r525
3695.8I9911177P9292m7683m0639k6965n7143r7090n5742M4661R1744N1272k2990n7029
3720.2I9772865l1043K7115M6813m381j03444j85072r4712P5215N7841q530j0288p7962
3744.7I9464417j05882R852R4229J11694P3433K5147K2721M7970M2599m744k4551J9228
3769.2I9776113O5827O0714K545o0296n9283Q243L5167J5789K4551K7597q678n4884
3793.7I9833405j02967j04958m5943l0470O884P5132O5792L5095j043o0737j26076
$$ plain form
3816.1 99544114 99437571 99438077 99513078 99611878 99680716 99689978 99645162 99549180 99449259 99412173 99442351 99519348
3840.6 99519348 99616951 99674666 99665457 99580002 99461365 99449486 99557006 99648005 99697793 99691004 99625009 99535215
3865 99535215 99499840 99525362 99557716 99626088 99704343 99709338 99630338 99547255 99547607 99586558 99637932 99706519 99744987
3891.6 99744987 99741149 99702680 99621034 99540955 99543625 99629474 99751526 99859029 99895960 99871749 99832064 99792582
3916 99792582 99776357 99797255 99828070 99848151 99853760 99842829 99834669 99855661 99902892 99943000 99946898 99925888 99902189
3942.5 99902189 99884409 99868715 99859881 99885798 99942189 99988770 99972868 99984097 99961770 99945235 99939811 99945974
3967 99945974 99958801 99959284 99937826 99923509 99936223 99936724 99907851 99903971 99936944 99961662 99970865 99980199 99990469
3993.5 99990469 99990469 100000000
$$ packed form
3816.1I9544114j06543N06P5001R8800O8838R262m4816r5982r9921l7086L0178P6997
3840.6I9519348R7603N7715r209q5455j18637j1879J07520R0999M9788o789o5995q9794
3865I9535215l5375K5522L2354O8372P8255M995p9000q3083L52L8951N1374O8587L8468
3891.6I9744987l838l8469q1646q0079K670Q5849J22052J07503L6931k4211l9685l9482
3916I9792582j6225K0898L0815K0081N609j0931q160K0992M7231M0108L898k1010k3699
3942.5I9902189j7780j5694q834K5917N6391M6581j5902J1229k2327j6535n424O163
3967I9945974J2827M83k1458j4317J2714N01k8873l880L2973K4718R203R334J0270
3993.5I9990469%R531
$$ plain form
3997.6 100000000
$$ packed form
3997.6A00000000
##END=$$ End of the data block
