##TITLE=Sample description $$ Begin of the data block
##JCAMP-DX=5.00 $$ ACD/SpecManager v 10.08
##SPECTROMETER/DATA SYSTEM=Alpha
##DATE=03 Jun 2014 08:18:44
##DATA TYPE=INFRARED SPECTRUM
##DATA CLASS=XYDATA
##ORIGIN=
##OWNER=
##NPOINTS=1765
##FIRSTX=399.75695801
##LASTX=3997.56933594
##MAXX=3997.56933594
##MINX=399.75695801
##MAXY=0.78889024
##MINY=0.46022430
##XFACTOR=1.0000000000
##YFACTOR=1.000000000000000e-9
##FIRSTY=0.65642345
##DELTAX=2.03957629
##XUNITS=1/CM
##YUNITS=ARBITRARY UNITS
##XYDATA=(X++(Y..Y))
399.8F56423450j867652m55738J777590J707852n36859r04858J192867J762092j183629
$$ 656423450 654555798 654100060 655877650 657585502 657048643 656143785 657336652 659098744 657915115
418.1F57915115l076493L21626K702475P32124k123297j580297Q43882J028359p04527
$$ 657915115 654838622 655160248 657862723 658594847 656471550 654891253 655735135 656763494 656058967
436.5F56058967q70228J168013K224326M18365j146376M23670K393841J180470j306355
$$ 656058967 655188739 656356752 658581078 658999443 657853067 658276737 660670578 661851048 660544693
454.8F60544693j350641N25832O21677j306653j828253j6094J195014k14279k116501
$$ 660544693 659194052 659719884 660341561 659034908 657206655 657190561 658385575 658171296 656054795
473.2F56054795j031280J473963J254082j172125j311302J314163K105772k62260j864374
$$ 656054795 655023515 656497478 657751560 656579435 655268133 656582296 658688068 658425808 656561434
491.5F56561434j82867J665354N04196j662851j342773Q18610J033187r31919j784205
$$ 656561434 656378567 658043921 658548117 656885266 655542493 656361103 657394290 656462371 654678166
509.9F54678166j35064J126945m71533k306938r69588J459717J235783p78913q00848
$$ 654678166 654543102 655670047 655198514 652891576 651921988 653381705 654617488 653838575 653037727
528.3F53037727J364708K175033O06239l31939J116813K545297J321971j016497r23276
$$ 653037727 654402435 656577468 657183707 656851768 657968581 660513878 661835849 660819352 659896076
546.6F59896076R54747P97331j396954k219081o97434N50330m34279j949549j526594
$$ 659896076 660850823 661648154 660251200 658032119 657334685 657885015 657450736 655501187 653974593
565F53974593p8559j18971j398325j414418M11868J647115Q08239R834J022816K192080
$$ 653974593 653896034 653777063 652378738 650964320 651376188 653023303 653831542 653841376 654864192 657056272
585.4F57056272J697719L47257J09136J168787J340568j49905j110018j95324R07123
$$ 657056272 658753991 659101248 659210384 660379171 661719739 661569834 660459816 660264492 661171615
603.7F61171615N34952m54188l36885P59602J108944K89559Q0705J337290K335906
$$ 661171615 661706567 661252379 660915494 661675096 662784040 663073599 663154304 664491594 666827500
622.1F66827500J850068R60350J023174J531899J362204N54443J10745N37634R82881
$$ 666827500 668677568 669637918 670661092 672192991 673555195 674109638 674220383 674758017 675740898
640.4F75740898O09874k0980R9480P51733Q78394L31640N2870M40597Q12412O07669
$$ 675740898 676350772 676329792 676429272 677181005 678059399 678391039 678443909 678884506 679696918 680304587
660.8F80304587K73049K32160Q285P4565P47979O55055M71115O90639P61688N32150
$$ 680304587 680577636 680809796 680818081 680892646 681640625 682295680 682766795 683457434 684219122 684751272
681.2F84751272L88324N55099P48395N66066J12772j33813j02698j88351o18875j024246
$$ 684751272 685139596 685694695 686443090 687009156 687121928 686988115 686885417 686697066 686078191 685053945
701.6F85053945p78854q1480K86877J86026K91706R47833J589775J624584J324415
$$ 685053945 684275091 684193611 684480488 684666514 684958220 685906053 687495828 689120412 690444827
720F90444827J501501K133667K281130J596093R77754J142443J426458R67741L5643
$$ 690444827 691946328 694079995 696361125 697957218 698934972 700077415 701503873 702471614 702507257
738.3G02507257m11808k07245k80619j087308j727283j418412q37385j037836j609922
$$ 702507257 702095449 701888204 701607585 700520277 698792994 697374582 696537197 695499361 693889439
756.7F93889439j311958j44720O28054M67837M88699J581430K760351K718508J906395
$$ 693889439 692577481 692432761 693060815 693528652 694017351 695598781 698359132 701077640 702984035
775G02984035J720369K352595K531409J599253P45237J075685J844227J665532P84994
$$ 702984035 704704404 707056999 709588408 711187661 711932898 713008583 714852810 716518342 717303336
793.4G17303336Q07762J996577K583265J661420P28488J065075J726151J245498N3644
$$ 717303336 718111098 720107675 722690940 724352360 725080848 726145923 727872074 729117572 729171216
811.7G29171216k07543N43118O49035n09739j545608j271665o40810j296461k749860
$$ 729171216 728963673 729506791 730155826 729646087 728100479 726828814 726188004 724891543 722141683
830.1G22141683l078520j974404j207292j824021k409757j532614j88351p5936r12726
$$ 722141683 719063163 717088759 715881467 714057446 711647689 710115075 709926724 709850788 708938062
848.5G08938062r86159J39118Q93831J91569n75840K98202J932502K339482J557231
$$ 708938062 707951903 708091021 708984852 709176421 708600581 708898783 710831285 713170767 714727998
866.8G14727998J320839K056062K173364P77423p48395q33929l26157j091599k701879
$$ 714727998 716048837 718104899 720278263 721055686 720307291 719473362 719147205 718055606 715353727
885.2G15353727l030300j694679p60138j496017k303779j497448j66356l26514j651168
$$ 715353727 712323427 710628748 709868610 708372593 706068814 704571366 704405010 704078496 702427328
903.5G02427328k030969j037836n70536j663565k758682k142906p22289o34015j703143
$$ 702427328 700396359 699358523 698787987 697124422 694365740 692222834 691500545 690866530 689163387
921.9F89163387j675010q1301Q69871K8431q23557k3663J349628J338481K73407J20103
$$ 689163387 687488377 687407076 688276947 688305378 687481821 687458158 688807786 690146267 690419674 690539777
942.3F90539777J113236J354695j11580j687825j700759j052976j572907k962052l341377
$$ 690539777 691653013 693007708 692896128 691208303 689507544 688454568 686881661 683919609 680578232
960.6F80578232k333343j749754k666831l639043l134846k060294k171278l208816
$$ 680578232 678244889 676495135 673828304 670189261 667054415 664994121 662822843 659614027
977F59614027l403783k303601j483559j969934k492606j696885m01378k31325j030922
$$ 659614027 656210244 653906643 652423084 650453150 647960544 646263659 645862281 645630956 644600034
995.3F44600034j115740r6321N09143j66893j029730q45730j27256k31564j106560
$$ 644600034 643484294 643387973 643897116 643730223 642700493 641854763 641727507 641495943 640389383
1013.7F40389383j330674m50313K50757p2897m89950K4736R49383R91285J37984k28464
$$ 640389383 639058709 638608396 638859153 638786256 638296306 638321042 639270425 640261710 640399694 640171230
1034.1F40171230M03583Q63433K98619l94702j31607O26743P58111K49684J67430R28640
$$ 640171230 640574813 641438246 641736865 641342163 641210556 641837299 642595410 642845094 643012524 643941164
1054.5F43941164J584411J375615R78947J303077J938879J720071L36230j188100j764416
$$ 643941164 645525575 646901190 647880137 649183214 651122093 652842164 653178394 651990294 650225878
1072.8F50225878j596272j466215j311064o12855L93331Q93712P12753N55336R21548
$$ 650225878 648629606 647163391 645852327 645239472 645632803 646526515 647239268 647794604 648716152
1091.2F48716152J348674J081347L70324J26064L82304M54307J43885n0127K30908
$$ 648716152 650064826 651146173 651516497 651642561 652024865 652479172 652623057 652572930 652803838
1109.5F52803838O23226O57976M42565L92735O12497P80344O34670M23491O07491J115918
$$ 652803838 653427064 654085040 654527605 654920340 655532837 656313181 656947851 657371342 657978833 659094751
1129.9F59094751J302361Q42214K14815j15514l68118q85189j435220j540363j238226
$$ 659094751 660397112 661239326 661454141 661338627 660970509 660085320 658650100 657109737 655871511
1148.3F55871511r82464r97126r69291n22852P9394L60429M67897Q44061J512945K067327
$$ 655871511 654889047 653891921 652922630 652399778 652479172 652839601 653307498 654151559 655664504 657731831
1168.7F57731831K202630K167642K398014K796769K881766K555668K231002K164662
$$ 657731831 659934461 662102103 664500117 667296886 670178652 672734320 674965322 677129984
1185F77129984K083123J623928R24111M95374M59850L75986Q3029k3186K78592P06553
$$ 677129984 679213107 680837035 681761146 682256520 682716370 683092356 683175385 683152199 683430791 684137344
1205.4F84137344Q66592P86126Q44061J123429J200676P93516L07441J97589K64228
$$ 684137344 685003936 685790062 686634123 687757552 688958228 689751744 690059185 690256774 690521002
1223.7F90521002P9393l42965n47171k92658l338j07467l27707j89662K00808L46899
$$ 690521002 690600395 690257430 689710259 689417601 689414263 689306796 688979089 688789427 688990235 689337134
1244.1F89337134J52052M6491L23832O68824N88000K28941J74284N00322O83605M39764
$$ 689337134 689489186 689535677 689859509 690528333 691116333 691345274 691519558 692019880 692703485 693143249
1264.5F93143249K01761L95656O89745N55634J13488p2480J25170K24114p1943m06623
$$ 693143249 693345010 693740666 694430411 694986045 695099533 695027053 695152223 695376337 695304394 694897771
1284.9F94897771l35932l6180o8426m74870o77943l97861q4222k09451m72009l03268
$$ 694897771 694561839 694525659 694457233 693982363 693304420 692906559 692822337 692612886 692140877 691837609
1305.3F91837609J44601K22861k52604o07491l19242k921k91288p48038p19547l44753
$$ 691837609 691982210 692205071 691952467 691344976 691025734 691022813 690731525 689983487 689263940 688919187
1325.7F88919187l23594p88629r97543n76377j65880l78251p02262l05474L38256L31760
$$ 688919187 688595593 687806964 686809421 686233044 686067164 685688913 684986651 684681177 685019433 685351193
1346.1F85351193k66731o36935l38435K7358j69396o36459p78555m58956j08957l28243
$$ 685351193 685084462 684447527 684109092 684136450 683967054 683330595 682552040 682093084 681984127 681655884
1366.5F81655884o65069k96533J61111J3054k15709r2507J58608K10405J57713L34263
$$ 681655884 680990815 680694282 680855393 680868447 680652738 680560231 680718839 680929244 681086957 681421220
1386.9F81421220Q91090J222253N88119l86775m03523J52051L28243j90139p40707
$$ 681421220 682312310 683534563 684122682 683735907 683332384 683484435 683812678 683622539 682881832
1405.3F82881832l38375J68621j14918n63979m96924l11017l35812j87099r9540J41084
$$ 682881832 682543457 682712078 682597160 682033181 681536257 681225240 680889428 680702329 680602789 680743873
1425.7F80743873M69387J54018j70767L8445J43766L00288N01216K96235K22087K72453
$$ 680743873 681213260 681367278 681196511 681234956 681378722 681679010 682180226 682476461 682698548 682971001
1446F82971001o4791l21209j51515j0252o42955r65298L60430J039028R73999J104355
$$ 682971001 682906210 682585001 682433486 682423234 681780279 680814981 681175411 682214439 683188438 684292793
1466.4F84292793J381934J436889J753032K384425K502799K352774K452194K625287
$$ 684292793 685674727 687111616 688864648 691249073 693751872 696104646 698556840 701182127
1482.8G01182127K324343J708090J579940K227605K426684J799285J272798J585543
$$ 701182127 703506470 705214560 706794500 709022105 711448789 713248074 714520872 716106415
1499.1G16106415J922488J533508N52237R4891J376450J808941J168847N79417O15061
$$ 716106415 718028903 719562411 720114648 720209539 721585989 723394930 724563777 725143194 725758255
1517.4G25758255Q05020O59823P62940R90152J100779J096666O30438K29299N82278
$$ 725758255 726563275 727223098 727986038 728976190 730076969 731173635 731804073 732033372 732615650
1535.8G32615650N65946j37627Q4519R66609J232266R79245N15401K98321K82944J29759
$$ 732615650 733181596 733043969 733128488 734095097 735327363 736306608 736822009 737120330 737403274 737533033
1556.2G37533033l11017K47598J228094R73940M18901l9935j11520K47001N5135m80474
$$ 737533033 737222016 737469614 738697708 739671648 740090549 740050614 739939094 740186095 740241230 739760756
1576.6G39760756k40206k8670l12924n94378q70943j144648j337289j474679j675308
$$ 739760756 739520550 739491880 739178956 738584578 737713635 736568987 735231698 733757019 732081711
1594.9G32081711j887798k080917k322257k526820k687752k923906l160536l143072
$$ 732081711 730193913 728112996 725790739 723263919 720576167 717652261 714491725 711348653
1611.3G11348653l060699l694355m356146l115356k472579l064812k815187k188861
$$ 711348653 708287954 704593599 700237453 697122097 694649518 691584706 688769519 686580658
1627.6F86580658j771808j191437j173437j568913n68986N72145P66098O78361O55651
$$ 686580658 684808850 683617413 682443976 680875063 680306077 680878222 681644320 682322681 682978332
1645.9F82978332J296759J893401J646876J847983K681136K692878K384484K251506
$$ 682978332 684275091 686168492 687815368 689663351 692344487 695037365 697421849 699673355
1662.2F99673355K407491K398610K275228K445758K636909K746046K892911K741576
$$ 699673355 702080846 704479456 706754684 709200442 711837351 714583397 717476308 720217884
1678.6G20217884K349197K086699K651871L142178K847612K573669K191186J908898
$$ 720217884 722567081 724653780 727305651 730447829 733295441 735869110 738060296 739969194
1694.9G39969194J889586K021850K413868K384663K037525J915932J778185J522601
$$ 739969194 741858780 743880630 746294498 748679161 750716686 752632618 754410803 755933404
1711.2G55933404J184344Q95739J072824J637459J672268J343369J136899R85563Q08418
$$ 755933404 757117748 758013487 759086311 760723770 762396038 763739407 764876306 765861869 766670287
1729.5G66670287O12855O56187J109302J174391R86754R48966R35614P91431O29186
$$ 766670287 767283142 767939329 769048631 770223022 771209776 772158742 773094356 773885787 774514973
1747.9G74514973P04885R32336Q52406O30796N62191N21004N33521N90205M15385J41501
$$ 774514973 775219858 776152194 777004600 777635396 778197587 778718591 779252112 779842317 780257702 780399203
1768.3G80399203K0385K24829O74605P33316M56393K89917L39091L84688L40521J79649
$$ 780399203 780419588 780644417 781319022 782052338 782508731 782798648 783137739 783522427 783862948 784042597
1788.7G84042597M1544K80917N51343M23789K70188L55899M70579L88145K27094J63197
$$ 784042597 784084141 784365058 784916401 785340190 785610378 785966277 786436856 786825001 787052095 787215292
1809.1G87215292K33293K95103K35855J92762K29716J35779n9962r0480j7166L5346
$$ 787215292 787448585 787743688 787979543 788172305 788402021 788537800 788477838 788387358 788370192 788405538
1829.5G88405538J96099K27570O1036l5942j15633k94030l70204j10328Q2850K801
$$ 788405538 788601637 788829207 788890243 788854301 788738668 788444638 788074434 787964106 788046956 788049757
1849.9G88049757p7068q2434q8691j42217j82271j47939j33633k45035k53141N5015
$$ 788049757 787972689 787890255 787801564 787659347 787477076 787329137 787195504 786950469 786697328 786752343
1870.3G86752343K71082J73509J8597l6776q404L3021K265j02222j30356J8299P6473
$$ 786752343 787023425 787196934 787215531 787178755 787170351 787203372 787205637 787103415 786973059 786991358 787067831
1892.7G87067831l8803p3969l1352n5314j55568k16543j91570j38402r8347j34945
$$ 787067831 787029028 786955059 786923707 786868393 786712825 786496282 786304712 786166310 786067963 785933018
1913.1G85933018k34366k56180j54973j23798j37270k3127M1724m7922j43648j53303
$$ 785933018 785698652 785442472 785287499 785163701 785026431 785003304 785045028 784997106 784853458 784700155
1933.5G84700155j11043j06394j52767j33693J7583J23620P5281J1027K6583L6597
$$ 784700155 784589112 784482718 784329951 784196258 784213841 784337461 784412742 784423769 784450352 784486949
1953.9G84486949r715k3782J7047M0948j1563r9421q1301K6226M3989l8207j03116
$$ 784486949 784477234 784453452 784470499 784511447 784499884 784400463 784319162 784345388 784389377 784351170 784248054
1976.3G84248054r9957p1347j03414j59323j56522j70111k33353k19047j36137j51097
$$ 784248054 784148097 784076750 783973336 783814013 783657491 783487380 783254027 783034980 782898843 782747746
1996.7G82747746k42651k90513k95937l18825l89994m83274n23031m95553n17368n91755
$$ 782747746 782505095 782214582 781918645 781599820 781209826 780726552 780203521 779707968 779190600 778598845
2017.1G78598845o02901n56469n26786n86569o92129o76215n62787n38588n89788n75780
$$ 778598845 777995944 777439475 776912689 776326120 775633991 774957776 774394989 773856401 773266613 772690833
2037.5G72690833m91083m08769l73602l55839k83122j88649j75536k10941j83165q6248
$$ 772690833 772199750 771790981 771417379 771061540 770778418 770589769 770414233 770203292 770020127 769933879
2057.9G69933879j3947k4676o4910m6849O795k0564r1076n9485K6941J3173r1970j24932
$$ 769933879 769919932 769895256 769830346 769783497 769790292 769769728 769678652 769619167 769646108 769659281 769567311 769442379
2082.4G69442379l7550P093n4956q5294k3604L6478J5140l5167l3796N544q583r8348
$$ 769442379 769404829 769411922 769356966 769271672 769248068 769284546 769299686 769264519 769230723 769236267 769227684 769129336
2106.9G69129336j21534m4346j5735p5400j32203j29581r8288j19209j81735k10047
$$ 769129336 769007802 768963456 768947721 768872321 768740118 768610537 768512249 768393040 768211305 768001258
2127.3G68001258j52826m8280n5968j57357j88768j36494j00196j33335j41442n1618
$$ 768001258 767848432 767800152 767744184 767586827 767398059 767261565 767161369 767028034 766886592 766834974
2147.7G66834974J9133k4974p4744k6524N7041J08838J16706J33217K24769L16799
$$ 766834974 766854107 766829133 766754389 766727865 766784906 766893744 767010450 767143667 767368436 767685235
2168G67685235L09407K63214K67685K97308L16202L29495L17752K99514L24964L34144
$$ 767685235 767994642 768257856 768525541 768822849 769139051 769468546 769786298 770085812 770410776 770744920
2188.4G70744920K79724K47598K53916K64287K92897L02970K87891K85745L10719L49640
$$ 770744920 771024644 771272242 771526158 771790445 772083342 772386312 772674203 772959948 773270667 773620307
2208.8G73620307L31402K63274K40624K51174K34067K00153J86622K01344J84715R2328
$$ 773620307 773951709 774214983 774455607 774706781 774940848 775141001 775327623 775528967 775713682 775806010
2229.2G75806010L1769R4056J64688J16586o55k5511O8963J10209K5749o0141k0921
$$ 775806010 775837779 775931835 776096523 776213109 776212454 776186943 776255906 776366115 776391864 776331723 776310802
2251.7G76310802Q4340P3314k7120o795J47819K25961J45317N1915O8426J30117R3043
$$ 776310802 776395142 776468456 776441336 776434541 776582360 776808321 776953638 777005553 777073979 777204096 777297139
2274.1G77297139J3828M7625J47879J46866j4604j43945q5532j7226q5950j87397j84715
$$ 777297139 777310967 777358592 777506471 777653337 777638733 777494788 777409256 777392030 777306080 777118683 776933968
2296.5G76933968p4804m5419k37464m21226l32952j98245l19302m76182m09305l05474
$$ 776933968 776859164 776813745 776576281 776155055 775822103 775623858 775304556 774828374 774419069 774113595
2316.9G74113595l60846n11110n44369m22478l94404m81784m63247l18230k64406l54767
$$ 774113595 773752749 773241639 772697270 772274792 771880388 771398604 770935357 770617127 770352721 769997954
2337.3G69997954m22299l17573O0081L94285Q8751o01410j092613j125813q62539p31706
$$ 769997954 769575655 769258082 769318163 769712448 769801199 769199789 768107176 766981363 766118824 765387118
2357.7G65387118o47545l17335R1851K97248L37005M33743N08546L79146K56061K79069
$$ 765387118 764739573 764422238 764514089 764811337 765148342 765582085 766090631 766469777 766725838 767004907
2378.1G67004907L00110J85072m7028k22087k52068k48849l26038m46558m47094l35396
$$ 767004907 767305017 767490089 767443061 767220974 766968906 766720057 766394019 765947461 765500367 765164971
2398.5G65164971l34143m59552n15461m32909l68058m49360n60224n54323m86195m95017
$$ 765164971 764830828 764371276 763855815 763422906 763054848 762605488 762045264 761490941 761004746 760509729
2418.9G60509729o03139o62863o06776n44786n38290o01649o42598n78820n77510o82294
$$ 760509729 759906590 759243727 758636951 758092165 757553875 756952226 756309628 755730808 755153298 754471004
2439.3G54471004o97494o01530n69343o17743o14583n69225n56469n67197n70536n31614
$$ 754471004 753773510 753171980 752602637 751984894 751370311 750801086 750244617 749677420 749106884 748575270
2459.7G48575270m87685m88102m90606m87745m83990m66943m59909m65035m56751m28498
$$ 748575270 748087585 747599483 747108877 746621132 746137142 745670199 745210290 744745255 744288504 743860006
2480.1G43860006l95596l88920m00066l63827l04282l17633l86059l87728k91944k17080
$$ 743860006 743464410 743075490 742675424 742311597 742007315 741689682 741303623 740915895 740623951 740406871
2500.5G40406871k49028l15845l22283k95877l01600l18825l12447l22521l53694l83198
$$ 740406871 740157843 739841998 739519715 739223838 738922238 738603413 738290966 737968445 737614751 737231553
2520.9G37231553m24028m38094m10974m06086m47274m80473m56989m17530m45783n37336
$$ 737231553 736807525 736369431 735958457 735552371 735105097 734624624 734167635 733750105 733304322 732766986
2541.3G32766986n72622n02944m30465m52578n10156m90427m43220m58121m84348m56690
$$ 732766986 732194364 731691420 731260955 730808377 730298221 729807794 729364574 728906453 728422105 727965415
2561.7G27965415m03941l81828m26948m92811m76539m09901l87371m27186m54486l92913
$$ 727965415 727561474 727179646 726752698 726259887 725783348 725373447 724986076 724558890 724104404 723711491
2582.1G23711491l35217l84092m53294m15563k97070k49982l47793m50253m14848l65079
$$ 723711491 723376274 722992182 722538888 722123325 721826255 721576273 721228480 720778227 720363379 719998300
2602.5G19998300m51744n51998n26428m48347m50134n39839n81324n58555n95987p06554
$$ 719998300 719546556 718994558 718468130 718019783 717569649 717029810 716448486 715889931 715293944 714587390
2622.9G14587390p79569p14838o00815o37770p96020q11577o65545o31809p58708q14795
$$ 714587390 713807821 713092983 712492168 711854398 711058378 710246801 709581256 708949447 708190739 707375944
2643.3G07375944p19905o36578o76155p43627p00713o07729n90801o51777o82711n74649
$$ 707375944 706656039 706019461 705343306 704599679 703898966 703291237 702700436 702048659 701365948 700791299
2663.7G00791299m71830n54204o50883n60820m10318m13358n40853n85437m73916l93153
$$ 700791299 700319469 699765265 699114382 698553562 698143244 697729886 697189033 696603596 696129680 695736527
2684.1F95736527m63485n41032m99308m08351m37498n75662n83768m53591m28379n33461
$$ 695736527 695273042 694732010 694232702 693824351 693386853 692811191 692227423 691773832 691345453 690811992
2704.5F90811992n90742n23865m68254n43714o19173o01649n45383m74989m73440n20050
$$ 690811992 690221250 689697385 689229131 688685417 688066244 687464595 686919212 686444223 685970783 685450733
2724.8F85450733m97103m85063n45084n92113n55336m40657l63171m06564m93288m57227
$$ 685450733 684953630 684468567 683923483 683331370 682776034 682335377 681972206 681565642 681072354 680615127
2745.2F80615127l19123l16382m58002n13315m08590k93910l19898m03822l93450l40581
$$ 680615127 680296004 679979622 679521620 679008305 678599715 678305805 677985907 677582085 677188635 676848054
2765.6F76848054l31283l71217l83854l03865l00228m23968m88162m64618m29690m25578
$$ 676848054 676516771 676145554 675761700 675457835 675157607 674733639 674245477 673780859 673351169 672925591
2786F72925591m41014m74334n35011n58854n80251o58691o90877o37233o09577o75380
$$ 672925591 672484577 672010243 671475232 670916378 670336127 669677436 668986559 668349326 667739749 667064369
2806.4F67064369p75993p78735p05957p15375p94411p89344p14243p61926r12785r78887
$$ 667064369 666288376 665509641 664803684 664088309 663293898 662504554 661790311 661028385 660115600 659136713
2826.8F59136713r42886q70049q35002q75413q85368r16957j107216j276195j284004
$$ 659136713 658193827 657323778 656488776 655613363 654727995 653811038 652703822 651427627 650143623
2845.2F50143623j254439j280069j300156j215399j061082r29773r23573j085938j255571
$$ 650143623 648889184 647609115 646308959 645093560 644032478 643102705 642179132 641093194 639837623
2863.5F39837623j287639j264871j254022j213729j228094j321197j303911j121461
$$ 639837623 638549984 637285113 636031091 634817362 633589268 632268071 630964160 629842699
2879.9F29842699r31502q26299p49052o71386o15359n02348l33249l06308m44890n16414
$$ 629842699 628911197 628084898 627335846 626664460 626049101 625546753 625213504 624907196 624462306 623945892
2900.2F23945892m76658m83454n35071n43296n72860o80864q15332r55462j056254
$$ 623945892 623469234 622985780 622450709 621907413 621334553 620653689 619838357 618882895 617826641
2918.6F17826641r95875p28071m20153j78337K4915J15216J74701L31223N02348O56545
$$ 617826641 616830766 616102695 615682542 615504205 615529120 615644336 615819037 616150260 616652608 617309153
2939F17309153Q25107R33170Q85308P24137O33896P02500P52628O91592O46472P08104
$$ 617309153 618134260 619067430 619952738 620676875 621310771 622013271 622765899 623457491 624103963 624812067
2959.4F24812067Q21530Q73149Q89182R23276R70781J064241J145780J096904J093090
$$ 624812067 625633597 626506746 627395928 628319204 629289985 630354226 631500006 632596910 633690000
2977.8F33690000J203477J121104R28640R17077J013220J081705R94086P17997N09382
$$ 633690000 634893477 636014581 636943221 637860298 638873518 639955223 640949309 641667306 642176688
2996.1F42176688M15623K95937K04563J08957l695M291M7923r2447l49105n23448o16967
$$ 642176688 642592311 642888248 643092811 643201768 643198073 643202364 643250287 643157840 642808735 642285287 641668320
3018.5F41668320o79791o70433o27876o64472p40707p54595o72162o71207q14379q09014
$$ 641668320 640988529 640318096 639690220 639025748 638285041 637530446 636858284 636187077 635372698 634563684
3038.9F34563684o98447p39395q95799j014471r87410r15826r30428r30607r43959
$$ 634563684 633865237 633125842 632230043 631215572 630228162 629312336 628381908 627451301 626507342
3057.3F26507342j008213r40323p89702p46428q74997j030802r88305q15809o50525
$$ 626507342 625499129 624558806 623769104 623022676 622147679 621116877 620128572 619312763 618662238
3075.6F18662238o13391p92086r32157r25363r77039r75311q76665r34899j009702
$$ 618662238 618048847 617256761 616324604 615399241 614422202 613446891 612570226 611635327 610625625
3094F10625625r05812q03709q31008r12786r07600p99059p38144q14677q11815o41644
$$ 610625625 609719813 608916104 608085096 607172310 606264710 605465651 604727507 603912830 603101015 602459371
3114.4F02459371o16729p48158r32753j131177j090347q79348p45654p67171q95500
$$ 602459371 601842642 601094484 600161731 599030554 597940207 597060859 596315205 595548034 594652534
3132.8E94652534q97170p03156o22689q64387j065910r21011p19726o44684o17861
$$ 594652534 593755364 593052208 592429519 591565132 590499222 589578211 588858485 588213801 587595940
3151.1E87595940p45893r60767j015961r62556r06348q37982q00311q03828q23677
$$ 587595940 586850047 585889280 584873319 583910763 583004415 582166433 581366122 580562294 579738617
3169.5E79738617q55565q50916q16762q29459q64923q69930q58902q52108q51632q57770
$$ 579738617 578883052 578032136 577215374 576385915 575520992 574651062 573792160 572940052 572088420 571230650
3189.9E71230650q62718q83996r26137r37522q89718q32260q03113p95245q55446r30607
$$ 571230650 570367932 569483936 568557799 567620277 566730559 565898299 565095186 564299941 563444495 562513888
3210.3E62513888q90494p97510p90119q63254q97586q65579q41200q14617p51197o25313
$$ 562513888 561623394 560825884 560035765 559172511 558274925 557409346 556568146 555753529 555002332 554377019
3230.7E54377019n67555p91848j013577r06825p23719o99401p04527o94812p92384
$$ 554377019 553809464 553017616 552004039 551097214 550373495 549674094 548969567 548274755 547482371
3249E47482371q53657p26998o03020o37472p14362p29561p01904o57439n35607l66211
$$ 547482371 546628714 545901716 545298696 544661224 543946862 543217301 542515397 541857958 541322351 540956140
3269.4E40956140m79520q11875r26792q45075p54356p07507p16448p07150o41644n14686
$$ 540956140 540476620 539664745 538737953 537892878 537138522 536431015 535714567 535007417 534365773 533851087
3289.8E33851087m85182o69241q58605r96291j001239p35998m84765o06596j031101
$$ 533851087 533365905 532696664 531838059 530841768 529840529 529104531 528619766 528013170 526982069
3308.2E26982069j319408j269162j119256j082242j083374j033485r70304r83178j186073
$$ 526982069 525662661 524393499 523274243 522192001 521108627 520075142 519104838 518121660 516935587
3326.5E16935587j398742j351714j200676j115263j025796j084924j315593j411915
$$ 516935587 515536845 514185131 512984455 511869192 510843396 509758472 508442879 507030964
3342.8E07030964j396835j316726j126707j215219j591683j680940j436502j230150
$$ 507030964 505634129 504317403 503190696 501975477 500383794 498702854 497266352 496036202
3359.1D96036202j259357j346976j184731j014412j232803j625687j668542j374692
$$ 496036202 494776845 493429869 492245138 491230726 489997923 488372236 486703694 485329002
3375.5D85329002j206338j215846j238405j226396j112401r01342p11262p89612j096547
$$ 485329002 484122664 482906818 481668413 480442017 479329616 478428274 477717012 476927400 475830853
3393.8D75830853j126349p44611n41359r30757j337319j151323q19236p80881q02457
$$ 475830853 474704504 473959893 473418534 472487777 471150458 469999135 469179899 468399018 467596561
3412.2D67596561q09223q40127p73281o90848o44773n21362l51101k51621k96533k72423
$$ 467596561 466787338 465947211 465173930 464483082 463838309 463316947 462965846 462714225 462417692 462145269
3432.6D62145269j06782k29776n62608n81711l39062r6768J5319j9580J0967R3996
$$ 462145269 462038487 461808711 461246103 460664392 460325330 460228562 460243881 460224301 460235268 460329264
3453D60329264J16319K10911L28928K65062K54065N30451P12723M21494p480j2458
$$ 460329264 460445583 460656494 460985422 461250484 461504549 462035000 462747723 463169217 463161737 463149279
3473.4D63149279L02494N93066O42568M03672L43204N59568N72682M91232N87374O76423
$$ 463149279 463451773 464044839 464687407 465091079 465434283 465993851 466566533 467057765 467645139 468321562
3493.8D68321562O99132O80596O54638O53386N55396N07802O40571Q22425R95308Q99196
$$ 468321562 469020694 469701290 470355928 471009314 471564710 472072512 472713083 473535508 474530816 475430012
3514.2D75430012N96761N72980Q48234J071751R86814P98971P79807Q44807R65446
$$ 475430012 476026773 476599753 477447987 478519738 479506552 480305523 481085330 481930137 482895583
3532.5D82895583J163125J161307R40412R56923J180142J231075J025915R12517J022220
$$ 482895583 484058708 485220015 486160427 487117350 488297492 489528567 490554482 491466999 492489219
3550.9D92489219J094788J109898J206547J346201J292378J057803J082242J522779
$$ 492489219 493584007 494693905 495900452 497246653 498539031 499596834 500679076 502201855
3567.2E02201855J771450J565993J420438J497627J611054J725554J771689J684904
$$ 502201855 503973305 505539298 506959736 508457363 510068417 511793971 513565660 515250564
3583.5E15250564J607298J691700J838684J822650J848996J994729K105534K152920
$$ 515250564 516857862 518549562 520388246 522210896 524059892 526054621 528160155 530313075
3599.8E30313075K092778J919747J860380K059638K176285K158821K197504K200842
$$ 530313075 532405853 534325600 536185980 538245618 540421903 542580724 544778228 546979070
3616.1E46979070K529859K906740K369106J521766J472414K617836L256618K554894
$$ 546979070 549508929 552415669 554784775 556306541 557778955 560396791 563653409 566208303
3632.4E66208303K332747K376556K274633K186179J868725J445293J778007L264785
$$ 566208303 568541050 570917606 573192239 575378418 577247143 578692436 580470443 583735228
3648.8E83735228L644645K169668J929582K854704K738238K035797J676440J315653
$$ 583735228 587379873 589549541 591479123 594333827 597072065 599107862 600784302 602099955
3665.1F02099955J248956K034426K138614J449466K494633L003001J765013J225293
$$ 602099955 603348911 605383337 607521951 608971417 611466050 614469051 616234064 617459357
3681.4F17459357R17136O78301J434267K454281J920104R61363O65844N45978O70791
$$ 617459357 618376493 619054794 620489061 622943342 624863446 625824809 626490653 627036631 627707422
3699.8F27707422J198292J029133J23144j61231P23064J860678J269102J18911o5624
$$ 627707422 628905714 629934847 630057991 629896760 630619824 632480502 633749604 633868515 633802891
3718.1F33802891J69396L10958M28199M87984l3796n78523j32441J108050J742721
$$ 633802891 633972287 634283245 634711444 635199428 635165632 634587109 634454668 635562718 637305439
3736.5F37305439N37097j108229q00729J035452N17070m20153J126528J592278O4910
$$ 637305439 637842536 636734307 635933578 636969030 637486100 637065947 638192475 639784753 639849663
3754.8F39849663l99947L26395M71532j65343j94848J43886N46813P39276J31905l89397
$$ 639849663 639449716 639776111 640247643 640082300 639887452 640031338 640578151 641317427 641449332 641059935
3775.2F41059935j27673M64618L10600r1255J37985K42054K7419k37644m42207l33250
$$ 641059935 640932262 641396880 641707480 641616225 641754210 641996264 642023683 641786039 641343832 641010582
3795.6F41010582m59730k61903P88808M21822J6212O79613n484j076222q07046J76847
$$ 641010582 640550852 640288949 641077757 641499579 641515791 642195404 642189920 641113698 640306652 640483499
3816F40483499J0609J63615J027942J55091n21004m48644m34578l19838l90530k0266
$$ 640483499 640494108 640657723 641685665 641840756 641319752 640871108 640436530 640116692 639726162 639705896
3836.4F39705896O73056M50969J37031Q0168n85973j597226j669586P95246K676904
$$ 639705896 640378952 640829921 640966952 641047120 640461147 638863921 637194335 637989581 640666485
3854.8F40666485L09944j156867q94188k28703N7816m03821j12296N85318K72989j65462
$$ 640666485 640976429 639819562 638925374 638696671 638754487 638350666 638238370 638823688 639096677 638931215
3875.2F38931215o58274m56393J08540j21533Q7022r5904n94437O4075Q5950r40680
$$ 638931215 638272941 637816548 637925088 637803555 637890577 637794673 637200236 637264311 637350261 636409581
3895.5F36409581j122892m05193L32773P63059M67419l33011o66201o54816o35684
$$ 636409581 635286689 634881496 635214269 635977328 636444747 636111736 635445535 634790719 634155035
3913.9F34155035l16977M4941j10805m01973k78652k23458m88818l22341J29759J5974
$$ 634155035 633838058 633882999 633772194 633370221 633091569 632868111 632379293 632056952 632186711 632202685
3934.3F32202685l72708n11229m59135k19345j76549l59475k01345j5378j37627k57373
$$ 632202685 631829977 631318748 630859613 630640268 630463719 630104244 629902899 629887521 629749894 629492521
3954.7F29492521k74658k96950k36333j52230k40147l16978k72572j99914j48177j58488
$$ 629492521 629217863 628920913 628684580 628532350 628292203 627975225 627702653 627502739 627354562 627196074
3975.1F27196074k28167k96652k77698j80960j58966k64942l00348k36988k49684k95818
$$ 627196074 626967907 626671255 626393557 626212597 626053631 625788689 625488341 625251353 625001669 624705851
3995.5F24705851k64823
$$ 624705851 624441028
3997.5F24441028
$$ 624441028
##END=$$ End of the data block
