##TITLE=Sample description $$ Begin of the data block
##JCAMP-DX=5.00 $$ ACD/SpecManager v 10.08
##SPECTROMETER/DATA SYSTEM=Alpha
##DATE=03 Jun 2014 08:18:34
##DATA TYPE=INFRARED SPECTRUM
##DATA CLASS=XYDATA
##ORIGIN=
##OWNER=
##NPOINTS=1765
##FIRSTX=399.75695801
##LASTX=3997.56933594
##MAXX=3997.56933594
##MINX=399.75695801
##MAXY=0.79321706
##MINY=0.46418092
##XFACTOR=1.0000000000
##YFACTOR=1.000000000000000e-9
##FIRSTY=0.65416384
##DELTAX=2.03957629
##XUNITS=1/CM
##YUNITS=ARBITRARY UNITS
##XYDATA=(X++(Y..Y))
399.8 654163837 652405143 652108550 653790176 654846787 654036522 653385997 654852986 656968534 656558871
418.1 656558871 653946996 653356016 654821396 655424058 653952241 652657092 653520882 654726982 654156804
436.5 654156804 653544128 655090034 657118738 656909823 655595005 656151593 658461988 659351766 657599628
454.8 657599628 656192601 657595158 658938885 657340586 654966593 654992819 656466186 656130016 653816998
473.2 653816998 652785778 654009819 654765189 653415442 652284682 653721035 655940473 655911744 654180884
491.5 654180884 653883338 655401051 655915618 654383719 653153121 653964162 654970288 653989673 652159274
509.9 652159274 652087271 653342009 652963459 650623322 649557710 650920749 652061403 651184082 650222480
528.3 650222480 651550114 653922021 654666781 654203594 655089438 657598138 659102082 658265412 657260716
546.6 657260716 658027470 659024596 658021748 655991554 655402005 655919135 655240893 653178036 651789427
565 651789427 651770949 651532829 650172770 648943484 649331510 650794744 651553392 651580989 652518332 654708266
585.4 654708266 656532645 656973600 657169163 658340752 659633338 659567833 658511639 658221602 659037173
603.7 659037173 659542680 659127891 658913732 659716785 660692513 660968721 661230087 662585318 664793491
622.1 664793491 666648209 667725384 668851137 670413315 671668172 672076762 672223032 672988892 674230456
640.4 674230456 675013602 675049841 675052464 675584197 676419139 676967800 677147329 677535176 678299725 678903699
660.8 678903699 679149866 679337859 679268479 679205835 679972351 680813730 681525230 682372689 683109701 683534563
681.2 683534563 683888435 684483886 685236871 685721576 685782909 685688317 685678661 685596049 684989989 683925271
701.6 683925271 683183014 683198869 683578491 683801115 684040546 684933901 686524808 688092411 689367115
720 689367115 690997839 693318427 695655048 697198451 698108196 699231446 700743496 701793909 701776981
738.3 701776981 701284587 701095998 700878322 699831009 698097825 696617961 695813656 694985032 693512022
756.7 693512022 692117631 691821218 692363560 692852795 693398058 694968760 697710156 700467467 702403486
775 702403486 704124391 706500947 709081173 710749686 711575568 712701142 714518726 716106117 716890931
793.4 716890931 717800081 719822288 722367108 724129438 724983692 726070702 727847278 729162872 729212761
811.7 729212761 728890359 729301810 729995310 729581296 727936745 726460040 725759149 724584043 721975625
830.1 721975625 719001830 717050731 715777993 713967860 711621881 710050881 709812045 709776580 708940446
848.5 708940446 708028674 708227634 709115863 709258437 708668053 709002972 711000383 713354349 714837134
866.8 714837134 716098666 718200028 720472693 721297801 720510721 719586968 719221950 718177557 715535462
885.2 715535462 712552905 710820377 709925532 708375096 706117094 704641223 704502702 704235733 702585638
903.5 702585638 700481653 699403584 698873580 697284400 694603384 692485452 691719234 691068172 689462066
921.9 689462066 687904239 687803924 688624263 688704610 687932134 687864363 689133108 690451205 690720201 690779984
942.3 690779984 691873729 693296432 693222106 691479325 689695716 688621819 687113166 684240103 680938125
960.6 680938125 678569376 676777720 674132168 670524597 667400181 665360630 663190007 659966230
977 659966230 656589746 654319227 652848780 650939047 648523331 646856010 646462440 646256328 645263076
995.3 645263076 644128740 643982232 644498169 644347131 643312931 642509401 642441809 642217040 641084671
1013.7 641084671 639729679 639265597 639553368 639582515 639163852 639156461 640045285 641052365 641239882 641004503
1034.1 641004503 641369522 642208636 642502010 642104745 641963661 642575502 643307388 643546581 643749177 644714832
1054.5 644714832 646299958 647673428 648666382 649968922 651869476 653539896 653861940 652732909 651055634
1072.8 651055634 649484694 647979796 646619916 645994782 646405876 647322834 648079574 648690283 649594665
1091.2 649594665 650824428 651843309 652287543 652471185 652841270 653302252 653496444 653506279 653758824 654370666
1111.6 654370666 655004680 655406296 655760288 656351805 657145798 657817602 658272088 658903480 660032094
1129.9 660032094 661325872 662146330 662347257 662228584 661848783 660943747 659515738 658006251 656798184
1148.3 656798184 655864120 654933631 653999090 653456509 653528869 653938055 654453158 655301988 656792879 658854365
1168.7 658854365 661077976 663235664 665598452 668396056 671314657 673909903 676141679 678277254
1185 678277254 680330515 681923211 682856441 683399439 683889091 684293866 684400439 684350252 684616566 685387731
1205.4 685387731 686318696 687082767 687836289 688882113 690069973 690909088 691244245 691410482 691661239
1223.7 691661239 691784799 691508234 691007733 690711856 690705121 690639555 690322697 690095067 690302670 690688312
1244.1 690688312 690830410 690868735 691237628 691922367 692484796 692714751 692916632 693445027 694135129 694570363
1264.5 694570363 694770396 695131540 695772409 696335196 696490169 696419597 696527779 696776748 696766436 696417928
1284.9 696417928 696090758 696024418 695960581 695519567 694866419 694500387 694433212 694186330 693664312 693358541
1305.3 693358541 693515182 693715096 693455517 692898154 692607164 692579150 692289770 691578805 690876961 690540075
1325.7 690540075 690243602 689470410 688432932 687808454 687656641 687325299 686655104 686356843 686679721
1344.1 686679721 687000334 686738074 686112642 685789526 685827017 685666680 685049772 684269786 683767498 683641315
1364.5 683641315 683349371 682720542 682438493 682612658 682654560 682478845 682398319 682526290 682725787 682906568
1384.9 682906568 683249891 684138477 685376704 686003923 685638607 685207129 685316741 685637414 685493410
1403.2 685493410 684804320 684463501 684616625 684543312 684035718 683525920 683156133 682813168 682663143 682570755
1423.6 682570755 682714045 683207929 683390975 683243752 683278322 683393896 683707416 684249699 684549809 684771895
1444 684771895 685076475 685020983 684665978 684496582 684495211 683851600 682901025 683293581 684340537 685327113
1464.4 685327113 686464667 687858284 689266562 690956533 693319440 695900321 698353231 700845957
1480.7 700845957 703445077 705710530 707360506 708918095 711196959 713697791 715526283 716790676
1497 716790676 718377650 720325112 721844375 722305834 722381532 723865688 725733876 726925433 727513492
1515.4 727513492 728087783 728870034 729583025 730381906 731345594 732408762 733486712 734116614 734391212
1533.7 734391212 735030174 735579550 735372066 735477924 736541688 737828076 738793254 739277959 739563823
1552.1 739563823 739821017 739882827 739481330 739730418 741010249 742017686 742495060 742505014 742381334 742594957
1572.5 742594957 742616832 742098451 741832852 741781473 741428554 740782261 739858270 738662958 737262428 735686123
1592.9 735686123 733910203 731966019 729827046 727423608 724791050 721967697 718921840 715657413
1609.2 715657413 712385237 709172666 705308199 700800717 697617173 695079505 691926718 689056695
1625.5 689056695 686829269 685039759 683856368 682669520 681091130 680613577 681326330 682240367 683046818
1643.9 683046818 683763564 685143709 687184572 689003170 691094875 693982244 696779251 699224770
1660.2 699224770 701593757 704173505 706686378 709021389 711574137 714348555 717181504 720134318
1676.5 720134318 722935259 725332677 727468789 730189502 733387351 736274958 738914192 741188049
1692.8 741188049 743139982 744992793 746962786 749405086 751846492 753926635 755944848 757872343
1709.2 757872343 759487569 760650992 761453390 762498438 764251590 766054630 767443955 768553555
1725.5 768553555 769494236 770273507 770878196 771557033 772752345 774004757 775003254 775937796 776868880
1743.8 776868880 777664244 778299391 778997183 779942513 780854881 781533241 782097399 782608032 783148408 783793151
1764.2 783793151 784255862 784378767 784378171 784611344 785299778 786049724 786522746 786843777 787231505 787657797
1784.6 787657797 788011014 788175702 788191795 788475811 789082050 789551020 789797068 790107548 790596306 791027904
1805 791027904 791268945 791439891 791697085 792019248 792281568 792495131 792725861 792866647 792831302 792783678
1825.4 792783678 792800426 792797804 792916894 793119907 793212533 793217063 793115914 792801499 792396486 792305171 792458415
1847.8 792458415 792512178 792430162 792334735 792279065 792173326 791994512 791847050 791724563 791467428 791190624
1868.2 791190624 791267157 791593194 791813970 791857779 791830778 791824400 791849732 791861296 791788101 791657865 791659951
1890.7 791659951 791742682 791723967 791665852 791627884 791558146 791421175 791246176 791063130 790908456 790843427 790774643
1913.1 790774643 790550709 790257037 790079355 789971232 789879501 789891601 789938509 789870918 789714456 789581239
1933.5 789581239 789499223 789409935 789230466 789034963 789047897 789234221 789356053 789366722 789364278 789384782 789408326
1955.9 789408326 789424658 789425075 789436638 789443731 789395690 789358258 789384246 789409339 789363980 789270163 789199948 789154112
1980.4 789154112 789084375 788953185 788773000 788572907 788350761 788153887 788012087 787846506 787625194 787372828
2000.8 787372828 787100852 786816895 786465108 785998344 785471678 784948885 784402966 783802867 783195853 782616079
2021.2 782616079 782063603 781513095 780922413 780325890 779782474 779251695 778675616 778102756 777613163 777204037
2041.6 777204037 776818931 776431978 776108563 775925517 775810480 775653541 775491178 775428534 775459707 775461853
2062 775461853 775392532 775340796 775339127 775310159 775251389 775254428 775322497 775335371 775225222 775103033 775089502 775124192
2086.5 775124192 775090694 775003552 774966359 775024295 775104284 775082648 774971366 774951279 775038958 775029898 774900019
2108.9 774900019 774815321 774812698 774794519 774708152 774605274 774541020 774460196 774295807 774088025 773946106 773906291
2131.3 773906291 773844719 773696184 773555577 773462653 773352742 773201585 773053944 772966087 772960544 772980213 772979498
2153.8 772979498 773007691 773093581 773203492 773312211 773453116 773684323 774000347 774321795 774610281 774915159
2174.2 774915159 775241792 775555789 775873542 776209176 776558876 776913166 777252614 777564168 777861416 778157532
2194.6 778157532 778439939 778722227 779047012 779414177 779764891 780077100 780378640 780661941 780914962 781179070
2215 781179070 781478345 781757057 781969070 782153666 782372653 782592654 782717586 782759130 782837570 783002675
2235.4 783002675 783140779 783160567 783158720 783260047 783414423 783478796 783454597 783472300 783569038 783642054 783627450
2257.8 783627450 783623278 783743501 783929288 784050524 784117579 784243405 784443915 784593225 784624338 784663975
2278.2 784663975 784827709 784993470 784984887 784855008 784786701 784807324 784753442 784558296 784382999 784342408 784293711
2300.6 784293711 784033179 783625185 783306420 783104718 782833695 782443285 782079101 781783223 781434298 780967712
2321 780967712 780469477 780045569 779665887 779222965 778751910 778400123 778165042 777897656 777489364 777105033
2341.4 777105033 777133107 777566016 777716637 777175009 776165962 775127232 774268925 773519933 772988915
2359.8 772988915 772815108 772893906 773055315 773244858 773641586 774235845 774669290 774896562 775140524 775425792
2380.2 775425792 775611997 775564969 775332093 775072753 774819672 774523556 774159789 773766637 773416877 773084939
2400.6 773084939 772660851 772152126 771713674 771363616 770946860 770397186 769803524 769275427 768781304 768194437
2421 768194437 767556548 766996980 766498029 765991390 765420675 764793217 764198840 763618529 762957096 762246192
2441.3 762246192 761609972 761060178 760504961 759913087 759315550 758760810 758240521 757687747 757138014 756663144
2461.7 756663144 756234407 755783737 755285382 754788876 754337668 753895283 753436506 753007650 752633691 752266884
2482.1 752266884 751870871 751483798 751133978 750802100 750478089 750151277 749814630 749507129 749275148 749065995
2502.5 749065995 748786807 748465717 748187661 747945786 747669339 747326672 746976674 746664166 746295273 745832384
2522.9 745832384 745395362 745027840 744644940 744181216 743683815 743241251 742832541 742382050 741888583 741394222
2543.3 741394222 740944505 740525305 740058243 739535749 739037156 738610268 738208652 737785876 737356365 736938298
2563.7 736938298 736533821 736097932 735594749 735118628 734756351 734424829 734006584 733545542 733173192 732868195
2584.1 732868195 732508242 732084453 731704116 731417477 731131315 730766118 730358064 729980052 729628146 729211271
2604.5 729211271 728717506 728240728 727807224 727336109 726766169 726166248 725623608 725070953 724380612 723568559
2624.9 723568559 722818375 722219050 721605241 720840454 720048070 719394624 718787551 718021452 717181385 716503799
2645.3 716503799 715933383 715290129 714566231 713856697 713236153 712655902 712020874 711375296 710840106 710380256
2665.7 710380256 709833205 709194601 708624423 708184779 707758486 707244039 706687629 706198752 705809832 705406249
2686.1 705406249 704898238 704393625 703983307 703550816 703009069 702441454 701943278 701510966 701057851 700537086
2706.5 700537086 700013459 699539602 699042916 698443115 697804034 697273254 696865261 696405768 695842683 695321620
2726.9 695321620 694876194 694397330 693818152 693228662 692783713 692437887 692016006 691527367 691138327 690886736
2747.3 690886736 690593004 690119207 689591646 689208627 688951135 688655138 688260198 687862813 687564790 687312007
2767.7 687312007 686957717 686544657 686221123 685895920 685445786 684961140 684537351 684161305 683760941 683297992
2788.1 683297992 682779610 682229340 681703746 681182921 680576682 679903567 679247618 678594708 677901506 677187443
2808.5 677187443 676477313 675767541 675026953 674244821 673468232 672722757 671935380 671039820 670104384 669216156
2828.9 669216156 668367982 667518198 666650891 665799439 664876997 663717806 662407756 661114931 659836173
2847.2 659836173 658541679 657269299 656093538 655055761 654112101 653146982 652061403 650852799 649580777
2865.6 649580777 648290753 647015214 645790756 644555926 643230081 641932487 640822709 639881432
2881.9 639881432 639036238 638296127 637668848 637099445 636581242 636169016 635810733 635365605 634837925 634343266
2902.3 634343266 633879781 633383453 632889450 632415771 631835282 630988419 629915714 628833592 627898157
2920.6 627898157 627196372 626765847 626619756 626694441 626817405 626997292 627365649 627882957 628485799 629266143
2941 629266143 630241752 631211162 631978154 632617176 633369267 634206355 634930611 635584235 636344075 637250543
2961.4 637250543 638180494 639054060 639955223 640977442 642104268 643250644 644352496 645480096 646709383
2979.8 646709383 647885561 648889065 649853289 650890768 652005196 653048933 653795898 654330313 654812157
2998.1 654812157 655154765 655338585 655430555 655459344 655519128 655626595 655596614 655282617 654762864 654167116
3018.5 654167116 653514683 652832508 652162969 651486576 650797307 650106728 649436891 648733974 647914648 647107124
3038.9 647107124 646394074 645644426 644743562 643719792 642745793 641849995 640922070 640001893 639074385
3057.3 639074385 638073921 637123287 636322200 635593474 634731710 633670807 632654548 631818891 631096542
3075.6 631096542 630416870 629635036 628709912 627754927 626776218 625811160 624919176 623971343 622952580
3094 622952580 622024357 621216297 620408714 619511962 618592322 617782533 617058694 616244018 615404367 614751816
3114.4 614751816 614164054 613439679 612494946 611312449 610134423 609203279 608439982 607638359 606738091
3132.8 606738091 605879426 605192363 604521513 603595853 602526009 601593375 600797892 600114226 599524856
3151.1 599524856 598761857 597735763 596714795 595779717 594863594 593995154 593148649 592276931 591389596
3169.5 591389596 590505898 589640677 588784754 587894976 586990654 586133122 585288346 584380388 583452463 582563460
3189.9 582563460 581672668 580734968 579746604 578759909 577808142 576892614 576025367 575178921 574288547 573361874
3210.3 573361874 572492182 571671009 570830643 569952428 569027185 568100691 567187965 566271067 565428019 564752460
3230.7 564752460 564135849 563271224 562178075 561232388 560496807 559788942 559108734 558415294 557575464
3249 557575464 556703150 555944622 555251002 554561913 553865433 553161979 552442610 551724255 551142633 550722837
3269.4 550722837 550143898 549283445 548413098 547630906 546852827 546055675 545280278 544558346 543878376 543279529
3289.8 543279529 542710841 542021275 541166484 540134549 539050698 538223863 537699282 537050664 535929918
3308.2 535929918 534524143 533185899 532018900 530897260 529718518 528533280 527446032 526420891
3324.5 526420891 525206327 523776710 522415459 521174133 519938707 518732846 517472565 516045511
3340.8 516045511 514544606 512989044 511460781 510169029 508892179 507280767 505526543 503969431
3357.1 503969431 502606690 501224637 499759704 498458475 497372270 496088862 494384497 492625266
3373.4 492625266 491169453 489900261 488587886 487163961 485759884 484543830 483556956 482801050 481978744
3391.8 481978744 480766773 479522854 478738517 478176832 477187276 475733995 474459082 473618746 472903937
3410.1 472903937 472101212 471200556 470289499 469523042 468858808 468167871 467561364 467164457 466867536 466517657
3430.5 466517657 466231018 466117114 465902537 465371698 464781195 464445978 464330882 464245051 464180917 464260757
3450.9 464260757 464433432 464637250 464955032 465369374 465680599 465929717 466456980 467192262 467669904 467782348
3471.3 467782348 467896491 468279123 468919486 469607413 470072508 470454901 471020043 471644878 472258478 472973794
3491.7 472973794 473761052 474573970 475352645 476084560 476840317 477523476 478147238 478879064 479739368 480764627
3512.1 480764627 481808275 482629925 483374506 484287500 485387892 486446530 487323195 488186121 489161849
3530.5 489161849 490255922 491515368 492807567 493903399 494975984 496260166 497623235 498811156
3546.8 498811156 499877125 501033306 502311885 503661811 505034864 506403983 507696748 508833528
3563.1 508833528 510033309 511689782 513661504 515485048 517150521 518854439 520631254 522461116
3579.4 522461116 524284780 526058972 527861893 529771507 531804562 533842862 535901070 538079977
3595.7 538079977 540358722 542721152 545053363 547141492 549093127 551314533 553812623 556286633
3612.1 556286633 558640182 560923219 563576341 566663146 569262505 571010947 572598338 575264335
3628.4 575264335 578757465 581636429 584163368 586669266 589089811 591393411 593345106 594884753
3644.7 594884753 596762240 600130856 603926599 606300771 608425379 611400247 614240229 616432786
3661 616432786 618313432 619808733 621119261 623129964 625309765 626829982 629292130 632310212 634237528
3679.4 634237528 635625422 636638463 637360334 638799310 641297102 643365741 644499660 645277381 645873249
3697.7 645873249 646583498 647828817 648930252 649141729 649021208 649730623 651602626 652957141 653124690
3716.1 653124690 653020799 653163433 653490007 653953552 654532790 654624879 654164970 654112279 655174255 656770647
3736.5 656770647 657195032 656065345 655307949 656388938 656989217 656681836 657856524 659450769 659528315
3754.8 659528315 659165323 659553289 660075605 659965396 659818828 659902453 660339773 661071658 661259234 660945177
3775.2 660945177 660921514 661478043 661832988 661724448 661837518 662099063 662150502 661919415 661466360 661143482
3795.6 661143482 660767615 660599828 661433160 661912441 661969006 662620127 662632108 661617219 660810173 660922408
3816 660922408 660840631 660906076 661914468 662153840 661723495 661346436 660975635 660695255 660302162 660262764
3836.4 660262764 660975099 661503732 661718845 661855936 661230206 659507930 657723367 658546865 661408305
3854.8 661408305 661857903 660739243 659823000 659586489 659670234 659264147 659135163 659737945 660018623 659821987
3875.2 659821987 659176469 658786654 658930421 658860266 659057498 658994496 658344090 658412933 658562899 657645464
3895.5 657645464 656528533 656128347 656416953 657084048 657496214 657238007 656700253 656122804 655511379
3913.9 655511379 655207872 655298769 655259848 654905498 654594362 654316843 653825045 653439999 653511047 653628826
3934.3 653628826 653320134 652741313 652284563 652185380 652142704 651896358 651754439 651712954 651532650 651244462
3954.7 651244462 650913477 650625706 650450945 650276661 650032222 649827957 649662435 649437010 649157047 648906946
3975.1 648906946 648735046 648590744 648428857 648237407 647958279 647619605 647347033 647136629 646934986 646771789
3995.5 646771789 646614552
3997.5 646614552
##END=$$ End of the data block
