##TITLE=Sample description $$ Begin of the data block
##JCAMP-DX=5.00 $$ ACD/SpecManager v 10.08
##SPECTROMETER/DATA SYSTEM=Alpha
##DATE=03 Jun 2014 08:18:22
##DATA TYPE=INFRARED SPECTRUM
##DATA CLASS=XYDATA
##ORIGIN=
##OWNER=
##NPOINTS=1765
##FIRSTX=399.75695801
##LASTX=3997.56933594
##MAXX=3997.56933594
##MINX=399.75695801
##MAXY=0.79929936
##MINY=0.46957400
##XFACTOR=1.0000000000
##YFACTOR=1.000000000000000e-9
##FIRSTY=0.65090698
##DELTAX=2.03957629
##XUNITS=1/CM
##YUNITS=ARBITRARY UNITS
##XYDATA=(X++(Y..Y))
399.8F50906980j584649q47578J673698J895428o50287j089632J136780J671612p35402
418.1F52376950k349258r715J513779k62022j763404l83436J330018N64515j265168
436.5F49752259q95381J395703K411782O49691j011968K11001K157628J286388j345277
454.8F54611826j511097R72211J276613j306117k419054l44635J331926l51429k401590
473.2F49858654r09210J656413J232982j188993j274765J298666K118468k79963j988411
491.5F50523841k32696J805246P28130j544952j280189R55999J051068j230538k093255
509.9F48682654j91748J165449l21924k047777q46386J486241J229406j027704j166224
528.3F46961987J295924K511621J035630l01539Q72314K445876J276732j061917j054823
$$ y = [650906980, 649322331, 648474753, 650148451, 652043879, 651393592, 650303960, 651440740, 653112352, 652376950, 650027692, 650017977, 651531756, 651269734, 649506330, 649122894, 650452912, 651017427, 649752259, 648856878, 650252581, 652664363, 653314054, 652302086, 652513087, 654670715, 655957103, 654611826, 653100729, 654072940, 655349553, 654043436, 651624382, 651279747, 652611673, 652260244, 649858654, 648949444, 650605857, 651838839, 650649846, 649375081, 650673747, 652792215, 652512252, 650523841, 650291145, 652096391, 652824521, 651279569, 649999380, 650955379, 652006447, 650775909, 648682654, 648490906, 649656355, 649334431, 647286654, 646440268, 647926509, 649155915, 648128211, 646961987, 648257911, 650769532, 651805162, 651503623, 652375937, 654821813, 656098545, 655036628, 653981805]
546.6F53981805P28845J015306q41916j905024n61535N17845o75559k134919j633883
565F48490965q4936K6762j276374j419782K37822J484394Q86023J24276R84371K186894
585.4F51640415J855076N25236J17242R43184J134932o5923r18150j43230R23455O36339
605.8F56648576l13997j73390Q42869J100839M29153K49147J269341K230942J945019
624.1F64228499J162469J154363J592398J430690O04988N5730M34577J012505Q21113
642.5F72497332K85506K81215O39677P61032M45903J81496M97639Q49724O07729K91764
662.9F77339017K65599L636O2763P50721O78837N92411Q56280Q32796N60701M50313
683.3F82393074O02007P76708O38962J64509k08557j65045j57118n78404r07301o06239
$$ y = [653981805, 654710650, 655725956, 654884040, 652979016, 652417481, 652935326, 652259767, 650124848, 648490965, 648406029, 648432791, 647156417, 645736635, 645974457, 647458851, 648344874, 648469150, 649453521, 651640415, 653495491, 654020727, 654137969, 655081153, 656216085, 656150162, 655232012, 655088782, 656012237, 656648576, 656334579, 656161189, 657004058, 658104897, 658534050, 658783197, 660052538, 662283480, 664228499, 665390968, 666545331, 668137729, 669568419, 670173407, 670229137, 670663714, 671676219, 672497332, 672782838, 673064053, 673703730, 674464762, 674910665, 675092161, 675589800, 676439524, 677047253, 677339017, 677604616, 677608252, 677671015, 678421736, 679100573, 679692984, 680549264, 681382060, 681942761, 682393074, 682995081, 683771789, 684410751, 684575260, 684366703, 684201658, 684044540, 683466136, 682558835, 681952596]
703.7F81952596P927L16858J94312K62796R68039J705111J686930J291216J497566
722F89883351K190590K367556J707137J082480J167536J413941R89080J6629m74453
740.4G00343847j81317j26422r34779j738846j583398r07719q76725j424074j281082
758.7F91289485k05517O02722N09620N41806J636266K866090K862930K010048J740038
777.1G03853488K334297K558589J676976Q14259J121760J896560J738846Q59082Q71599
795.4G17725456K040028K634228J807153Q76665J072109J712143J313210P6472l49640
813.8G28907824L86595P19846l04699j492381j434565p98523j256526k608955l034055
832.1G19084561k068102j272619j700104k269923j547516j94609R120q35657r49562
$$ y = [681952596, 681960523, 682277381, 682471693, 682734489, 683702528, 685407639, 687094569, 688385785, 689883351, 692073941, 694441497, 696148634, 697231114, 698398650, 699812591, 700801671, 700818300, 700343847, 700162530, 700036108, 699101329, 697362483, 695779085, 694871366, 693994641, 692570567, 691289485, 691083968, 691686690, 692196310, 692738116, 694374382, 697240472, 700103402, 702113450, 703853488, 706187785, 708746374, 710423350, 711237609, 712359369, 714255929, 715994775, 716853857, 717725456, 719765484, 722399712, 724206865, 725083530, 726155639, 727867782, 729180992, 729257464, 728907824, 729294419, 730014265, 729709566, 728217185, 726782620, 725984097, 724727571, 722118616, 719084561, 717016459, 715743840, 714043736, 711773813, 710226297, 710031688, 710040808, 709205151, 708255589]
850.5G08255589K09570J008630K96592m87923L10242J877427K290607J496672J228571
868.9G16485977K006829K228260Q62122p37191r78529m73857r98139k546370l052891
887.2G12796211j825869q46326j458466k232790j510561j97053k71916j580417k040565
905.6G00832248j033008n00322j638949k794265k162695o86944n33640j553118j572788
923.9F88356519j10865Q24988R7811p59184o5208J317680J374305L02553R9659J084983
944.3F92523241J337826j74701j806438j807034j069426j496971k877474l322184k365708
962.7F78941131j734436k564609l541827l113091k071023k157092l190935l415763
979F57152355k303183j395822j825869k421916j708924l79086j08838q71181j069069
$$ y = [708255589, 708465159, 709473789, 709770381, 709282458, 709592700, 711470127, 713760734, 715257406, 716485977, 718492806, 720721066, 721583188, 720845997, 719867468, 719393611, 718395472, 715849102, 712796211, 710970342, 710124016, 708665550, 706432760, 704922199, 704725146, 704453230, 702872813, 700832248, 699799240, 699298918, 697659969, 694865704, 692703009, 692016065, 691482425, 689929307, 688356519, 688245654, 689070642, 689168453, 688409269, 688344061, 689661741, 691036046, 691338599, 691438258, 692523241, 693861067, 693686366, 691879928, 690072894, 689003468, 687506497, 684629023, 681306839, 678941131, 677206695, 674642086, 671100259, 667987168, 665916145, 663759053, 660568118, 657152355, 654849172, 653453350, 651627481, 649205565, 647496641, 647117555, 647008717, 646137536, 645068467]
997.3F45068467j60456M97639j13189j002669q19803o0737j52349j043022j327455
1015.7F40886426n20110K25186m113m43398l0518Q22902R30547K45631q5950M22418
1036.1F42449021Q36671L23951l69787j46449O03855P70390K88427J54018Q60691J579046
1056.5F47349834J441360R96053J224995J845360J710593M16756j067936j673937j555622
1074.8F50687456j440287j330852o86109L38375Q76844P34568O05166R17554J276672
1093.2F51979387J068234M62353J72914L49283M90010K55644j0669J83582O22868P12872
1113.6F56286478M72844L58998N22495P28965O84022N00918O27518J078486J254141
1132F62514865Q43287K43544j27017l60549p68959j292348j499295j238465r11832
$$ y = [645068467, 644908011, 645405650, 645292461, 644289792, 643469989, 643409252, 643256903, 642213881, 640886426, 640366316, 640591502, 640587389, 640143991, 640113473, 640936375, 641866922, 642112553, 642026603, 642449021, 643285692, 643609643, 643239856, 643093407, 643697262, 644467652, 644756079, 644910097, 645770788, 647349834, 648791194, 649787247, 651012242, 652857602, 654568195, 654984951, 653917015, 652243078, 650687456, 649247169, 647916317, 647230208, 647568583, 648445427, 649179995, 649785161, 650702715, 651979387, 653047621, 653509974, 653682888, 654032171, 654522181, 654777825, 654767156, 654950738, 655573606, 656286478, 656759322, 657118320, 657640815, 658369780, 659053802, 659554720, 660182238, 661260724, 662514865, 663358152, 663601696, 663474679, 663114130, 662345171, 661052823, 659553528, 658315063, 657403231]
1150.3F57403231q71301r08256n83827N3465M60625N26488P71522J419485K035320
1168.7F60306752K221048K202868K413511K775669K888203K611637K236605K113938
1185F79770231K066791J646817R58383N42581N11050M39525J32084l0994K71141P60853
1205.4F87068462R34303P85113P98404J096844J207769Q40783L42310J72913K41876
1223.7F93488777J21951k69473n26786l41117j8954k8968k59936k01881J98185M01199
1244.1F92562997J93596M9949L31342O84261N99385K34604J62422M82619O94573N00619
1264.5F96496367K63870L94166O74963O03795J79887o7175J06335K44021l9100l78907
1284.9F98478222l15249l1829m3213m38691o59883l51250j9788j77741m78626l42250
$$ y = [657403231, 656531930, 655623674, 655039847, 655093312, 655553937, 656080425, 656851947, 658271432, 660306752, 662527800, 664730668, 667144179, 669919848, 672808051, 675419688, 677656293, 679770231, 681837022, 683483839, 684442222, 684984803, 685495853, 685935378, 686067462, 686036468, 686307609, 687068462, 688002765, 688787878, 689586282, 690683126, 691890895, 692731678, 693073988, 693246901, 693488777, 693610728, 693341255, 692814469, 692473352, 692454398, 692425430, 692165494, 691963613, 692161798, 692562997, 692756593, 692806542, 693137884, 693822145, 694421530, 694656134, 694818556, 695301175, 695995748, 696496367, 696760237, 697154403, 697829366, 698433161, 698613048, 698545873, 698652208, 698896229, 698857129, 698478222, 698162973, 698131144, 698087931, 697649240, 696989357, 696638107, 696618319, 696440578, 695961952, 695619702]
1305.3F95619702R7275K11775k08854n72562l53158m3333k53975o55830o59585l32773
1325.7F92848682k86042p30098r88841o07431j97887l82304o70374k80976L48389L68238
1346.1F89421356k11597o11365l45289L0458j45793o26803p96914m70340n6148k41398
1366.5F85946167o23465k98262J65999L8445j97589r2268J67131K49684K11299L76999
1386.9F85944140Q98480J195074N42104m72605m79758J80423M51744p6533p09533l50655
1407.3F87122881J83165n1975n11884n54860m28557l06964l6717m1246J09970M58420
1427.7F85942233K03251r9182O5565J22488L21686N79953L40522K21610K88129l2246
1448.1F87954009l27707j93298n3882o68884q96751M76539J097142R85146J130223
$$ y = [695619702, 695716977, 695928752, 695719898, 695147336, 694794178, 694750845, 694496870, 693841040, 693181455, 692848682, 692562640, 691832542, 690843701, 690236270, 690038383, 689656079, 688985705, 688704729, 689053118, 689421356, 689209759, 688598394, 688253105, 688283563, 688137770, 687510967, 686714053, 686243713, 686187565, 685946167, 685322702, 685024440, 685190439, 685228884, 685031295, 684939027, 685106158, 685355842, 685567141, 685944140, 686842620, 688037694, 688579798, 688107193, 687627435, 687807858, 688259602, 688183069, 687473536, 687122881, 687306046, 687254071, 686742187, 686187327, 685758770, 685451806, 685415089, 685373843, 685483813, 685942233, 686145484, 686046302, 686111867, 686234355, 686556041, 687135994, 687476516, 687698126, 687986255, 687954009, 687626302, 687433004, 687379122, 686710238, 685813487, 686290026, 687387168, 688372314, 689502537]
1466.4F89502537J406551J387655J659990K389133K618372K456606K475917K616942
1482.8G06513703K328277J699984J563310K290487K556861J861751J211941J535833
1499.1G21562147J989842J592457M64976l994J473665J944542J254976N78880N49794
1517.4G31407285P49588O44088P98523J019776J119017J132787O58691K86698O58572
1535.8G38475025N30958k79129P4745J084685J328051J019239N34416L08811K36035
1554.1G43312836J7941m31955L15904J358748R78827L80338o0499j13905K39909m3869
1574.5G45954275o28233k77877l1948l79920p09593j010418j305521j533210j707494
1592.9G38370061j901686k102614k315461k551496k750516k939284l198266l464282
$$ y = [689502537, 690909088, 692296743, 693956733, 696345866, 698964238, 701420844, 703896761, 706513703, 708841980, 710541964, 712105274, 714395761, 716952622, 718814373, 720026314, 721562147, 723551989, 725144446, 725609422, 725605428, 727079093, 729023635, 730278611, 730857491, 731407285, 732156873, 732800961, 733599484, 734619260, 735738277, 736871064, 737529755, 737816453, 738475025, 739005983, 738726854, 738801599, 739886284, 741214335, 742233574, 742767990, 743076801, 743312836, 743330777, 742898822, 743214726, 744573474, 745552301, 745932639, 745872140, 745758235, 745998144, 745954275, 745326042, 745048165, 745016217, 744636297, 743926704, 742916286, 741610765, 740077555, 738370061, 736468375, 734365761, 732050300, 729498804, 726748288, 723809004, 720610738, 717146456]
1609.2G17146456l466606l364205m023969m703463l332138k639889l242672k923667
1625.5F89449847k263606j829564j189769j160621j527310l58522Q74937J058876R32873
1643.9F83987141Q99911J617848K235055K011300K329349L102243L002048K625465
1660.2G01810360K523839K763689K693474K482951K700508K920091K956509L068209
1676.5G23919630K910614K475381K163947K758383L316105L024637K741755K312004
1692.8G45622456J937985J848341K002239K512216K538920K161801K071142J964569
1709.2G62659669J651704J177967P73907J037418J810074J865149J441121J165092
1725.5G73582101R91464Q01384N96821O65188J202226J268446J019001R84311R94563
$$ y = [717146456, 713679850, 710315645, 706291676, 701588213, 698256075, 695616186, 692373514, 689449847, 687186241, 685356677, 684166908, 683006287, 681478977, 681120455, 681995392, 683054268, 683987141, 684887052, 686504900, 688739955, 690751255, 693080604, 696182847, 699184895, 701810360, 704334199, 707097888, 709791362, 712274313, 714974821, 717894912, 720851421, 723919630, 726830244, 729305625, 731469572, 734227955, 737544060, 740568697, 743310452, 745622456, 747560441, 749408782, 751411021, 753923237, 756462157, 758623958, 760695100, 762659669, 764311373, 765489340, 766263247, 767300665, 769110739, 770975888, 772417009, 773582101, 774573565, 775374949, 775971770, 776636958, 777839184, 779107630, 780126631, 781110942, 782105505]
1743.8G82105505Q41618O54638P08639R93252R65238O93977N62608N04673N33700O39677
1764.2G89203525M57286J34230L2604K76565P22826P62820M68731L26336M38094M80473
1784.6G93303490L53276J46389K9505L16798O16789M62055K49565L44634N42879M59433
1805G96824813K46882J87755K71499L17514K42531K03967K80202K17974k3842q9586
1825.4G98679709m053J2219J58906K39671J33276P9631k8789l04401m42564j08242
1845.8G98415363J63555N4777p6831p7724l6359n2810j04427j09851j26183k71619
1866.2G97777891k97844M7326L20434K42711P2062j1445p510M2439M8339m5001j11401
1888.6G98078001J2934R7215J669n0485m8578p8738j31726j74224j69933j22190o7889
$$ y = [782105505, 782947123, 783601761, 784310400, 785303652, 786268890, 786962867, 787525475, 788030148, 788563848, 789203525, 789660811, 789795041, 789827645, 790104210, 790827036, 791589856, 792058587, 792384923, 792823017, 793303490, 793656766, 793803155, 793832660, 794149458, 794766247, 795228302, 795477867, 795822501, 796365380, 796824813, 797071695, 797259450, 797530949, 797848463, 798090994, 798294961, 798575163, 798793137, 798769295, 798679709, 798675656, 798687875, 798846781, 799086452, 799219728, 799299359, 799270570, 798966169, 798523605, 798415363, 798578918, 798633695, 798556864, 798479140, 798442781, 798389971, 798285544, 798175693, 798049510, 797777891, 797480047, 797527373, 797847807, 798090518, 798162580, 798151135, 798143625, 798186064, 798234403, 798189402, 798078001, 798090935, 798188150, 798189819, 798139334, 798090756, 798012018, 797880292, 797706068, 797536135, 797413945, 797346056]
1911.1G97346056r2984k05934k47955j55151j22964j04607M3869Q9586m5716j44005
1931.5G96360195j23501p4983o7651j31548j59800k980J52588J26183L6895K4140O0320
1953.9G96199858M1664l636M649N2273J6809p2122k7001N9665K2411m9531n9426n4479
1978.4G96131134q7619j09792r6201r3163j45614k27093k15233j16110j01089j81735
1998.8G94757485k59101k91944k87652l39269m60208n22434n04494n25534n93364n87821
2019.2G90385664n30422n08130n48303o38485o55234n63860n21600n58376n42045m43637
2039.6G84875572l46899l24488l31461k81752j95443j48475j57833j28925l1889J5676
2060G82944083l1411p4149j2695P1168L2067n3048k8014P0869P4029l5047q4639l338
$$ y = [797346056, 797253072, 797047138, 796799183, 796644032, 796521068, 796416461, 796460330, 796549916, 796504200, 796360195, 796236694, 796161711, 796094060, 795962512, 795802712, 795799732, 795952320, 796078503, 796115398, 796139538, 796199858, 796241522, 796237886, 796242535, 796294808, 796311617, 796239495, 796212494, 796272159, 796294570, 796245039, 796185613, 796131134, 796043515, 795933723, 795837522, 795744359, 795598745, 795371652, 795156419, 795040309, 794939220, 794757485, 794498384, 794206440, 793918788, 793579519, 793119311, 792596877, 792092383, 791566849, 790973485, 790385664, 789855242, 789347112, 788798809, 788160324, 787505090, 786941230, 786419630, 785861254, 785319209, 784875572, 784528673, 784204185, 783872724, 783590972, 783395529, 783247054, 783089221, 782960296, 782928407, 782944083, 782912672, 782838523, 782825828, 782896996, 782929063, 782876015, 782848001, 782918870, 782992899, 782957852, 782873213, 782869875]
2084.4G82869875O8725j431q9943l5823P6354R6202J7643l3379J7166O2108J908p4923
2108.9G82974482o1572j2159j6511p2181j09017q2016o1452j00255j35243q5235j7881
2131.3G82220960n7876j31011j35601j03951r9062j23442j15871l2008N5850N2929
2151.7G81530917J3172L4452J02639J45614J35482J52409K63035L48925L18707K91347
2172.1G83336699L29196L62516L67343L72410L64781L34680L37481L66628L48509L08692
2192.5G86828935L10004L35276L44694L31700L21507L35038L67939L72887L39985L11076
2212.9G90199041K97845L08633K83002J91987J62900K49981K99335J95980P6175Q0049
2233.3G92344928J32501J19448P4327R8943J66118J43052P569p1585K3008J49130J39356
$$ y = [782869875, 782938600, 782937169, 782847226, 782811403, 782887757, 782983959, 783001602, 782968223, 782985389, 783047497, 783049405, 782974482, 782912910, 782900751, 782884240, 782812059, 782703042, 782621026, 782559574, 782459319, 782324076, 782238841, 782220960, 782163084, 782032073, 781896472, 781792521, 781693459, 781570017, 781454146, 781422138, 781477988, 781530917, 781544089, 781578541, 781681180, 781826794, 781962276, 782114685, 782377720, 782726645, 783045352, 783336699, 783665895, 784028411, 784395754, 784768164, 785132945, 785467625, 785805106, 786171734, 786520243, 786828935, 787138939, 787474215, 787818909, 788150609, 788472116, 788807154, 789175093, 789547980, 789887965, 790199041, 790496886, 790805519, 791088521, 791280508, 791443408, 791693389, 791992724, 792188704, 792264879, 792344928, 792477429, 792596877, 792671204, 792770147, 792936265, 793079317, 793086886, 793015301, 793038309, 793187439, 793326795]
2255.8G93326795M8578M4763J66774K31802J42277O9141J19448J79708J55627R6023
2276.1G94580936J02163J69694J58072J0907j10089n6446M3988j6093j54018j48476
2296.5G94580638m0590m6313k24054l68238k90691j82271k68400l83198l34561k43128
2316.9G92199194l14772m96089n42998m13001l16501l84927m45842l26813k07185k75016
2337.3G88476050m15683l12865Q3149L53098Q0764n09977r41992r94086q39413p43150
2357.7G84235895n32925j48237J22309K14099K48969L79562N43237M75764K95520K60353
2378.1G86094546L05713K26020j2099k19882k40266j86682k50518l82722m09543l27945
2398.5G84596622l11732m24445m96507m28199l71516m34995n30839n39303m51386m16755
$$ y = [793326795, 793375373, 793420136, 793586910, 793818712, 793960989, 794030130, 794149578, 794329286, 794484913, 794580936, 794683099, 794852793, 795010865, 795021772, 794911683, 794855237, 794899225, 794883132, 794729114, 794580638, 794540048, 794493735, 794269681, 793901443, 793610752, 793428481, 793160081, 792776883, 792442322, 792199194, 791884422, 791388333, 790845335, 790432334, 790115833, 789730906, 789285064, 788958251, 788751066, 788476050, 788060367, 787747502, 787830651, 788183749, 788264513, 787754536, 786812544, 785818458, 784979045, 784235895, 783702970, 783554733, 783677042, 783891141, 784140110, 784519672, 785062909, 785538673, 785834193, 786094546, 786400259, 786626279, 786614180, 786394298, 786154032, 785967350, 785716832, 785334110, 784924567, 784596622, 784284890, 783860445, 783363938, 782935739, 782564223, 782129228, 781598389, 781059086, 780607700, 780190945]
2418.9G80190945n42522o50465n79715m79162m86731n75602o36816n78762n43534o32763
2439.3G74484873o84023o22690n53131n44190n50986n26368n12123n38350n70595n43773
2459.7G68838644m63366m05550m17471m70698m68254m22538m19199m46081m40359l94285
2480.1G64490843l54946l36885l23534l15667l34322l43621l27289l30686k84315j88410
2500.5G61351168j92284k69115k77937k28822k27153k94865l38792l09110k90036l47197
2520.9G58575857m19081m27246l79860l67224m27783m50909l96669l66747m12643m87387
2541.3G54440308n05448m56989m17292m43041m86434m44889l70621l92080m58121m52161
2561.7G50013232l96132l76880m19259m59016m25815l67523l46660l68774l93033l62516
$$ y = [780190945, 779648423, 778997958, 778418243, 777939081, 777452350, 776876748, 776239932, 775661170, 775117636, 774484873, 773800850, 773178160, 772625029, 772080839, 771529853, 771003485, 770491362, 769953012, 769382417, 768838644, 768375278, 767969728, 767552257, 767081559, 766613305, 766190767, 765771568, 765325487, 764885128, 764490843, 764135897, 763799012, 763475478, 763159811, 762825489, 762481868, 762154579, 761823893, 761539578, 761351168, 761158884, 760889769, 760611832, 760383010, 760155857, 759860992, 759522200, 759213090, 758923054, 758575857, 758156776, 757729530, 757349670, 756982446, 756554663, 756103754, 755707085, 755340338, 754927695, 754440308, 753934860, 753477871, 753060579, 752617538, 752131104, 751686215, 751315594, 750923514, 750465393, 750013232, 749617100, 749240220, 748820961, 748361945, 747936130, 747568607, 747221947, 746853173, 746460140, 746097624]
2582.1G46097624l35216l80516m23312l75092k88010k70546l26335l66509l36289l14355
2602.5G42681444m07100n23150m88818l72827l90947n39481o15478n80311n62548o13630
2622.9G37587154p04706p14183o19590o20544p45475p75159o54816o07968p35223q02100
2643.3G30607390o86884n76078n94378o77526p04169o30915n55039n91516o57797n69940
2663.7G24363148m51028n19455o08265n13017l68655l59118m69983n58614n09918l95596
2684.1G19609499m00186n26785n33641l65972l21269m65334n52654m83513m02570m69625
2704.5G15087950n67913n29647m48942m70996n87225o46949n40673m02332m19497n02646
2724.8G09971130m84467m43995m88579n53191n32806m46796l72469l54171l96133l76165
$$ y = [746097624, 745762408, 745381892, 744958580, 744583488, 744295478, 744024932, 743698597, 743332088, 742995799, 742681444, 742274344, 741751194, 741262376, 740889549, 740498602, 739959121, 739343643, 738763332, 738200784, 737587154, 736882448, 736168265, 735548675, 734928131, 734182656, 733407497, 732752681, 732144713, 731409490, 730607390, 729920506, 729344428, 728750050, 728072524, 727368355, 726737440, 726182401, 725590885, 724933088, 724363148, 723912120, 723392665, 722784400, 722271383, 721902728, 721543610, 721073627, 720515013, 720005095, 719609499, 719209313, 718682528, 718148887, 717782915, 717461646, 716996312, 716443658, 715960145, 715557575, 715087950, 714520037, 713990390, 713541448, 713070452, 712483227, 711836278, 711295605, 710893273, 710473776, 709971130, 709486663, 709042668, 708554089, 708000898, 707468092, 707021296, 706648827, 706294656, 705898523, 705522358]
2745.2G05522358k83300l06964m39048m85897l70860k51890k97904l95357l58880k47597
2765.6G02084661k42115l63051m27843l37660k80380l75390m56929m22478l63588l61622
2786F98453605m17709n21124n72025n08547m81546n70595o61552o57320o44803o98507
2806.4F92719877p24077o94752o80864p23898p92921p78973o72579o82890q67606r84788
2826.8F85116529r32753q18252p79689q62181r03547r27507j113475j302361j343370
2845.2F76133394j322329j299798j285017j226485j074969r04918r06706j100957j257897
2863.5F65754318j293719j304268j263440j188397j252950j378238j316726j111448
2879.9F55645132r55343q49605p27117o36458n62668m42863l42846l39746m21941m98176
$$ y = [705522358, 705239058, 704932094, 704493046, 704007149, 703636289, 703384399, 703086495, 702691138, 702332258, 702084661, 701842546, 701479495, 701051652, 700713992, 700433612, 700058222, 699601293, 699178815, 698815227, 698453605, 698035896, 697514772, 696942747, 696434200, 695952654, 695382059, 694720507, 694063187, 693418384, 692719877, 691995800, 691301048, 690620184, 689896286, 689103365, 688324392, 687651813, 686968923, 686101317, 685116529, 684183776, 683365524, 682585835, 681723654, 680820107, 679892600, 678779125, 677476764, 676133394, 674811065, 673511267, 672226250, 670999765, 669924796, 669019878, 668113172, 667012215, 665754318, 664460599, 663156331, 661892891, 660704494, 659451544, 658073306, 656756580, 655645132, 654689789, 653840184, 653113067, 652476609, 651913941, 651471078, 651128232, 650788486, 650366545, 649868369]
2900.2F49868369n00739m83036n01930n09203n34475o44624q10027r85444j045286
2918.6F43853605r12965o65962m14849j74045N4121J53124K24889L89993N16951O22093
2939F43646955Q40426J050234J010895P95900O98865Q01861Q52466P52151P27117Q32260
2959.4F52009130R43660R84729R67681R88305J062214J144826J181961J124322J157165
2977.8F61563993J313269J288473J115561J032173J060248J150369J102627Q11636
2994.1F70438349N98490N41986M12106K47121J18673M3750O5445Q2732m9770k94447
3014.5F72204435m82619n63264o04808o14643o30200o91772p11083o89149o61850p04050
3034.9F65850997q24511q23855p41542p55250q63791r71019r69946r21608r14812r02652
$$ y = [649868369, 649367630, 648884594, 648382664, 647873461, 647338986, 646694362, 645884335, 644898891, 643853605, 642940640, 642274678, 641859829, 641685784, 641739905, 641893029, 642117918, 642507911, 643024862, 643646955, 644487381, 645537615, 646548510, 647344410, 648043275, 648845136, 649697602, 650449753, 651176870, 652009130, 652952790, 653937519, 654905200, 655893505, 656955719, 658100545, 659282506, 660406828, 661563993, 662877262, 664165735, 665281296, 666313469, 667373717, 668524086, 669626713, 670438349, 671036839, 671578825, 671990931, 672238052, 672356725, 672400475, 672465920, 672548652, 672498882, 672204435, 671721816, 671158552, 670553744, 669939101, 669308901, 668617129, 667906046, 667216897, 666555047, 665850997, 665026486, 664202631, 663461089, 662705839, 661842048, 660871029, 659901083, 658979475, 658064663, 657162011]
3055.3F57162011r34184j009762r74298q15451p09295q26061j016676j020134q98957
3073.6F48957193p51674o56128p70152r24527r52602j010001j015663r01520r13322
3092F41061604j003206r55641q40366q08597q93950r41515q40068p55131q29041q58605
3112.4F32335484p05957o26684p12335r27090j191318j192570r42588p65264q20279
3130.7F24451399r46939q92699o98149o89983r59278j090288r40919q03292p29203
3149.1F16700649o92367q45135j063346j059473r74536r46581q83222q46982r12011
3167.4F08476996r61899r03488q64088r23753r54270r38535r50992r40800r24527r45926
3187.8E99168718r61900r90808j026928j025975j008213r75012r26435r33230r99749
$$ y = [657162011, 656227827, 655218065, 654243767, 653428316, 652719021, 651892960, 650876284, 649856150, 648957193, 648205519, 647549391, 646779239, 645854712, 644902110, 643892109, 642876446, 641974926, 641061604, 640058398, 639102757, 638262391, 637453794, 636559844, 635618329, 634778261, 634023130, 633194089, 632335484, 631629527, 631002843, 630290508, 629363418, 628172100, 626979530, 626036942, 625271678, 624451399, 623504460, 622611761, 621913612, 621223629, 620264351, 619174063, 618233144, 617429852, 616700649, 616008282, 615163147, 614099801, 613040328, 612065792, 611119211, 610235989, 609389007, 608476996, 607515097, 606611609, 605747521, 604823768, 603869498, 602930963, 601979971, 601039171, 600114644, 599168718, 598206818, 597216010, 596189082, 595163107, 594154894, 593179882, 592253447, 591320217, 590320468]
3206.2E90320468j030386r68098q79109q72314r34482r76801r71377r48488r56238
3224.5E81783175r79602r14514p22229o25611q76605j173377j097381q70407p67648
3242.9E73755801o95050o89745q38757r18269q04126p14302p74205q38876q32736p92086
3263.3E65857649p05898n41270l99410n57900q79228r49442q52526q38160q70347q37982
3283.7E58425486p69079p18534o55591o50704p82788r64880j094520j082659r09567
3302E50797164p14719p91073j169920j452148j452744j324474j242638j258552j282454
3320.4E40108442j211166j130760j291096j535833j527548j411080j375496j356245
3336.7E29269218j425325j569689j629591j695752j674533j446068j456022j799226
$$ y = [590320468, 589290082, 588321984, 587442875, 586570561, 585636079, 584659278, 583687901, 582739413, 581783175, 580803573, 579889059, 579166830, 578541219, 577664614, 576491237, 575393856, 574523449, 573755801, 573060751, 572371006, 571532249, 570613980, 569809854, 569095552, 568321347, 567482471, 566649735, 565857649, 565151751, 564610481, 564211071, 563653171, 562773943, 561824501, 560971975, 560133815, 559263468, 558425486, 557656407, 556937873, 556282282, 555631578, 554848790, 553883910, 552789390, 551706731, 550797164, 550082445, 549291372, 548121452, 546669304, 545216560, 543892086, 542649448, 541390896, 540108442, 538897276, 537766516, 536475420, 534939587, 533412039, 532000959, 530625463, 529269218, 527843893, 526274204, 524644613, 522948861, 521274328, 519828260, 518372238, 516573012]
3353E16573012j943827j742482j513779j511336j594245j444817j268446j484752j900851
3371.4E02168477j950086j619935j416325j455128j534909j506657j339614j108229
3387.7D90237594q58635r16779j322150j404912r48965o30319j015455j503795j330346
3406.1D80306238r29087p91312q15898r44942j024634q88318p54237p00325n59926
3424.4D72897559m02242l28540l46482l03954j76042k82228n46307n48511l12746p6503
3444.8D69574004J3888j1295Q7649K31862K70545L28899L96937L24875L53634O81252
3465.2D72252250Q55237N21660J15037K02626N42462P56204P67708N72472N30839P23780
3485.6D77840275P13288O13004P82430R82762R99808Q92431Q40127Q70168P66874O89417
$$ y = [516573012, 514629185, 512886703, 511372924, 509861588, 508267343, 506822526, 505554080, 504069328, 502168477, 500218391, 498598456, 497182131, 495727003, 494192094, 492685437, 491345823, 490237594, 489378959, 488462180, 487140030, 485735118, 484786153, 484155834, 483140379, 481636584, 480306238, 479377151, 478585839, 477769941, 476824999, 475800365, 474912047, 474157810, 473457485, 472897559, 472495317, 472166777, 471820295, 471516341, 471340299, 471058071, 470511764, 469963253, 469650507, 469574004, 469587892, 469576597, 469664246, 469896108, 470166653, 470495552, 470892489, 471217364, 471570998, 472252250, 473107487, 473629147, 473744184, 473946810, 474489272, 475245476, 476013184, 476585656, 477116495, 477840275, 478553563, 479166567, 479948997, 480931759, 481931567, 482823998, 483664125, 484534293, 485301167, 485990584]
3506D85990584Q36819J082123J273989J199276R81271R46998J081557J229941J163274
3524.4D95785832R93371J042068J196981J317322J455844J438856J269102J329243
3540.7E05828619J545191J578033J325726J187265J377702J482248J441717J500488
3557E17266989J621783J628220J483619J470208J809478K094149K013386J902818J915574
3575.3E33206224J954020K056241K121031K064943K053619K147793K321005K383411
3591.7E50308287K327681K354085K535641K692044K647400K419174K292573K466917
3608E70043802K626777K673030K672493K635837K998114L387212K859712J992404J914680
3626.3E93804061L055513L693879L006041K739012K745688K668679K522707K118647
$$ y = [485990584, 486827403, 487909526, 489183515, 490382791, 491364062, 492311060, 493392617, 494622558, 495785832, 496779203, 497821271, 499018252, 500335574, 501791418, 503230274, 504499376, 505828619, 507373810, 508951843, 510277569, 511464834, 512842536, 514324784, 515766501, 517266989, 518888772, 520516992, 522000611, 523470819, 525280297, 527374446, 529387832, 531290650, 533206224, 535160244, 537216485, 539337516, 541402459, 543456078, 545603871, 547924876, 550308287, 552635968, 554990053, 557525694, 560217738, 562865138, 565284312, 567576885, 570043802, 572670579, 575343609, 578016102, 580651939, 583650053, 587037265, 589896977, 591889381, 593804061, 596859574, 600553453, 603559494, 606298506, 609044194, 611712873, 614235580, 616354227]
3642.6F16354227J710892K076208L590286M061759K622127K285958L081977K986967
3659F38770401K367497J968265J525163J419425K159834K267182J633763K628029L143310
3677.3F57882869K032042J498759J081347P93636J644790K680779K068996J160085
3693.6F70843303Q90076P33257Q22723J271247J075686K53200P15Q08955J860916J318514
3714F79878592K48015P5698L31223M85361N00441M32729K6644l31820K3127J006663
3734.4F82676673J607478N41031j025736o96779J038432N01037k69115J286030J628458
3752.8F87287509J01924l08513M37915N80192l5107o4493J92404N38528P83026K44260
3773.2F89757645k84910q0645M85837L39806o4730K03848L64542J36077j89424m66585
$$ y = [616354227, 618065119, 620141327, 623731613, 627793372, 630415499, 632701457, 635783434, 638770401, 641137898, 643106163, 644631326, 646050751, 648210585, 650477767, 652111530, 654739559, 657882869, 659914911, 661413670, 662495017, 663288653, 664933443, 667614222, 669683218, 670843303, 671733379, 672466636, 673289359, 674560606, 675636292, 675889492, 675890207, 676699162, 678560078, 679878592, 680126607, 680202305, 680533528, 681018889, 681519330, 681952059, 681978703, 681646883, 681670010, 682676673, 684284151, 684825182, 683799446, 683102667, 684141099, 684642136, 684373021, 685659051, 687287509, 687389433, 687080920, 687518835, 688099027, 688063920, 687999427, 688191831, 688730359, 689513385, 689757645, 689472735, 689392090, 689877927, 690217733, 690153003, 690356851, 690721393, 690857470, 690668046, 690201461]
3793.6F90201461l50475l42071p1108Q18252L43383N4836P67946P4565r85503p45594
3814F89765692J78814J8656K25186J093507K29836m34518l56317m02629l61502l95418
3834.4F89561307l397P15196N79417L20077K17557n66066j585602j567245Q91566K641738
3854.8F91204548K54393j177729q82387j66058J76310k27272k563N21242J58668j69695
3875.2F89689457n19931l48329J22726k2531K50041Q95n33045J06514R3519q87036
3895.5F87952280j032650m10259K07841O89686N76257j72972n67496n61714n52416
3913.9F86128557k90871N4479r2805l45587j55926j27435n32925m46200J42932J99854
3934.3F84534073k31624n05507m78089j74880n7816k29538j73270j5498m8816j62363
$$ y = [690201461, 689850986, 689508915, 689437807, 690256059, 690599442, 690654278, 691422224, 691496789, 690511286, 689765692, 689944506, 689963162, 690188348, 691281855, 691511691, 691077173, 690720856, 690318227, 689956725, 689561307, 689557910, 690273106, 690852523, 691172600, 691390157, 690824091, 689238489, 687671244, 688562810, 691204548, 691458941, 690281212, 689398825, 689232767, 689409077, 689181805, 689179242, 689700484, 689859152, 689689457, 689169526, 688821197, 688943923, 688921392, 689171433, 689172328, 688639283, 688745797, 688839316, 687952280, 686919630, 686509371, 686717212, 687406898, 687983155, 687810183, 687242687, 686680973, 686128557, 685837686, 685892165, 685799360, 685453773, 685297847, 685170412, 684637487, 684191287, 684334219, 684534073, 684302449, 683796942, 683318853, 683143973, 683086157, 682856619, 682683349, 682667851, 682619035, 682456672]
3954.7F82456672k72333l21746j94133p1704j84774l04342k45750j78456j86384j49309
3975.1F80347741j30535j65700j30415j23620k37167l27528k83897j86383j07527q1718
3995.5F78573251j47522
3997.5F78425729
$$ y = [682456672, 682184339, 681862593, 681668460, 681596756, 681411982, 681107640, 680861890, 680683434, 680497050, 680347741, 680217206, 680051506, 679921091, 679797471, 679560304, 679232776, 678948879, 678762496, 678654969, 678573251, 678425729]
##END=$$ End of the data block
