##TITLE=Sample description $$ Begin of the data block
##JCAMP-DX=5.00 $$ ACD/SpecManager v 10.08
##SPECTROMETER/DATA SYSTEM=Alpha
##DATE=03 Jun 2014 08:18:10
##DATA TYPE=INFRARED SPECTRUM
##DATA CLASS=XYDATA
##ORIGIN=
##OWNER=
##NPOINTS=1765
##FIRSTX=399.75695801
##LASTX=3997.56933594
##MAXX=3997.56933594
##MINX=399.75695801
##MAXY=0.80902749
##MINY=0.47576830
##XFACTOR=1.0000000000
##YFACTOR=1.000000000000000e-9
##FIRSTY=0.64655620
##DELTAX=2.03957629
##XUNITS=1/CM
##YUNITS=ARBITRARY UNITS
##XYDATA=(X++(Y..Y))
399.8F46556199k146602p43449K298415K570391l70324j671612O72757J957655o43193
418.1F48480237l013313p70629J361847N02825j034141o21080Q28803P65919q36372
436.5F45664096r71913J232624K277255K89619j259506J89483K168775J494765j002669
454.8F50082529j585722O45578J280665r84371k171397m47333J335859O676k279758
473.2F45882726j130581J473069J184821j208305j511932J167179K506613K73109j674652
491.5F46962047k87950J532912M76479j739382j417816R52363J148164j058161j912534
509.9F44656122k21849J043856l69012k081931r35554J285672J143515q60691j026153
528.3F42633975J307427K452136Q46266m76539Q15928K444685J480937p96676j078248
$$ plain form
399.8 646556199 644409597 643666148 645964563 648534954 648164630 646493018 647165775 649123430 648480237
418.1 648480237 645466924 644696295 646058142 646560967 645526826 644905746 645734549 646500468 645664096
436.5 645664096 644692183 645924807 648202062 648491681 647232175 647421658 649590433 651085198 650082529
454.8 650082529 648496807 649142385 650423050 649438679 647267282 646819949 648155808 648162484 645882726
473.2 645882726 644752145 646225214 647410035 646201730 644689798 645856977 648363590 648636699 646962047
491.5 646962047 646674097 648207009 648683488 646944106 645526290 646478653 647626817 646568656 644656122
509.9 644656122 644434273 645478129 645109117 643027186 642091632 643377304 644520819 643660128 642633975
528.3 642633975 643941402 646393538 647239804 646763265 647579193 650023878 651504815 650708139 649629891
546.6F49629891N49793Q67665j013100k072096n24342Q46207l55363k081871j709521
565F44137263k20716j52588j298368j227736N25653J692653R26614j073Q26418K309502
585.4F47517622K046287L76761O437J159072J373470N7220r31799k15054R65595P88391
605.8F53144002k04384k42889Q17477J315356N88000J88827J290739K480149K137601
624.1F61514878J154006J186669J723170J507878O63460J33395O08623J285016Q86441
642.5F70663536J9908P8558Q41797J004994M22358J19746O10471J108467P56324K74598
662.9F75900757L27051K77877L37958Q15869P03752N65171P34091P29799N52654M53234
683.3F81398213O69300R42946O73532J35661l6240K2233j28270n77449r31681o59704
$$ plain form
546.6 649629891 650179684 651047349 650034249 647962153 647437811 648284018 647928655 645846784 644137263
565 644137263 643916547 643763959 642465591 641237855 641763508 643456161 644382775 644381702 645208120 647517622
585.4 647517622 649563909 649940670 649947107 651106179 652479649 652536869 651605070 651390016 652355611 653144002
605.8 653144002 652939618 652696729 653514206 654829562 655417562 655606389 656897128 659377277 661514878
624.1 661514878 662668884 663855553 665578723 667086601 667750061 667883456 668492079 669777095 670663536
642.5 670663536 670683444 670762002 671603799 672608793 673031151 673150897 673761368 674869835 675626159 675900757
662.9 675900757 676227808 676505685 676843643 677659512 678363264 678928435 679662526 680392325 680944979 681398213
683.3 681398213 682067513 683010459 683683991 683819652 683783412 683805645 683677375 683099926 682168245 681508541
703.7F81508541j0848L12448K32339L84986J063406J701177J742780J467466J612425
722F90014720K217174K430915J765848J052200J098395J365661J017511J56403l58105
740.4G00760722k24769k63393j015127j675963j454890q78870r44376j453817j255512
758.7F91594005j74642O89268O66201O23405J578808K790034K838671K001703J743317
777.1G04350770K364218K597809J703739Q09371J103342J905739J806975J011490J029849
795.4G18683302K079010K629459J884878R74953J121521J697123J283825J31488k74003
813.8G30211556L80993O97613l03984j538396j496911q03888j246273k647996l102899
832.1G20149815k090335j268506j732468k287984j555324k13087O0142p50125r24468
$$ plain form
703.7 681508541 681497693 681810141 682042480 682427466 683490872 685192049 686934829 688402295 690014720
722 690014720 692231894 694662809 696428657 697480857 698579252 699944913 700962424 701118827 700760722
740.4 700760722 700535953 700272560 699257433 697581470 696126580 695247710 694303334 692849517 691594005
758.7 691594005 691419363 692108631 692774832 693398237 694977045 697767079 700605750 702607453 704350770
777.1 704350770 706714988 709312797 711016536 711825907 712929249 714834988 716641963 717653453 718683302
795.4 718683302 720762312 723391771 725276649 726251602 727373123 729070246 730354071 730485559 730211556
813.8 730211556 730592549 731290162 730986178 729447782 727950871 727146983 725900710 723252714 720149815
832.1 720149815 718059480 716790974 715058506 712770522 711215198 711002111 711062253 710312128 709387660
850.5G09387660J21295Q82268L06726l84450L95834J953006K396524J595199J190484
868.9G17844546J847327K123713R01878o63519r50336m74751j035929k590060l125489
887.2G13877380j942694q81136j358628k174139j605630k78652k23934j508117k104163
905.6G01800287j213312n28217j439154k640247k206326p73132m68850j395881j530290
923.9F89604878j87277Q21471K03132p25746j74045J213073J422465M05789M8280R51945
944.3F93583965J332283q2314j785993j883328j133323j490951k839446l341317k469361
962.7F79890215j812398k563298l563821l205836k129853k084076l052294l364265
979F58114374k340854j352787j639664k259135j680970l46303L8802p64489j117408
$$ plain form
850.5 709387660 709508955 710391223 710697949 710313499 710709333 712662339 715058863 716654062 717844546
868.9 717844546 719691873 721815586 722717464 722053945 721103609 720628858 719592929 717002869 713877380
887.2 713877380 711934686 711053550 709694922 707520783 705915153 705636501 705412567 703904450 701800287
905.6 701800287 700586975 700058758 698619604 695979357 693773031 692999899 692531049 691135168 689604878
923.9 689604878 689417601 690239072 690442204 689716458 689542413 690755486 692177951 692583740 692632020 693583965
944.3 693583965 694916248 694833934 693047941 691164613 690031290 688540339 685700893 682359576 679890215
962.7 679890215 678077817 675514519 671950698 668744862 666615009 664530933 661478639 658114374
979 658114374 655773520 654420733 652781069 650521934 648840964 648494661 648533463 647768974 646651566
997.3F46651566k17855N54800k2948r95457q83400j01924j15097r71973j283943m85421
1017.7F42128348K78712N4478m35412o6876Q22782R23932J66833k02596K96772P81059
1038.1F44748032M18067k71618j83046N69463Q42511L90590K35080Q80659J514315
1056.5F49144053J380980R65178J180530J828015J740158M56213j045823j648068j513779
1074.8F52487457j425028j331151o86109L15667Q75413P32839N28038Q34226J275897
1093.2F53607249J117111N01155K13683M02629N32806K85626K9206K12431N90801O78003
1113.6F58170700M66645L27408N01752P80284P58052N06223N55634J014888J253665
1132F64335251Q45969K33113p5459k67863p21634j266718j436889j188517r03010q39651
$$ plain form
997.3 646651566 646433711 646988511 646965563 645970106 645086706 644984782 644869685 643897712 642613769 642128348
1017.7 642128348 642407060 642461538 642026126 641959250 642782032 643705964 643872797 643670201 643966973 644748032
1038.1 644748032 645166099 644894481 644711435 645280898 646123409 646513999 646749079 647629738 649144053
1056.5 649144053 650525033 651490211 652670741 654498756 656238914 656695127 655649304 654001236 652487457
1074.8 652487457 651062429 649731278 649045169 649360836 650236249 650969088 651497126 652331352 653607249
1093.2 653607249 654724360 655225515 655439198 655841827 656374633 656660259 656689465 656901896 657492697 658170700
1113.6 658170700 658637345 658964753 659466505 660246789 661004841 661511064 662066698 663081586 664335251
1132 664335251 665181220 665414333 665338874 665071011 664349377 663082659 661645770 660457253 659554243 658714592
1152.4F58714592q39531n25475O8903M63486N50807P61628J372695K014279K205014
1170.7F64786398K165437K402604K821684K953887K644002K230346K124429K108216
1187F84237003J676143R58085N26011N18202M98891K09511p809K30134P38561R90868
1207.4F90575600Q56340P90298J052260J211286Q61466L38375J91569K82824J11878
1225.8F96271896l10003n14985k72393N9188K3305k57254k37941J82807M46677K57850
1246.2F95649147N6148K87056O75916O41227K68340J62304M86850P41959N50568K63870
1266.6F99783385L57032O58154O40631K31683l8683J24395K85506K6166l64899l55304
1287G01348066l1352J2160l71933o44744m17828n9665j24275m37558l59893J05858
$$ plain form
1152.4 658714592 657875061 657349586 657418489 657881975 658432782 659194410 660567105 662581384 664786398
1170.7 664786398 666951835 669354439 672176123 675130010 677774012 680004358 682128787 684237003
1187 684237003 685913146 686871231 687397242 687915444 688414335 688623846 688616037 688846171 689584732 690575600
1207.4 690575600 691431940 692222238 693274498 694485784 695347250 695685625 695877194 696160018 696271896
1225.8 696271896 695961893 695446908 695174515 695233703 695257008 694999754 694761813 694944620 695391297 695649147
1246.2 695649147 695705295 695992351 696668267 697309494 697577834 697740138 698226988 698968947 699519515 699783385
1266.6 699783385 700140417 700798571 701439202 701670885 701632202 701756597 702042103 702068269 701703370 701348066
1287 701348066 701316714 701328874 700956941 700312197 699894369 699834704 699710429 699272871 698912978 699018836
1307.4F99018836K56717j71244n41925l37541l2843k10464o35326o98208l52025k61069
1327.8F96034908o91116r69171o29604j95563l05652o01888k80738L19600L60370j84357
1348.1F92856789n99325l69430K7657q8275n69760q15034n14090l8386j97887o09219
1368.5F89083040k94626K10047J49488r2864q2731J33514K87891K72453L21447P84576
1388.9F90772235J172424O19888l70800m60685J13547M09842l8684o67095l74079J75476
1409.3F91352069J4723m69148n85676m45962k43425K8074j9610J25408M72724K25068
1429.7F90454245p1228N5611Q3745L35574O32822L62635J90675K26498l5703k57552
1450.1F91977322j52826p0930o72757q29697N23984J077354R71377J189351J486481
$$ plain form
1307.4 699018836 699275553 699104309 698562384 698224843 698192000 697981536 697346210 696648002 696295977 696034908
1327.8 696034908 695343792 694374621 693745017 693549454 693243802 692641914 692361176 692680776 693041146 692856789
1348.1 692856789 692257464 691888034 691915691 691827416 691257656 690442622 689928532 689890146 689692259 689083040
1368.5 689083040 688788414 688998461 689147949 689055085 688972354 689105868 689393759 689666212 689987659 690772235
1388.9 690772235 691944659 692564547 692193747 691733062 691846609 692256451 692217767 691550672 691176593 691352069
1409.3 691352069 691366792 690897644 690311968 689866006 689622581 689650655 689631045 689756453 690229177 690454245
1429.7 690454245 690383017 690438628 690522373 690857947 691490769 691853404 692044079 692270577 692234874 691977322
1450.1 691977322 691824496 691753566 691080809 690251112 690775096 691852450 692823827 694013178 695499659
1468.5F95499659J415193J625180K379537K659916K482832K483189K642035K368212
1484.8G13555753J726270J550674K267599K581656J918853J274109J586258K006948
1501.1G28468120J588106M40538n1141J459420J957297J303077O52194N69523P41660
1519.5G37128794P04766R10222J093268J106859J078844O34253K89500O43968M87268
1537.8G44077742l24905J08123J167476J368880J029075N61952L23892J91450m4525
1556.2G48459160m51862L17752J360714J006425M08768p9512j68562J93298j03176
1574.5G50943005p15077l38554j00255n10752q68500j166224j473963j713992j903951
1592.9G42151737k134442k328158k523183k804160l042043l227889l468216l726363
$$ plain form
1468.5 695499659 696914852 698540032 700919569 703579485 706062317 708545506 711187541 713555753
1484.8 713555753 715282023 716832697 719100296 721681952 723600805 724874914 726461172 728468120
1501.1 728468120 730056226 730496764 730445623 731905043 733862340 735165417 735817611 736387134 737128794
1519.5 737128794 737833560 738743782 739837050 740943909 742022753 742657006 742946506 743590474 744077742
1537.8 744077742 743752837 743860960 745028436 746397316 747426391 747988343 748312235 748503685 748459160
1556.2 748459160 748007298 748325050 749685764 750692189 751100957 751021445 750852883 751046181 750943005
1574.5 750943005 750227928 749889374 749789119 749278367 748409867 747243643 745769680 744055688 742151737
1592.9 742151737 740017295 737689137 735165954 732361794 729319751 726091862 722623646 718897283
1609.2G18897283l737330l631175m325747n011797l498316k728284l318011k941013
1625.5F89705610k244532j811027j149059j076817j374662j33932J130462J356900
1641.8F84402943J295149J325250K037406K559304K375960K873659L509879L259659
1658.2G03639209K870560K819180L059030K906323K662360K868354L048897L084600
1674.5G26958513L201425L002227K534032K212464K818168L389835L108382K831638
1690.8G50056684K359331J915574J809597K024293K585172K596140K171874K073169
1707.1G67591834K004862J695514J205384Q20637J115620J896143J931131J493871
1723.4G79754996J222909J028478Q04841N96226O70194J228750J325667J043975R49085
$$ plain form
1609.2 718897283 715159953 711528778 707203031 702191234 698692918 695964634 692646623 689705610
1625.5 689705610 687461078 685650051 684500992 683424175 682049513 681915581 683046043 684402943
1641.8 684402943 685698092 687023342 689060748 691620052 693996012 696869671 700379550 703639209
1658.2 703639209 706509769 709328949 712387979 715294302 717956662 720825016 723873913 726958513
1674.5 726958513 730159938 733162165 735696197 737908661 740726829 744116664 747225046 750056684
1690.8 750056684 752416015 754331589 756141186 758165479 760750651 763346791 765518665 767591834
1707.1 767591834 769596696 771292210 772497594 773318231 774433851 776329994 778261125 779754996
1723.4 779754996 780977905 782006383 782811224 783407450 784077644 785306394 786632061 787676036 788625121
1741.8G88625121R84311Q77381O62326O82116J009345J028001P54416N99146N15461
1760.1G95737624N50091P04825N35429J56164j5140K44499P98762Q67128N06699L11852
1780.5H00397933M38571N22315L98636J49608j610L25084O74069M87387K46406L74436
1800.9H04012835N93007M87864K54094J93060K96831L62575K90096K50280L27408K51830
1821.3H07319880k5332j23740k7120M3273K45035K94089J09852N2988k0325l00467
1841.7H07568133m34995m9412K45452Q6665j07110r9360r180k3007j02520j09553j01388
1864.2H06863725k44260k73525R5129L61681K47717N4955j1206K2650P1585P2122l8207
1886.6H07222366j29461K8312J44184Q523p4744l2186j0074p5936j73807j92225j15693
$$ plain form
1741.8 788625121 789609432 790486813 791149139 791831255 792840600 793868601 794623017 795222163 795737624
1760.1 795737624 796287715 796992540 797527969 797684133 797668993 797913492 798712254 799579382 800086081 800397933
1780.5 800397933 800836504 801358819 801757455 801907063 801905453 802230537 802904606 803391993 803638399 804012835
1800.9 804012835 804605842 805093706 805347800 805540860 805837691 806200266 806490362 806740642 807068050 807319880
1821.3 807319880 807294548 807170808 807143688 807186961 807431996 807726085 807835937 807888925 807868600 807568133
1841.7 807568133 807133138 807083726 807329178 807415843 807308733 807209373 807200193 807177186 807074666 806965113 806863725
1864.2 806863725 806619465 806345940 806441069 806802750 807050467 807105422 807094216 807116866 807188451 807260573 807222366
1886.6 807222366 807092905 807121217 807265401 807273924 807199180 807166994 807156920 807080984 806907177 806714952 806599259
1909H06599259l3378o8188k05994k56121j34706p8678q1838L1591P4804j6213q8989
1931.5H05741549j03891p4149n3346j22487j66059R358J78516J20103L4512N9247Q1837
1953.9H05705190L1054J2338N0843N3823j0431m7922M3332J19865M6551n2034p3672
1976.3H05878937n5611m1067n9784j12295j36435j59383k10583j62780p0513j10686
1996.7H04759800j92821k30431k49803k73466l35098m18782m77910n12063n48482n57304
2017.1H00963640n43535n44965n21004n12183n80013o08682n27024m92990n58079n51223
2037.5G95523942m28737l14235l11971l63410l02732j59144r4414j13129j00434k086
2057.9G93333650Q4817M2379n1141k6405P1705P7545N186j5557N0128J08957O4850
$$ plain form
1909 806599259 806565881 806497693 806291699 806035578 805900872 805822194 805740356 805771947 805846751 805830538 805741549
1931.5 805741549 805637658 805563509 805510163 805387676 805221617 805230975 805409491 805529594 805564106 805623353 805705190
1953.9 805705190 805736244 805748582 805799425 805853248 805842817 805794895 805838227 805958092 806004643 805952609 805878937
1976.3 805878937 805823326 805782259 805722475 805610180 805473745 805314362 805103779 804940999 804870486 804759800
1996.7 804759800 804566979 804336548 804086745 803813279 803478181 803059399 802581489 802069426 801520944 800963640
2017.1 800963640 800420105 799875140 799354136 798841953 798261940 797653258 797126234 796633244 796075165 795523942
2037.5 795523942 795095205 794780970 794468999 794105589 793802857 793643713 793549299 793436170 793335736 793333650
2057.9 793333650 793418467 793460846 793409705 793383300 793455005 793532550 793537736 793522179 793572307 793681264 793746114
2080.3G93746114k0266N245P5460L0875m2319r597Q6546J25051N2631k1577K7835J14024
2104.8G94170022P2896j9729j7702K3305L3379k4379j11997r4652m1365m8995p6712
2127.3G93864071o6757j2159q762o3896r9600r9241p8678p8023p8082j4603N3823N8830
2151.7G93376923N2094Q9407J50323J72496J68741K21729L15785L78847L86715L46780
2172.1G95659840L10421L26455L86417M40120M32134L82066L69966M04358M01973L34621
2192.5G99448371K90573L33666M00842L94463L47555L52502L88264M00544L88383L45171
2212.9H03090334L20852L44574L15011K29656K15471K80082K94924J99199R3162J07169
2233.3H05490434K00212K02894J11759Q5831J63138J90556P9393m828O5625J69754
$$ plain form
2080.3 793746114 793725848 793731093 793806553 793837428 793795109 793785512 793872058 793997109 794049740 794028163 794055998 794170022
2104.8 794170022 794242918 794223189 794205487 794228792 794262171 794237792 794125795 794031143 793989778 793940783 793864071
2127.3 793864071 793797314 793785155 793776393 793712497 793612897 793513656 793434978 793356955 793278873 793264270 793318093 793376923
2151.7 793376923 793429017 793518424 793668747 793841243 794009984 794231713 794547498 794926345 795313060 795659840
2172.1 795659840 795970261 796296716 796683133 797123253 797555387 797937453 798307419 798711777 799113750 799448371
2192.5 799448371 799738944 800072610 800473452 800867915 801215470 801567972 801956236 802356780 802745163 803090334
2212.9 803090334 803411186 803755760 804070771 804300427 804515898 804795980 805090904 805290103 805383265 805490434
2233.3 805490434 805690646 805893540 806005299 806091130 806254268 806444824 806524217 806519389 806585014 806754768
2253.7H06754768J52886L9577K5749J86265L02553K15113Q1838J17540K55883K29299
2274.1H08361471N2929K5034J90138K69592J28329m0233n8234L755j5974j12295j28388
2296.5H08676124k7836J5974j32203l16500l00944j81139k07484l12447l12388k38896
2316.9H06662261k71618m43458m60387l16798l41356m54784m24027l00348j79469j55032
2337.3H03314984l10719l39925K9623M02629J68741m82142r64284r97305q11219o76393
2357.7G99333990m32969j11103J02163J48475J79648L99292O13034N17487K95222K25186
2378.1H01270425K86401K81036P0273j66475k26856j87337j92642l06726m02510l51190
2398.5H00074399k99514l79205m69327m32789l49879l70383m91262n46515m76599m45783
$$ plain form
2253.7 806754768 806907654 806947231 806972980 807159245 807461798 807676911 807758749 807876289 808132172 808361471
2274.1 808361471 808414400 808439434 808629572 808899164 809027493 808987260 808929026 808932781 808916807 808804512 808676124
2296.5 808676124 808648288 808664262 808532059 808215559 807914615 807733476 807525992 807213545 806901157 806662261
2316.9 806662261 806390643 805947185 805486798 805170000 804828644 804373860 803949833 803649485 803470016 803314984
2337.3 803314984 803004265 802664340 802693963 803096592 803265333 802783191 801818907 800821602 800010383 799333990
2357.7 799333990 798901021 798789918 798892081 799040556 799220204 799619496 800232530 800750017 801045239 801270425
2378.1 801270425 801556826 801837862 801908135 801741660 801514804 801327467 801134825 800828099 800425589 800074399
2398.5 800074399 799774885 799395680 798926353 798493564 798143685 797773302 797282040 796735525 796258926 795813143
2418.9G95813143n25892n68151n14388m78685m95195n55933n95212n28157m98592n93544
2439.3G90459394o62446o20424n37694n00023n27203n60701n34654m82201m83931n24342
2459.7G85025775n14686m36604l85940m10855m27544m10556m04299m18901m26531l73423
2480.1G80816436k87056k72095l17216l30985k95043k57671k77400l04878k58743j89781
2500.5G78025568j85132k66731l08693k17914j78337k75314l40998l13044k66075k82109
2520.9G75391221l56018l84927l31939k84910l50356m63784m54843l64124l79980m85182
2541.3G71535158n09202m39406l85999m05431m46856m29392l67463l39329l86536m40657
2561.7G67384887m02391l19183l23236m18663m44889l64065l25919l62813l74436l20852
$$ plain form
2418.9 795813143 795287251 794719100 794204712 793726027 793230832 792674899 792079687 791551530 791052938 790459394
2439.3 790459394 789796948 789176524 788638830 788138807 787611604 787050903 786516249 786034048 785550117 785025775
2459.7 785025775 784511089 784074485 783688545 783277690 782850146 782439590 782035291 781616390 781189859 780816436
2480.1 780816436 780529380 780257285 779940069 779609084 779314041 779056370 778778970 778474092 778215349 778025568
2500.5 778025568 777840436 777573705 777265012 777047098 776868761 776593447 776252449 775939405 775673330 775391221
2520.9 775391221 775035203 774650276 774318337 774033427 773683071 773219287 772764444 772400320 772020340 771535158
2541.3 771535158 771025956 770586550 770200551 769795120 769348264 768918872 768551409 768212080 767825544 767384887
2561.7 767384887 766982496 766663313 766340077 765921414 765476525 765112460 764786541 764423728 764049292 763728440
2582.1G63728440k85745l30865l76404l45230k78473k68817l26752l53456k91049k62022
2602.5G60609627l70026m91202m86016l98815l85403m84884n59390n46753n22018n75959
2622.9G55789161p07686p44581o46830o23345p10905p31647o37651n80310o68466p71761
2643.3G48965979p10130n66185n50925o41406o71804o10530n51224n79000o19113n37693
2663.7G42927969m34042m87625n92172n42105l71038l02613m14729n31912m95672l73304
2684.1G38382757l80636m86433m72426l61145l36707m44412n15520m59075m02630m32372
2704.5G34091401m99487n13077m70936m79042n40376n70893n16952l81767l43919m51088
2724.8G29323864n05209m53711m20510m92037n57005m83155l50893l26633m02272l63410
$$ plain form
2582.1 763728440 763442695 763111830 762735426 762390196 762111723 761842906 761516154 761162698 760871649 760609627
2602.5 760609627 760239601 759748399 759262383 758863568 758478165 757993281 757433891 756887138 756365120 755789161
2622.9 755789161 755081475 754336894 753690064 753066719 752355814 751624167 750986516 750406206 749737740 748965979
2643.3 748965979 748255849 747689664 747138739 746497333 745825529 745214999 744663775 744084775 743465662 742927969
2663.7 742927969 742493927 742006302 741414130 740872025 740500987 740198374 739783645 739251733 738756061 738382757
2684.1 738382757 738002121 737515688 737043262 736682117 736345410 735900998 735385478 734926403 734523773 734091401
2704.5 734091401 733591914 733078837 732607901 732128859 731588483 731017590 730500638 730118871 729774952 729323864
2724.8 729323864 728818655 728364944 727944434 727452397 726895392 726412237 726061344 725734711 725332439 724969029
2745.2G24969029k10642k22922m20153m88758l33846k22802l00765m12643l80993k43663
2765.6G21731842j99676k97248l49701k67386k25842l31819m39883m24921l53515l43085
2786G18498766m15325n17308n68271n26369m67002n35250o68824o46054n53668n97060
2806.4G13003635o92606p16567p01129p15554p65621p62821o92129p08103q40545r29415
2826.8G05479145r15408q34704p83860q40664q96037r71853j148224j269460j295686
2845.2F96523249j320124j328587j282811j166702j004040r03725r54807j098216j229405
2863.5F86234832j305759j332939j322269j286507j303553j367569j299561j103520
2879.9F75913155r65595q73447p34627n98431n11825m36365l64304l45528m15742m86613
$$ plain form
2745.2 724969029 724758387 724535465 724115312 723626554 723292708 723069906 722769141 722356498 721975505 721731842
2765.6 721731842 721532166 721234918 720885217 720617831 720391989 720060170 719620287 719195366 718841851 718498766
2786 718498766 718083441 717566133 716997862 716471493 716004491 715469241 714800417 714154363 713600695 713003635
2806.4 713003635 712311029 711594462 710893333 710177779 709412158 708649337 707957208 707249105 706408560 705479145
2826.8 705479145 704563737 703729033 702945173 702104509 701208472 700236619 699088395 697818935 696523249
2845.2 696523249 695203125 693874538 692591727 691425025 690420985 689517260 688562453 687464237 686234832
2863.5 686234832 684929073 683596134 682273865 680987358 679683805 678316236 677016675 675913155
2879.9 675913155 674947560 674074113 673339486 672741055 672229230 671792865 671428561 671083033 670667291 670180678
2900.2F70180678m73201m43160m37558m53651n32210o79672q48710r56476r76026r10759
2920.6F63469255o92368m05013j64509N6207J97530L00527M78565O29008O99699Q45492
2941F65414393J040518J058221Q87275P59244Q31246R13859Q58068Q28207Q92281R94861
2961.4F74478173J074374J063406J008749J045764J208484J326025J289427J284361
2977.8F83778763J380920J366317J208544J095653J106262J204073J190305R24051
2994.1F93254888P07269O08325M16159K52605J62184R2089J24276J84119N0723k66611
3014.5F95586026n14448n73754n69105n96226o26862o22809o01828o42478o89030p35283
3034.9F89414203q03470p42376o56307p40886r16779r95576r33051r15528r54926q79466
$$ plain form
2900.2 670180678 669707477 669264317 668826759 668373108 667840898 667161226 666312516 665356040 664380014 663469255
2920.6 663469255 662776887 662371874 662207365 662263572 662461102 662761629 663240194 663869202 664568901 665414393
2941 665414393 666454911 667513132 668400407 669159651 669990897 670904756 671762824 672591031 673483312 674478173
2961.4 674478173 675552547 676615953 677624702 678670466 679878950 681204975 682494402 683778763
2977.8 683778763 685159683 686526000 687734544 688830197 689936459 691140532 692330837 693254888
2994.1 693254888 693962157 694570482 694986641 695239246 695401430 695493519 695617795 695801914 695852637 695586026
3014.5 695586026 695071578 694497824 693928719 693332493 692705631 692082822 691480994 690838516 690149486 689414203
3034.9 689414203 688610733 687868357 687212050 686471164 685554385 684558809 683625758 682710230 681755304 680875838
3055.3F80875838q54373r73582r76146q17537o91772q22007j103640j123845q75593
3073.6F72637343o45279o26863q24511r54628r21070r31502r50098r06109r48489j032353
3094F63896441r97722q83937q02218q31903r19103r03428q36134q47041p73013o24120
3114.4F55477822o85454q51333j001060j156151j137674r84907q66354q59320r55045
3132.8F46980524r13799o82354o42538r40740j144230j018465q17239o93679o93381
3151.1F39434099r07838j130462j099765r95577r69529r20951q70466r03964r73285
3169.5F30662262j001656j016438j037776j009345r59873r52781r26673r45687j033664
3187.8F21778369j061976j081526j092792j079917j099467j088381j017630r41873
$$ plain form
3055.3 680875838 680021465 679047883 678071737 677254200 676562428 675740421 674636781 673512936 672637343
3073.6 672637343 671992064 671365201 670540690 669586062 668664992 667733490 666783392 665877283 664928794 663896441
3094 663896441 662898719 662014782 661212564 660380661 659461558 658558130 657721996 656874955 656101942 655477822
3114.4 655477822 654792368 653941035 652939975 651783824 650646150 649661243 648794889 647935569 646980524
3132.8 646980524 646066725 645384371 644741833 643801093 642656863 641638398 640821159 640127480 639434099
3151.1 639434099 638526261 637395799 636296034 635300457 634330928 633409977 632539511 631635547 630662262
3169.5 630662262 629660606 628644168 627606392 626597047 625637174 624684393 623757720 622812033 621778369
3187.8 621778369 620716393 619634867 618542075 617462158 616362691 615274310 614256680 613314807
3204.1F13314807r53197j064181j117349j037598r59933r85682j044213j077414j071095
3222.5F04004145j051247j062692j005590q06808o97255r34541j207054j133621r59098
3240.9E95146239q90672p97272p78198r30429r87708q69394p80463q03292q32498q11279
3261.2E86665034q30829q51810o76453m46021n98074r40561j003861r20296q80480
3279.6E79516649q47399q44002q83281q60274p37846p33077q88169j008451j154661
3298E71559489j265943j074791p83026q73745j305580j603127j587808j450777j424074
3316.3E60190618j487672j481116j394808j369477j545071j739025j730204j689732
3332.6E47753513j680017j573622j603484j835287j941621j956224j912356j717925
$$ plain form
3204.1 613314807 612361610 611297429 610180080 609142482 608182549 607196867 606152654 605075240 604004145
3222.5 604004145 602952898 601890206 600884616 600077808 599380553 598446012 597238958 596105337 595146239
3240.9 595146239 594255567 593458295 592680097 591749668 590761960 589892566 589112103 588308811 587476313 586665034
3261.2 586665034 585834205 584982395 584305942 583859921 583261847 582321286 581317425 580397129 579516649
3279.6 579516649 578669250 577825248 576941967 576081693 575343847 574610770 573722601 572714150 571559489
3298 571559489 570293546 569218755 568435729 567561984 566256404 564653277 563065469 561614692 560190618
3316.3 560190618 558702946 557221830 555827022 554457545 552912474 551173449 549443245 547753513
3332.6 547753513 546073496 544499874 542896390 541061103 539119482 537163258 535250902 533532977
3348.9E33532977j762390k110064k247751k067387j848221j838267j923024j774371
3365.3E17961502j587093j771807k158404k204418j901805j726330j729846j733541
3381.6E03148258j693309j570522j310110r86994j056850j504004j559257j076073
3397.9D92391139q10116j228899j673579j467139j079112r88424j009077j046806j069367
3416.3D82018620r51529q24839p45326o06060m37528l43948m03554l36885j08749k26497
3436.6D77033705n33551m88133k20477k3246O6608J14113J93179K60144L33131M89533
3457D77225006O22928N04881M42415Q06302J067728P60675L24130L07023N93066Q94040
3477.4D83548194R67026P50154O99938Q86142R15736R05752J025349J107037J116246
$$ plain form
3348.9 533532977 531770587 529660523 527412772 525345385 523497164 521658897 519735873 517961502
3365.3 517961502 516374409 514602602 512444198 510239780 508337975 506611645 504881799 503148258
3381.6 503148258 501454949 499884427 498574317 497587323 496530473 495026469 493467212 492391139
3397.9 492391139 491581023 490352124 488678545 487211406 486132294 485143870 484134793 483087987 482018620
3416.3 482018620 481067091 480242252 479496926 478890866 478453338 478109390 477705836 477368951 477260202 477033705
3436.6 477033705 476500154 476012021 475791544 475768298 475834906 475949019 476142198 476402342 476735473 477225006
3457 477225006 477847934 478352815 478795230 479601532 480669260 481429935 481754065 482061088 482654154 483548194
3477.4 483548194 484515220 485265374 485965312 486851454 487767190 488672942 489698291 490805328 491921574
3495.8D91921574J061618J061529J116753J016915R37193J037508J206965J390725
3512.1E00750780J368523J185417J179933J317978J433790J398325J272857J317203
3528.4E11224806J502514J620054J683832J612544J502275J658082J808822J696527
3544.7E24309456J481593J513660J728594J802147J777529J763821J859963J966715
3561.1E38203478J850724J757264K085626K492667K438724K212643K194286K339303
3577.4E55574715K507448K557338K509713K512097K539396K652646K749860K739072
3593.7E76342285K781331K964556L104687L072918K888679K734542K864718L066957
3610E99820673L132046L068685K951622L295243L782213L318310K404987K243638L310025
$$ plain form
3495.8 491921574 492983192 494044721 495161474 496178389 497115582 498153090 499360055 500750780
3512.1 500750780 502119303 503304720 504484653 505802631 507236421 508634746 509907603 511224806
3528.4 511224806 512727320 514347374 516031206 517643750 519146025 520804107 522612929 524309456
3544.7 524309456 525791049 527304709 529033303 530835450 532612979 534376800 536236763 538203478
3561.1 538203478 540054202 541811466 543897092 546389759 548828483 551041126 553235412 555574715
3577.4 555574715 558082163 560639501 563149214 565661311 568200707 570853353 573603213 576342285
3593.7 576342285 579123616 582088172 585192859 588265777 591154456 593888998 596753716 599820673
3610 599820673 602952719 606021404 608973026 612268269 616050482 619368792 621773779 624017417 627327442
3628.4F27327442L991485L376245L076196K991855K867818K790868K490223K033293
3644.7F50945425K207518L609240M155814K871514K582252L287196L127694K499223
3661F75285876K146721J780986J621604K210796K345741J792729K626538L137648K207220
3679.4F95155859J706004J331985J071572J694918K492964K097130J418770J117229
3695.7G08086431Q79586R23514J333952J158178L74019O3419P85351J879513J498640
3714G16982603M48167J25349K45869M32253O22153O54698J72674l25620l8564J015544
3734.4G20335126J700938P02500q03053o49870Q86858N96463j46806J098871J583636
3752.8G25304663L49045j14739M92454O18815J4246p2003K27630O22392P89463K76983
$$ plain form
3628.4 627327442 631318927 634695172 637771368 640763223 643631041 646421909 648912132 650945425
3644.7 650945425 653152943 656762183 660917997 663789511 666371763 669658959 672786653 675285876
3661 675285876 677432597 679213583 680835187 683045983 685391724 687184453 689810991 692948639 695155859
3679.4 695155859 696861863 698193848 699265420 700960338 703453302 705550432 706969202 708086431
3695.7 708086431 708966017 709889531 711223483 712381661 712755680 712819099 713604450 715483963 716982603
3714 716982603 717430770 717556119 717801988 718234241 718856394 719511092 719683766 719358146 719319582 720335126
3734.4 720335126 722036064 722738564 721935511 721285641 722172499 722768962 722622156 723721027 725304663
3752.8 725304663 725653708 725538969 726031423 726650238 726664484 726592481 726820111 727442503 728231966 728508949
3773.2G28508949j83642l9637M40359L75510M9233K34604L72231K16782o7234l62217
3793.6G29544938l47197m09723j58965Q04960N82278K12491O72340J16348p65681o36399
3814G29615390R8884l0517J60277J022696M11809k19703k94805l54290k76148l21329
3834.4G29812264l635O06000N30183L62993K75135m77076j488805j535177P20322K511740
3854.8G31313944M91679q85606p24793j54257R8587k23458K7477N06342K31028p3612
3875.2G30607331m59612l67343N0485K146K95699P2300m36127J21593J09315q15093
3895.5G29180694q99852k50995K71797O21975M73439j58846m62472m73857m55320k03848
3915.9G27642715O3241p9811l12686j79112j05143l82721k99633J90378J91569k55108
$$ plain form
3773.2 728508949 728325307 728285670 728726029 729101539 729150772 729385376 729757607 729974389 729907155 729544938
3793.6 729544938 729197741 728788018 728629053 729434013 730016291 730228782 730901122 731017470 730251789 729615390
3814 729615390 729714274 729683757 729844034 730866730 731278539 731058836 730764031 730409741 730133593 729812264
3834.4 729812264 729808629 730414629 730944812 731307805 731582940 731105864 729617059 728081882 728802204 731313944
3854.8 731313944 731805623 730920017 730195224 730040967 730139554 729916096 729943573 730449915 730680943 730607331
3875.2 730607331 730147719 729780376 729830861 729833007 730128706 730201006 729764879 729886472 729995787 729180694
3895.5 729180694 728280842 728029847 728301644 728923619 729397058 729238212 728775740 728301883 727846563 727642715
3915.9 727642715 727705956 727626145 727313459 727134347 727029204 726646483 726346850 726537228 726728797 726473689
3936.3G26473689n13673m39882j10149K0265j46746j13428J1146p4565j89186k10404
3956.7G24707067j87993q0287l7432j65224k28644j87337j63734j64270j46509j06036
3977.1G23239601q3566r2506j17839j62601k05696j89781j43528j16944r3461p7545
3997.5G21956134
$$ plain form
3936.3 726473689 725960016 725520134 725409985 725430250 725283504 725170076 725181222 725106657 724917471 724707067
3956.7 724707067 724519074 724438787 724401355 724236131 724007487 723820150 723656416 723492146 723345637 723239601
3977.1 723239601 723156035 723063529 722945690 722783089 722577393 722387612 722244084 722127140 722033679 721956134
3997.5 721956134
##END=$$ End of the data block
