##TITLE=Sample description $$ Begin of the data block
##JCAMP-DX=5.00 $$ ACD/SpecManager v 10.08
##SPECTROMETER/DATA SYSTEM=Alpha
##DATE=03 Jun 2014 08:17:40
##DATA TYPE=INFRARED SPECTRUM
##DATA CLASS=XYDATA
##ORIGIN=
##OWNER=
##NPOINTS=1765
##FIRSTX=399.75695801
##LASTX=3997.56933594
##MAXX=3997.56933594
##MINX=399.75695801
##MAXY=0.82343024
##MINY=0.48236328
##XFACTOR=1.0000000000
##YFACTOR=1.000000000000000e-9
##FIRSTY=0.64316171
##DELTAX=2.03957629
##XUNITS=1/CM
##YUNITS=ARBITRARY UNITS
##XYDATA=(X++(Y..Y))
399.8F43161714j282811r22859J279712J732945k92301r90689Q18789J780689m52161
418.1F44833028k918720q88109J387834O78659j179636j038015Q97527J075387p64549
436.5F42083406r50574J166701K200365L01063j272798K54929K137125J142442j270771
454.8F45791888j470923Q15034J348853q74043j989543m11630J096547J9669j942753
473.2F42383099j043499J412094J317441r65297j492202P23004J922011J79768j399040
491.5F43037379j82808J533747O32286j503706j389444P98464J188099q72373j864433
509.9F41377211l07620J003921l03745k119124j139343J104474J199961n62012r31800
528.3F39321923J008094K316296J073956m72963N79059K375782J466751q39889j013279
$$ plain form
399.8 643161714 641878903 640956044 642235756 643968701 643676400 642685711 643504500 645285189 644833028
418.1 644833028 641914308 641026199 642414033 643092692 641913056 640875041 641772568 642847955 642083406
436.5 642083406 641132832 642299533 644499898 644800961 643528163 643783092 645920217 647062659 645791888
454.8 645791888 644320965 645135999 646484852 645610809 643621266 643209636 644306183 644325852 642383099
473.2 642383099 641339600 642751694 644069135 643103838 641611636 642334640 644256651 644436419 643037379
491.5 643037379 642854571 644388318 645020604 643516898 642127454 642925918 644114017 643241644 641377211
509.9 641377211 641069591 642073512 641769767 639650643 638511300 639615774 640815735 640253723 639321923
528.3 639321923 640330017 642646313 643720269 643247306 643826365 646202147 647668898 646829009 645815730
546.6F45815730N79596P75993r79066k048910q02875O04034j54615j704514j592397
565F40492976j85907J63913r53794j274109J91987J380920Q04782Q1837Q45909K076507
585.4F43625021K008617P00712J64747J160026J573980L39985p61688j76311R41694
603.7F49576783Q39293n4955j09077Q71301J350820P23243L98636J397848K526819
622.1F57520711K340496J368940J144588J658082J686096R24468L39568O95765J329243
640.4F69007957J126945L91245L22938Q72016J083433P23482L68595N42521Q68321
658.8F75307453P74026N75721N34356L45170N00262R77456P72536O38187R23038R90510
679.2F82338715O76632M85181O59407Q93473P87735K92719j18912j51515j33931m13120
$$ plain form
546.6 645815730 646395326 647171319 646192253 644143343 643340468 643944502 643789887 642085373 640492976
565 640492976 640307069 640470982 639517188 638243079 638435066 639815986 640620768 640702605 641548514 643625021
585.4 643625021 645633638 646334350 646499097 647659123 649233103 649573088 648811400 648635089 649576783
603.7 649576783 650416076 650361121 650252044 651123345 652474165 653197408 653596044 654993892 657520711
622.1 657520711 659861207 661230147 662374735 664032817 665718913 666643381 666982949 667678714 669007957
640.4 669007957 670134902 670526147 670849085 671721101 672804534 673528016 673896611 674439132 675307453
658.8 675307453 676081479 676657200 677191556 677536726 678036988 679014444 679786980 680425167 681348205 682338715
679.2 682338715 683015347 683500528 684159935 685053408 685841143 686133862 686014950 685863435 685729504 685316384
699.6F85316384p60973o13093L099M30525L81887M29034J030087J722157J788438J430690
720F91158235J556337K223670K469719J820862J069367J039624J353145J060367J16288
738.3G03867614m21345j75893j74165r94206j726746j549244r16123q69632j405418
756.7F95634842j303077k01821P43508P49767O44982J530886K786815K929151K046406
775G05561459J606941K255619K797663K021015Q71300R57907J838803J844645R29772
793.4G20685124P74026J977504K822101K087533R83417R57251J612842J440883K79784
811.7G33620465l28541K37584N92649l43978j534462j551330q98600j191080k533018
830.1G26069689l178835k279341j284659j595497k340734j824260l31879K45750n76913
$$ plain form
699.6 685316384 684555411 683942318 683945417 684375942 684757829 685186863 686216950 687939107 689727545 691158235
720 691158235 692714572 694938242 697407961 699228823 700298190 701337814 702690959 703751326 703867614
738.3 703867614 703446269 703270376 703096211 702102005 700375259 698826015 697909892 697040260 695634842
756.7 695634842 694331765 694129944 694873452 695623219 696268201 697799087 700585902 703515053 705561459
775 705561459 707168400 709424019 712221682 714242697 715113997 716071904 717910707 719755352 720685124
793.4 720685124 721459150 723436654 726258755 728346288 729329705 730286956 731899798 733340681 733620465
811.7 733620465 733291924 733529508 734122157 733778179 732243717 730692387 729793787 728602707 726069689
830.1 726069689 722890854 720611513 719326854 717731357 715390623 713566363 713234484 713480234 712903321
848.5G12903321j048267l1352J018762N30541l98397J90973J850128K472282J682281
866.8G19170272J172722J742720K093137R56475p64906j244485o56069r38356k463519
885.2G19067991l152192k003252q62301j298129k185881j697541k89500p7962j412928
903.5G06088305k224207j391173n59926j366258k645850k332627q60990m04357j297176
921.9F93005741j573742l00944Q64208L77894o52791k74896J115739J477301N06640
940.2F94545150o497P74920J308441P1168j757443k088249j308441j401841k677918
958.6F87459290l406525k688229j895129k450884l497898l321231k244234k031863
974.9F65923297k946436l349602k384424j326800j470864k099096j705468m28081R9361
$$ plain form
848.5 712903321 711855054 711823702 712842464 713373005 712974608 713165581 715015709 717487991 719170272
866.8 719170272 720342994 722085714 724178851 725135326 724370420 723125935 722469866 721531510 719067991
885.2 719067991 715915799 713912547 713050246 711752117 709566236 707868695 707579195 707501233 706088305
903.5 706088305 703864098 702472925 701912999 700546741 697900891 695568264 694707274 694302917 693005741
921.9 693005741 691431999 691131055 691995263 692373157 691720366 691445470 692561209 694038510 694545150
940.2 694545150 694538653 695313573 696622014 696693182 694935739 692847490 691539049 690137208 687459290
958.6 687459290 684052765 681364536 679469407 677018523 673520625 670199394 667955160 665923297
974.9 665923297 662976861 659627259 657242835 655916035 654445171 652346075 650640607 650212526 650311887
993.3F50311887o18756j074314k77042N79297J31786r09388j001060k07245L6597p30634
1013.7F46241128j232028n62608L12567J99497m25399k82645O18041R70959L01004
1032F46140516k55227J59681P50362M60744k51770k07483N52654R31084N41270K29716
1052.4F49051547P11560J440585J497865J048028J083613J677513J661837M56333j021683
1070.8F57607198j612604j399636j246274j256823p98643J55091Q17895P78497N54621
1089.1F53599322P75933J235604J202941O24597K20538L36527N60224M06623N5194
1107.5F59017503J16885N86510Q01623N20229K65300M48644P69139P45654M69744M90904
1127.9F64232135R67443J272797R07958K58088j24037k80261n94735j105667j373350
$$ plain form
993.3 650311887 649693131 648618817 648341775 648921072 649052858 648143470 647142410 646935165 646971762 646241128
1013.7 646241128 645009100 644446492 644759059 644958556 644533157 644250512 644868553 645839512 646140516
1032 646140516 645885289 646044970 646795332 647256076 647004306 646796823 647349477 648280561 648821831 649051547
1052.4 649051547 649763107 651203692 652701557 653749585 654833198 656510711 658172548 658628881 657607198
1070.8 657607198 655994594 654594958 653348684 652091861 651293218 651448309 652266204 653044701 653599322
1089.1 653599322 654375255 655610859 656813800 657438397 657658935 657995462 658555686 658962309 659017503
1107.5 659017503 659134388 659720898 660522521 661042750 661308050 661756694 662525833 663271487 663741231 664232135
1127.9 664232135 665199578 666472375 667380333 667638421 667514384 667234123 666639388 665533721 664160371
1146.2F64160371j155496p87079o96063p70569n49614n365M25696N57781P28845J291216
1166.6F63199723J978814K250910K189517K328813K745271K971053K712727K296328
1182.9F82673156K164603K130091J721143R88961M92096N01573N73992L00766J1682
1201.3F91558063K08139P27058R95159Q96394Q39591J056493J221656R08852L40223
1219.7F98751628J17004K46406J93059k09450m98295k99931O2824M9591k23935j90318
1240.1F97998583K21968M86195K95699O4492K71261O62088O76453L19183J63138M74453
1260.4G01633513P68542N89073K75731L64125O91771O95825K66910o5625O4194K91109
1280.8G05575168J31786k54095l46064p0214N1736k95400o38604m52519m4286p4923
$$ plain form
1146.2 664160371 663004875 662217796 661521733 660751164 660201550 660196185 660621881 661179662 661908507 663199723
1166.6 663199723 665178537 667429447 669618964 671947777 674693048 677664101 680376828 682673156
1182.9 682673156 684837759 686967850 688688993 689677954 690170050 690671623 691245615 691546381 691558063
1201.3 691558063 691766202 692493260 693488419 694384813 695224404 696280897 697502553 698411405 698751628
1219.7 698751628 698868632 699115038 699308097 699098647 698600352 698300421 698363245 698412836 698188901 697998583
1240.1 697998583 698220551 698706746 699002445 699066937 699338198 700000286 700676739 700995922 701159060 701633513
1260.4 701633513 702402055 702991128 703266859 703630984 704322755 705018580 705285490 705219865 705284059 705575168
1280.8 705575168 705706954 705452859 705106795 705036581 705088317 704792917 704154313 703701794 703657508 703582585
1301.2G03582585m24862l91483P8916K97189r0182n13196l58045j6808j32561n55456
1321.6G01476097p05778m22299k46108n92649r45091o77109j63317j94668n49436l40879
1342F96638763K48790L95059q9347n73337m18127J7941r656m97043q53598o03616M053
1364.5F94259882o2406n84841l94165J49905K22326J9908o8248J02163L40044L79324
1384.9F94363892L32058O77406J100421O20246l62575m74810J17600M94480O0916o68168
1405.3F96261466m37916J74701J32382l16560n34654n12838l10540P0095J5914O7234
1425.7F94609284M41313L08931K7537M9889J8240L63767P38978L97325J48773K17855
1446F97321892L1352j91093j56939j07467p07984q35657N79476J125753R94325J225412
$$ plain form
1301.2 703582585 703157723 702766240 702845156 703142345 703052163 702538967 702180922 702164114 702031553 701476097
1321.6 701476097 700770319 700348020 700101912 699509263 698564172 697887063 697723746 697529078 696979642 696638763
1342 696638763 696887553 697282612 697193265 696619928 696201801 696219742 696210086 695713043 694859445 694255829 694259882
1364.5 694259882 694197476 693612635 693218470 693368375 693590701 693610609 693542361 693644524 693984568 694363892
1384.9 694363892 694695950 695373356 696473777 697094023 696731448 696256638 696374238 696868718 696929634 696261466
1405.3 696261466 695823550 695998251 696130633 695814073 695279419 694766581 694456041 694526136 694542050 694609284
1425.7 694609284 695050597 695359528 695387065 695436954 695455194 695818961 696557939 696955264 697104037 697321892
1446 697321892 697353244 697162151 697005212 696897745 696189761 695354104 695933580 697059333 698053658 699279070
1466.4F99279070J509845J364470J508057K351939K776266K593457K490521K632558
1482.8G16506183K439618J796127J507759K188384K614200K026201J302778J517952
1499.1G31899202K018750J703500M73321j91868J443387K080380J402677O66260N36621
1517.4G42032230P09295O73771R33886J165390J181483J154005O62923K44022O39260
1535.8G49396265N16295l34859J42396J201987J373589J062512O11663L72708K43545
1554.1G54586101l6776o11246J79469J421631J028418L58761j49489k25663J88232
1572.5G56739438j59622q49425m00365j64389o54936j013696j295984j636803j931608
1590.9G48632610k178729k447188k651751k843141l124297l353953l529966l809095
$$ plain form
1466.4 699279070 700788915 702153385 703661442 706013381 708789647 711383104 713873625 716506183
1482.8 716506183 718945801 720741928 722249687 724438071 727052271 729078472 730381250 731899202
1499.1 731899202 733917952 735621452 736094773 735902905 737346292 739426672 740829349 741495609 742032230
1517.4 742032230 742741525 743415296 744349182 745514572 746696055 747850060 748512983 748757005 749396265
1535.8 749396265 749912560 749577701 749720097 750922084 752295673 753358185 753969848 754342556 754586101
1554.1 754586101 754549325 753938079 754117548 755539179 756567597 756926358 756776869 756551206 756739438
1572.5 756739438 756579816 755730391 755330026 755165637 754510701 753497005 752201021 750564218 748632610
1590.9 748632610 746453881 744006693 741354942 738511801 735387504 732033551 728503585 724694490
1607.2G24694490m091739m052222l894806m590094n237103l561437k706468l323197
1623.5F93237424k967656k243817j742065j007378q94069j104296K41161J550376J801968
1641.8F86871648J726746J803399K617418L081143K844870L420532M007518L678263
1658.2G10051537L264844L164113L340005L133297K794862K957106L175437L164649
1674.5G35045850L217340L012478K525032K153337K731442L369510L080309K767324
1690.8G57902622K343774J885176J744330J964807K516747K623081K215385K074182
1707.1G75270104K012134J730502J265764Q33511J044035J882494K018630J562715
1723.4G87619889J252889J091958R08553O57082N87880J157284J390994J109302R74953
$$ plain form
1607.2 724694490 720602751 716550529 712655723 708065629 702828526 699267089 696560621 693237424
1623.5 693237424 690269768 688025951 686283886 685276508 684382439 683278143 683519304 685069680 686871648
1641.8 686871648 688598394 690401793 693019211 696100354 698945224 702365756 706373274 710051537
1658.2 710051537 713316381 716480494 719820499 722953796 725748658 728705764 731881201 735045850
1674.5 735045850 738263190 741275668 743800700 745954037 748685479 752054989 755135298 757902622
1690.8 757902622 760246396 762131572 763875902 765840709 768357456 770980537 773195922 775270104
1707.1 775270104 777282238 779012740 780278504 781112015 782156050 784038544 786057174 787619889
1723.4 787619889 788872778 789964736 790873289 791530371 792118251 793275535 794666529 795775831 796750784
1741.8G96750784R83596Q72433P03633P08699R80079J043439Q15272O54877N28395
1760.1H04041207M99368P04824O14703K17080k8133J66356P87914R57608N83113L14772
1780.5H08858812M07874N16952M50253K15888k384L01719P20202N43416K54810L79562
1800.9H12647104O41763N45443K67744J70767L24488M57346L31998K00927L01421L01838
1821.3H16190839J0729j42515j5080R1195K65360L04043J17243O1214L9100k27451
1841.7H16694677m65453j13368K73049J57833m9949p5161K682n305p5638r4235j05917
1864.2H16143215k38955k93792M4704L77238L56137J82331K7120l2067L3080Q5056
1884.6H16684067j3888j25527J4305J76549R0301k3782n9843p0095p4148j00375j37806
$$ plain form
1741.8 796750784 797734380 798606813 799310446 800019145 800999224 802042663 802857935 803512812 804041207
1760.1 804041207 804540575 805245399 805860102 806077182 806049049 806215405 807003319 807960927 808544040 808858812
1780.5 808858812 809266686 809783638 810233891 810449779 810447395 810749114 811469316 812012732 812267542 812647104
1800.9 812647104 813288867 813834310 814102054 814272821 814597309 815054655 815386653 815587580 815889001 816190839
1821.3 816190839 816201568 816059053 816043973 816135168 816400528 816704571 816821814 816883028 816922128 816694677
1841.7 816694677 816229224 816115856 816388905 816546738 816496789 816421628 816424310 816419005 816343367 816249132 816143215
1864.2 816143215 815904260 815610468 815655172 816032410 816388547 816570878 816597998 816565931 816599011 816684067
1884.6 816684067 816670179 816544652 816558957 816735506 816825807 816802025 816742182 816672087 816597939 816497564 816359758
1907H16359758j10864j6272k5213j96934l25620j82450k6882l6418M1664J08242K1398
1929.4H15610409p1705r1552o9321m5120r0361j65701l6061J85371K03192J08898M5299
1951.9H15583348J4782J5736M6789O3003N7876L4630o378K9326R4890N9963j0193m0889
1976.3H15942883m2736m2439n6326q4221j01745j35184k15053j90556n7459n2691j65164
1998.8H14799309k37823k47359k62797l29494m21465m62472m45724m88341n65886n58317
2019.2H10779631n03361m71830n25594o24359n94020m78565m74334n40734n23328m10259
2039.6H05633247l01361k85864l11136k41757j13487o2764q2731r5785l3319P7546
2060H04182589R3043L278q523Q6784J09375N6386N7458J12534J13726K6703k5988M1664
$$ plain form
1907 816359758 816248894 816232622 816207409 816010475 815684855 815502405 815475523 815439105 815480769 815589011 815610409
1929.4 815610409 815538704 815447152 815377831 815332711 815242350 815076649 815040588 815225959 815429151 815538049 815583348
1951.9 815583348 815598130 815613866 815660655 815723658 815781534 815816164 815809786 815839112 815934002 815993965 815983772 815942883
1976.3 815942883 815900147 815857708 815801382 815717161 815615416 815480232 815265179 815074623 815017164 814964473 814799309
1998.8 814799309 814561486 814314127 814051330 813721836 813300371 812837899 812392175 811903834 811337948 810779631
2019.2 810779631 810276270 809804440 809278846 808654487 808060467 807581902 807107568 806566834 806043506 805633247
2039.6 805633247 805331886 805046022 804734886 804493129 804379642 804316878 804234147 804138362 804105043 804182589
2060 804182589 804275632 804278910 804270387 804357171 804466546 804522932 804580390 804692924 804806650 804833353 804807365 804849029
2084.4H04849029J25229J03533K9206L4571J42574K01822J16288J6571M6193J44780
2104.8H05809796J17183j2339k5570N0008O6519L6061j4007m8757k0683j1205q0168
2127.3H05866838p7248L4094N7339l4868j08242r1493k2412k503m3750m6849N1856
2149.7H05582762J46687J19269Q1837J34170J98364K25425K46584L09945L95298M45246
2170.1H07885587M49956L94106L27408L65972M69566M80294M19676M06981M36902M40895
2190.5H12077343L70682K90632L32475M35054M52518M16041M01318M29928M65870M28617
2210.9H16100478L42846L24249L67821L60906K87413K23995K55942L21984K40803R7334
2231.3H18923771J29640K76328K84433J27852L6955J40190K53379J61469q940K4497
$$ plain form
2084.4 804849029 804974258 805077791 805106997 805141568 805284142 805485964 805602252 805618823 805665016 805809796
2104.8 805809796 805926979 805914640 805889070 805939078 806005597 806041658 806027651 805978894 805958211 805947006 805866838
2127.3 805866838 805789590 805823684 805881023 805846155 805737913 805646420 805624008 805621505 805577755 805530906 805582762
2149.7 805582762 805729449 805848718 805930555 806064725 806263089 806488514 806735098 807045043 807440341 807885587
2170.1 807885587 808335543 808729649 809057057 809423029 809892595 810372889 810792565 811199546 811636448 812077343
2190.5 812077343 812448025 812738657 813071132 813506186 813958704 814374745 814776063 815205991 815671861 816100478
2210.9 816100478 816443324 816767573 817135394 817496300 817783713 818007708 818263650 818585634 818826437 818923771
2231.3 818923771 819053411 819329739 819614172 819742024 819778979 819919169 820172548 820334017 820325077 820349574
2251.7H20349574K23160K64764R0360K4081J97649L39567K69890J39117J41919K38776
2272.1H22278857K36452J17063Q2612K30968L21567J41502o7771m1782P8022N2750
2292.5H23430240q8811j09851L7014Q9944j12772l28303k64048q6606j13368k68221
2312.9H22185218l06487k20835j81854l10063m53472l70264k63989l65734m15683k61426
2333.3H19035411j47820j79350k98738l43264r9122K36928J93775k50876p40647q98958
2353.6H16507339p26878o15120n23150k89440J6272K25663K45810L20315N33998N57423
2374H16252232L56912K19047K53916K84791J22309j26004k42472k06709j85490k95579
2394.4H16432953l96013l23236k16067k98202m59910m52399l28124l12685m62950n70297
$$ plain form
2251.7 820349574 820572734 820837498 820927858 820951939 821149588 821489155 821759045 821898162 822040081 822278857
2272.1 822278857 822515309 822632372 822714984 822945952 823267519 823409021 823341250 823299468 823377490 823430240
2292.5 823430240 823341429 823231578 823268592 823358536 823245764 822917461 822653413 822566807 822453439 822185218
2312.9 822185218 821878731 821657896 821476042 821165979 820712507 820342243 820078254 819712520 819296837 819035411
2333.3 819035411 818887591 818708241 818409503 818066239 817967117 818204045 818397820 818146944 817406297 816507339
2353.6 816507339 815780461 815165341 814642191 814352751 814369023 814594686 814840496 815160811 815694809 816252232
2374 816252232 816609144 816828191 817082107 817366898 817489207 817363203 817120731 816914022 816728532 816432953
2394.4 816432953 816036940 815713704 815497637 815199435 814739525 814287126 813959002 813646317 813183367 812613070
2414.8H12613070m72724l52264m27365n82099n86271m72010m44889n52058o19650n35488
2435.2H07568252m58717n46873o69539o26504m69148m27187n40733o14286n28156m03524
2455.6H02283585m44412n38469m62114l31819l40641m34041m34160l60072l61442m19558
2476G98156857m28438l67641k72393k16723k80857l54886k82168j78993k04444k86043
2496.4G95284271k72095j78039j42932k09928k81453k32935j57177k13027l09169l12984
2516.8G92974532k58386k50817l16262l59297l29137l00467l42488m27127m33266l17991
2537.2G89639294k70784l99172n04077m50551l71695l91006m55797m31776l28183l04163
2557.6G85732090l81410m23014l76820l21031l53158m42862m28438l01838k20239k74003
$$ plain form
2414.8 812613070 812140346 811788082 811360717 810778618 810192347 809720337 809275448 808723390 808103740 807568252
2435.2 807568252 807109535 806562662 805893123 805266619 804797471 804370284 803829551 803215265 802687109 802283585
2455.6 802283585 801839173 801300704 800838590 800506771 800166130 799732089 799297929 798937857 798576415 798156857
2476 798156857 797728419 797360778 797088385 796871662 796590805 796235919 795953751 795774758 795570314 795284271
2496.4 795284271 795012176 794834137 794691205 794481277 794199824 793966889 793809712 793596685 793287516 792974532
2516.8 792974532 792716146 792465329 792149067 791789770 791460633 791160166 790817678 790390551 789957285 789639294
2537.2 789639294 789368510 788969338 788465261 788014710 787643015 787252009 786796212 786364436 786036253 785732090
2557.6 785732090 785350680 784927666 784550846 784229815 783876657 783433795 783005357 782703519 782483280 782209277
2578G82209277l89576l71516k56002k89678m23014l77298j69754j04129k49386l66330
2598.4G79212594l19660k47895l29912m88579m94302l61621l19958m36723n65171n81801
2618.8G75066972n21064n53846p04468p27892n91993n51760o56486p19070o42538n62847
2639.2G68835008o38723p55668p30216o06776n38051o09815o91116n86211m29690m93408
2659.6G62755334o66976o16729m22716l97086n02110n20110m12106l06309l44276n21660
2680G58045256n70178l41892j95086l78490n33044l88086k46227l55959n31971n33104
2700.4G53971219m03762l73363m61817n10156m52519l89933m56095n74350n58317l95477
2720.8G49395430l10182m14312n22972n08725m30286m05908m55498m55082l50535k60949
$$ plain form
2578 782209277 781819701 781448185 781192183 780902505 780479491 780102193 779932439 779828310 779578924 779212594
2598.4 779212594 778892934 778645039 778315127 777826548 777332246 776970625 776650667 776213944 775648773 775066972
2618.8 775066972 774545908 773992062 773287594 772559702 771967709 771415949 770759463 770040393 769397855 768835008
2639.2 768835008 768196285 767440617 766710401 766103625 765565574 764955759 764264643 763678432 763248742 762755334
2659.6 762755334 762088358 761471629 761048913 760651827 760149717 759629607 759217501 758911192 758566916 758045256
2680 758045256 757475078 757133186 756938100 756559610 756026566 755638480 755392253 755036294 754504323 753971219
2700.4 753971219 753567457 753194094 752732277 752222121 751769602 751379669 750923574 750349224 749790907 749395430
2720.8 749395430 749085248 748670936 748147964 747639239 747208953 746803045 746347547 745892465 745541930 745280981
2741.2G45280981l07083l82602l04938k11000l07500m44711m07636k49445j74880k68162
2761.6G42223024l64899k97904j88291k36631l37124l02612k45393k83837l61562m17590
2782G39187181l79026k86341l02493m59016n83887n11169l78311m69208o92606p03692
2802.3G34421432n55634n49913o84082p40231o74009o68108p55012p83742p18355o73592
2822.7G27618754p56919q88885r17077q18252p53522q59737r67980j004696j076996
2841.1G19574690j154602j252532j336157j319230j262426j216054j146197j000524
2857.4G09886968q96513r92000j205802j365483j383186j311719j252711j290679j391470
2875.8F98797405j349092j151562r68277q48532p27057n69999m80950m59254l65555
$$ plain form
2741.2 745280981 744973898 744591296 744286358 744075358 743767858 743323147 742915511 742666066 742491186 742223024
2761.6 742223024 741858125 741560221 741371930 741135299 740798175 740495563 740250170 739966333 739604771 739187181
2782 739187181 738808155 738521814 738219321 737760305 737176418 736665249 736286938 735817730 735125124 734421432
2802.3 734421432 733865798 733315885 732631803 731891572 731217563 730549455 729794443 729010701 728292346 727618754
2822.7 727618754 726861835 725972950 725055873 724237621 723484099 722624362 721656382 720651686 719574690
2841.1 719574690 718420088 717167556 715831399 714512169 713249743 712033689 710887492 709886968
2857.4 709886968 708990455 707998455 706792653 705427170 704043984 702732265 701479554 700188875 698797405
2875.8 698797405 697448313 696296751 695328474 694479942 693752885 693182886 692701936 692242682 691877127
2894.1F91877127l10123m21346m81188m27306m25994m55499m58955m89593n80907p40707
2914.5F87085509r31322j014591r01818o56664l78907q4758J37508J88291K67864M63545
2934.9F84174657O15120P56562R59396J098394J080573R53853Q52287R00745R94146
2953.3F92385733R92537R53436R61065J020610J080454J118600J153231J173079J235008
2971.6G02073753J351476J368284J374900J476944J455962J305878J218737J203298
2987.9G12829232J249314J241326J008332P40409O14643N54204M67419K52486M4941
3006.3G19002306J00553K67029J50800k36034n02229n23806n08010n34773n88000o39736
3026.7G15988100o00696n73635o12199o92904q05617p43806o23048p07566q89659r83954
$$ plain form
2894.1 691877127 691567004 691145658 690664470 690237164 689811170 689355671 688896716 688407123 687826216 687085509
2914.5 687085509 686154187 685139596 684237778 683581114 683202207 683117449 683254957 683443248 683711112 684174657
2934.9 684174657 684789777 685546339 686505735 687604129 688684702 689638555 690490842 691391587 692385733
2953.3 692385733 693378270 694331706 695292771 696313381 697393835 698512435 699665666 700838745 702073753
2971.6 702073753 703425229 704793513 706168413 707645357 709101319 710407197 711625934 712829232
2987.9 712829232 714078546 715319872 716328204 717068613 717683256 718237460 718704879 718957365 719002306
3006.3 719002306 719102859 719369888 719520688 719284654 718782425 718258619 717750609 717215836 716627836 715988100
3026.7 715988100 715387404 714813769 714201570 713508666 712703049 711959243 711336195 710628629 709738970 708755016
3047.1G08755016r12070q43465q93355q79645q63135r47714r43601q13544p21931q14736
3067.5G00121820r94504j000583q41617o59585o24180q39710r76742q77797q87573
3085.8F92419529r69112r15706r21965r90212r53436q69751q37564q93831r38952q42750
3106.2F83286250p40767q08120p94172o25670o82175q63791r72628j122952j163065
3124.6F75512910r97603p93517p58290r03308r14157p06851o57320r19938j101792
3143F67760134r86576q27194p33733o99222q71539j116693j125395r75371q93831r10222
3163.4F58620358r44973r97304j033843r95398r61959r66549r75489j005888j058877
3181.7F49680078j069069j016021r85145j063049j152396j100660j043021j088679
$$ plain form
3047.1 708755016 707842946 706999481 706106126 705226481 704363346 703415632 702472031 701658487 700936556 700121820
3067.5 700121820 699127316 698126733 697285116 696625531 696001351 695161641 694184899 693307102 692419529
3085.8 692419529 691450417 690534711 689612746 688622534 687669098 686799347 685961783 685067952 684129000 683286250
3106.2 683286250 682545483 681737363 680943191 680317521 679635346 678771555 677798927 676675975 675512910
3124.6 675512910 674515307 673721790 672963500 672060192 671146035 670439184 669781864 668861926 667760134
3143 667760134 666773558 665946364 665212631 664513409 663641870 662525177 661399782 660424411 659530580 658620358
3163.4 658620358 657675385 656678081 655644238 654648840 653686881 652720332 651744843 650738955 649680078
3181.7 649680078 648611009 647594988 646609843 645546794 644394398 643293738 642250717 641162038
3198F41162038j106918j069009j046300j053632j115858j165152j104831j010776r81927
3216.4F31507635j066387j159310j109600j076519j161635j157821r40978p65860r68099
3234.7F22101426j238346j169741r91702r25958q87990q90732r94444j023710q95381
3253.1F13083422q01980q50499q84473q40903q28027p83205o28949m96626o53147r98438
3273.5F05317175j104593r65416q67486r35436j023531r50932q08001p35342p98285
3291.8E97128153r67324j138508j282096j297832j096844q78990j054823j550854j815855
3310.2E86045027j757801j627385j579345j634419j677513j602232j557529j812995
3326.5E72795808k091467k050579j946866j919449j864552j949012k164066k260387
$$ plain form
3198 641162038 640055120 638986111 637939811 636886179 635770321 634605169 633500338 632489562 631507635
3216.4 631507635 630441248 629281938 628172338 627095819 625934184 624776363 623835385 623069525 622101426
3234.7 622101426 620863080 619693339 618701637 617775679 616887689 615996957 615002513 613978803 613083422
3253.1 613083422 612281442 611430943 610546470 609705567 608877540 608094335 607465386 606968760 606315613 605317175
3273.5 605317175 604212582 603247166 602379680 601444244 600420713 599469781 598661780 597926438 597128153
3291.8 597128153 596160829 595022321 593740225 592442393 591345549 590466559 589411736 587860882 586045027
3310.2 586045027 584287226 582659841 581080496 579446077 577768564 576166332 574608803 572795808
3326.5 572795808 570704341 568653762 566706896 564787447 562922895 560973883 558809817 556549430
3342.8E56549430k283812k220809k043247k159179k551794k646863k413273k221405
3359.1E38009048k254248k346456k208412k009630k150774k565086k686262k379060
3375.5E19409120k099931j990080j991212k009273j866341j563072j269579j355231
3391.8E05264401j727759j757086j347124j058787j377911j816541j638770j239866
3408.1D93300557j137614j180858j237571j180231r63122r05246r53674p82192m95463
3426.5D84464586k98470k72185k30283r1076j95384m82827m51177p9900K03877J99557
3446.8D82766718J70231L30328M86494N54174O49839P60019P07209P37429J115382
3465.2D88277823J320898R76593N32627N42432Q25762J095146J196355R90719R32693
$$ plain form
3342.8 556549430 554265618 552044809 550001562 547842383 545290589 542643726 540230453 538009048
3359.1 538009048 535754800 533408344 531199932 529190302 527039528 524474442 521788180 519409120
3375.5 519409120 517309189 515319109 513327897 511318624 509452283 507889211 506619632 505264401
3391.8 505264401 503536642 501779556 500432432 499373645 497995734 496179193 494540423 493300557
3408.1 493300557 492162943 490982085 489744514 488564283 487601161 486695915 485742241 484960049 484464586
3426.5 484464586 484166116 483893931 483663648 483572572 483377188 482894361 482443184 482363284 482567161 482766718
3446.8 482766718 482936949 483267277 483753771 484307945 484957784 485717803 486425012 487162441 488277823
3465.2 488277823 489598721 490575314 491107941 491650373 492476135 493571281 494767636 495758355 496691048
3483.6D96691048J149982J152486J081228J215160J344979J384139J321137J277924
3499.9E06618083J287639J163005J120806J270175J437903J663863J665056J374483
3516.2E17601013J302481J502216J705825J677990J486599J469732J678645J912535
3532.5E30337036K015292J889468J732468J886845K104699K020538J744330J746237
3548.8E45476913J957119K010047K063990K237678K366721K322257K145231J984715
3565.1E62564671K134085K673924K979159K825975K669931K738714K936781L058552
3581.5E84581792L025949K880574K715170K993047L334463L302455L293991L480673
3597.8F09608114L580630L521740L406882L246427L198087L346086L504753L509342
$$ plain form
3483.6 496691048 497841030 498993516 500074744 501289904 502634883 504019022 505340159 506618083
3499.9 506618083 507905722 509068727 510189533 511459708 512897611 514561474 516226530 517601013
3516.2 517601013 518903494 520405710 522111535 523789525 525276124 526745856 528424501 530337036
3532.5 530337036 532352328 534241796 535974264 537861109 539965808 541986346 543730676 545476913
3548.8 545476913 547434032 549444079 551508069 553745747 556112468 558434725 560579956 562564671
3565.1 562564671 564698756 567372680 570351839 573177814 575847745 578586459 581523240 584581792
3581.5 584581792 587607741 590488315 593203485 596196532 599530995 602833450 606127441 609608114
3597.8 609608114 613188744 616710484 620117366 623363793 626561880 629907966 633412719 636922061
3614.1F36922061L439188L522933L785670L696143L193021K880335L102899L589451
3630.4F64131701L696263L512204L244817L130674L094912K808094K384066K315820
3646.7F88318551L039121L670395L269612K954543L134012L145814K808929K394020
3663G12734997K029598J852632K012610K074420J825870K139866K716958K586723K186537
3681.4G32160211J748263J473904J677454J968324J901150J719713J455426J133025
3697.7G45237470J027524J202345J207590Q14557L88384M65632J150906J454353J047611
3716.1G53996372O22094M29690M00007M97639N94735M36604R3639l1948M15623J121879
3736.5G58576334R35554Q2552j96874K99931M11153R3162N24998J175642Q67128L82244
$$ plain form
3614.1 636922061 640361249 643884182 647669852 651365995 654559016 657439351 660542250 664131701
3630.4 664131701 667827964 671340168 674584985 677715659 680810571 683618665 686002731 688318551
3646.7 688318551 691357672 695028067 698297679 701252222 704386234 707532048 710340977 712734997
3663 712734997 714764595 716617227 718629837 720704257 722530127 724669993 727386951 729973674 732160211
3681.4 732160211 733908474 735382378 737059832 739028156 740929306 742649019 744104445 745237470
3697.7 745237470 746264994 747467339 748674929 749489486 749877870 750343502 751494408 752948761 753996372
3716.1 753996372 754618466 755048156 755448163 755945802 756540537 756977141 757070780 757038832 757454455 758576334
3736.5 758576334 759511888 759594440 759397566 759697497 760108650 760201812 760726810 761902452 762769580 763151824
3756.9G63151824M30406N70953L60131J60932J76430L87669O29544N27859K00927Q5950
3777.3G66682625K43842K68221J43051K57314M29630L48806O6579k03669k67983k72751
3797.7G67695665j64628K68698M42147L85702N56111L59714j71363m10199k43664r6977
3818G68621206P7963M94719M81605J98722J669j25885j73211k44141j77323J21653
3838.4G69276977M16100N54978M24088r9421p63595j041830k34902J075447Q28505
3856.8G70436347R1433k67267l10123j34587q7083k3186K41280L60965K16723j48952
3877.2G70375550l02017p1943N6625J13904M2975j62542q4042q047k61664n09620m41790
3899.6G68747389o2167L18825L80158J12295j75178k90215k67088k26557j91570j54972
$$ plain form
3756.9 763151824 763582230 764153183 764513314 764674246 764850676 765238345 765867889 766395748 766596675 766682625
3777.3 766682625 766926467 767194688 767337739 767595053 768024683 768373489 768440068 768236399 767968416 767695665
3797.7 767695665 767531037 767799735 768241882 768627584 769183695 769543409 769372046 768961847 768718183 768621206
3818 768621206 768699169 769193888 769675493 769874215 769875884 769749999 769576788 769332647 769155324 769276977
3838.4 769276977 769693077 770248055 770672143 770572722 769809127 768767297 768532395 769607842 770436347
3856.8 770436347 770527780 770260513 769950390 769815803 769728720 769705534 769946814 770307779 770524502 770375550
3877.2 770375550 770073533 770001590 770058215 770172119 770215094 770052552 769968510 769960463 769698799 769189179 768747389
3899.6 768747389 768685222 769004047 769384205 769496500 769321322 769031107 768764019 768537462 768345892 768190920
3920G68190920j70529j34587m8995j31607k34544q3447R2328k5272k60592l02374j33515
3942.5G66757786l3140j08242j23501l1709O496l7908j13130j26183n9247o3121j68681
3964.9G65899420j96815j50084r6083o020M8637q106j21713j58131j29580j39594j92523
3987.3G64749408j84119o8188j1384l7372n7042
3997.5G64391303
$$ plain form
3920 768190920 768020391 767885804 767836809 767705202 767470658 767387211 767479539 767454267 767193675 766891301 766757786
3942.5 766757786 766724646 766616404 766492903 766461194 766467690 766429782 766316652 766190469 766131222 766068101 765899420
3964.9 765899420 765702605 765552521 765456438 765450418 765499055 765490949 765369236 765211105 765081525 764941931 764749408
3987.3 764749408 764565289 764497101 764485717 764448345 764391303
3997.5 764391303
##END=$$ End of the data block
