##TITLE=$$ Begin of the data block
##JCAMP-DX=5.00 $$ ACD/SpecManager v 10.08
##SPECTROMETER/DATA SYSTEM=Varian
##DATE=04 Dec 2012 14:36:38
##DATA TYPE=INFRARED SPECTRUM
##DATA CLASS=XYDATA
##ORIGIN=
##OWNER=
##NPOINTS=3735
##FIRSTX=399.26403809
##LASTX=4000.35498047
##MAXX=4000.35498047
##MINX=399.26403809
##MAXY=85.12675476
##MINY=51.56960678
##XFACTOR=1.0000000000
##YFACTOR=0.000000100000000
##FIRSTY=83.81890106
##DELTAX=0.96440572
##XUNITS=1/CM
##YUNITS=TRANSMITTANCE
##XYDATA=(X++(Y..Y))
$$ plain form
399.3 838189011 851267548 848219147 845687790 832785797 831750183 827620621 806717758 791740112
407 791740112 784454041 795819931 799813690 802944717 823803864 840890579 831894760 810527191
414.7 810527191 807734833 803392410 800848923 805352707 833565216 822990341 794487762 798167572
422.4 798167572 817243729 822186661 809962234 799136734 802995758 808061676 817181702 810725861
430.1 810725861 807788315 816309433 817733231 813487091 812586441 816743393 805139847 802258453
437.8 802258453 807958984 810686417 811151581 807381439 810479050 815162430 820830078 823131180 825148697
446.5 825148697 822331619 817615128 813870621 806542511 809307785 812567368 809259186 806223755
454.2 806223755 808286896 810881119 806265717 799535599 802596970 817973175 817680283 804104843
$$ packed form
399.3H38189011J3078537l048401k531357j2901993j035614m129562k0902863j4977646
407G91740112p286071J1365890L993759L131027K0859147J7086715q995819k1367569
414.7H10527191k792358m342423k543487M503784K8212509j0574875k8502579L679810
422.4G98167572J9076157M942932j2224427j0825500L859024N065918R120026o455841
430.1H10725861k937546Q521118J423798m246140r00650M156952j1603546k881394
437.8H02258453N700531K727433M65164l770142L097611M683380N667648K301102K017517
446.5H25148697k817078m716491l744507p328110K765274L259583l308182l035431
454.2H06223755K063141K594223m615402o730118L061371J5376205k92892j3575440
$$ plain form
462 804104843 803195496 804775543 809828644 815851135 823963394 817937012 806739731 807512436 811046448
470.6 811046448 815652084 800739975 792026749 803276978 816367187 817511063 811353607 810857925
478.3 810857925 806833344 805734558 807716293 813227997 816366501 809501114 809042282 814845428 816824265
487 816824265 809830246 806250381 809182663 810452423 806555328 803582993 807628555 809686127 811822586
495.7 811822586 815796967 816631775 808240662 803822861 812360535 815335312 811827774 806770706 802005005
504.4 802005005 801011734 804648361 807761154 806444473 807634201 804560394 803340683 807874985 806095963
513.1 806095963 802430725 805773010 811219254 810812683 811923523 811367874 809355164 812122879 808950729
521.7 808950729 802883530 801735001 802283478 803090515 804545059 803363876 802928543 805740814 808664246
$$ packed form
462H04104843r09347J580047N053101O022491Q112259o026382j1197281P72705L534012
470.6H11046448M605636j4912109q713226J1250229J3090209J143876o157456m95682
478.3H10857925m024581j098786J981735N511704L138504o865387m58832N803146J978837
487H16824265o994019l579865K932282J269760l897095k972335M045562K057572K136459
495.7H11822586L974381Q34808q391113m417801Q537674K974777l507538n057068m765701
504.4H02005005r93271L636627L112793j316681J189728l073807j219711M534302j779022
513.1H06095963l665238L342285N446244m06571J110840n55649k012710K767715l172150
521.7H08950729o067199j148529N48477Q07037J454544j181183m35333K812271K923432
$$ plain form
530.4 808664246 810486374 809946976 808279877 803255005 799762573 799758377 799968796 804575424 808089523
539.1 808089523 812938080 817727509 810390091 801380539 798998108 799600830 802265549 801666565 798726730
547.8 798726730 800288162 805993805 811389999 811640930 811258163 812522507 809266739 805664902 803532639
556.5 803532639 801893539 801106720 801783905 805621185 807393112 807763443 810637970 813548584 810993958
565.1 810993958 806318436 803637772 799481735 796133652 795781555 799881439 804800262 805950470 809067078
573.8 809067078 813432846 813848495 807400360 801749649 800350189 797979736 796478577 799971848 804036789
582.5 804036789 808257446 813227615 814799652 814242325 811035843 806212921 802496033 799076004 798223190
591.2 798223190 798253174 800350113 802845230 805194778 811634979 815568542 813904953 809801102 804491806
$$ packed form
530.4H08664246J822128n39398j667099n024872l492432m196K10419M606628L514099
539.1H08089523M848557M789429p337418r009552k382431O02722K664719n98984k939835
547.8G98726730J561432N705643N396194K50931l82767J264344l255768l601837k132263
556.5H03532639j639100p86819O77185L837280J771927L70331K874527K910614k554626
565.1H10993958m675522k680664m156037l348083l52097M099884M918823J150208L116608
573.8H09067078M365768M15649o448135n650711j399460k370453j501159L493271M064941
582.5H04036789M220657M970169J572037n57327l206482m822922l716888l420029q52814
591.2G98223190K9984K096939K495117K349548O440201L933563j663589m103851n309296
$$ plain form
599.9 804491806 798744736 796279373 797210236 797866669 800580902 805003052 808458939 810157700 809431229
608.5 809431229 807087021 803737259 800432434 797403412 795557022 795155411 796355438 798426361 801977386
617.2 801977386 807495728 810352402 810413361 808560791 806038284 803432465 799954987 796818161 795753403
625.9 795753403 798199387 802121048 805535507 809626465 813686981 813753204 809783478 805330658 801521454
634.6 801521454 798003082 795588531 797753677 802535324 805484848 807437134 810121994 812367325
642.3 812367325 810342789 806555481 803629150 800917816 798877640 798902588 799993057 801336212 805313416
651 805313416 807662659 809029541 810640640 807650757 804695435 803815384 802129211 799686890 800625763
659.7 800625763 803301315 805099945 808383331 810121613 809951324 810660095 813745117 813600540 789197235
$$ packed form
599.9H04491806n747070k465363R30863O56433K714233M422150L455887J698761p26471
608.5H09431229k344208l349762l304825l029022j846390m01611J200027K070923L551025
617.2H01977386N518342K856674O0959j852570k522507k605819l477478l136826j064758
625.9G95753403K445984L921661L414459M090958M060516O6223l969726m452820l809204
634.6H01521454l518372k414551K165146M781647K949524J952286K684860K245331
642.3H12367325k024536l787308k926331k711334k040176K4948J090469J343155L977204
651H05313416K349243J366882J611099k989883k955322q80051j686173k442321R38873
659.7H00625763K675552J798630L283386J738282j70289P08771L085022j44577k4403305
$$ plain form
668.3 789197235 792403030 799655838 802451935 803881073 805785294 809052429 811800232 810527039
676.1 810527039 807922821 807955704 807150879 805115967 803387146 803369751 804628983 806165771 808085785
684.7 808085785 808524246 808377075 806927643 806559525 806769867 805629349 805420380 804264374 804951630
693.4 804951630 807270508 808756790 810178528 810943375 811168594 810119171 808609314 806730423 806206741
702.1 806206741 806753464 807330856 807860870 806955261 807924194 809605560 809392700 808128815 807130127
710.8 807130127 807098923 806738739 806624756 807124710 808957977 810601578 810788345 810639648 809701691 808256531
720.4 808256531 806976318 806282654 806224060 807217865 808411713 810125885 811040726 810550842 811518250
729.1 811518250 811866684 811555023 810075836 808109207 807581558 806805801 807402725 808940125 810558014
$$ packed form
668.3G89197235L205795P252808K796097J429138J904221L267135K747803j273193
676.1H10527039k604218L2883q04825k034912j728821j7395J259232J536788J920014
684.7H08085785M38461j47171j449432l68118K10342j140518k08969j156006O87256
693.4H04951630K318878J486282J421738P64847K25219j049423j509857j878891n23682
702.1H06206741N46723N77392N30014r05609R68933J681366k12860j263885r98688
710.8H07130127l1204l60184j13983M99954J833267J643601J86767j48697r37957j445160
720.4H08256531j280213o93664n8594R93805J193848J714172R14841m89884R67408
729.1H11518250L48434l11661j479187j966629n27649p75757N96924J537400J617889
$$ plain form
737.8 810558014 811359406 811830215 812568436 811976242 810084000 806304626 804803238 805724182 806502762
746.5 806502762 808326874 810891495 813279037 813839188 814795380 814535980 811488495 809332886 807756729
755.1 807756729 805783081 805229492 806968536 808198700 810259018 813424301 814782562 815201111 813686752
763.8 813686752 810947495 808951797 807484055 805566559 805207443 807545166 809547272 811224289 813612671
772.5 813612671 815426788 814469376 812830582 811061630 807911987 806174545 805347977 805839539 807696152
781.2 807696152 809766769 813066635 815876999 816821594 815986404 813769302 810748672 808304291 806835937
789.9 806835937 806510086 807143478 808261261 811317215 815399017 818080292 817863846 815987701 814132996
798.5 814132996 811527328 808755112 807552643 808503494 810651550 813135757 814707870 816531754 818884506
$$ packed form
737.8H10558014Q01392M70809P38221n92194j892242l779374j501388R20944P78580
746.5H06502762J824112K564621K387542N60151R56192k59400l047485k155609j576157
755.1H07756729j973648n53589J739044J230164K060318L165283J358261M18549j514359
763.8H13686752k739257j995698j467742j917496l59116K337723K002106J677017K388382
772.5H13612671J814117r57412j638794j768952l149643j737442q26568M91562J856613
781.2H07696152K070617L299866K810364R44595q35190k217102l020630k444381j468354
789.9H06835937l25851O33392J117783L055954M081802K681275k16446j876145j854705
798.5H14132996k605668k772216j202469R50851K148056K484207J572113J823884K352752
$$ plain form
807.2 818884506 819164886 818149567 816101608 813502579 810961304 809651337 809661255 809464264 811228104
815.9 811228104 814805984 818167038 819909668 818899994 816897125 814692688 812463531 811411362
823.6 811411362 810631104 810029297 811255875 813414459 815470657 816989975 818157806 817524261 815511322
832.3 815511322 814926376 813086472 810830078 809078903 808013382 809810486 813512497 817825089 818665085
841 818665085 817457199 816359177 813919601 811954193 810233765 809146423 808764801 809844894 812035065
849.6 812035065 814285278 816426086 817064514 817626648 817220993 815481873 812907028 810824738 810542831
858.3 810542831 810415573 811392746 812412262 813734512 815878143 815773926 815336914 816034775 815356369
867 815356369 813853302 813045959 812171555 810919800 810806580 813720093 815541000 815545731 816256409 815829773
$$ packed form
807.2H18884506K80380j015319k047959k599029k541275j309967R918j96991J763840
815.9H11228104L577880L361054J742630j009674k002869k204437k229157j052169
823.6H11411362p80258o01807J226578K158584K056198J519318J167831o33545k012939
832.3H15511322n84946j839904k256394j751175j065521J797104L702011M312592Q39996
841H18665085j207886j098022k439576j965408j720428j087342l81622J080093K190171
849.6H12035065K250213K140808O38428N62134m05655j739120k574845k082290k81907
858.3H10542831j27258R77173J019516J322250K143631j04217m37012O97861o78406
867H15356369j503067q07343q74404j251755j13220K913513J820907M731P10678m26636
$$ plain form
876.7 815829773 816170197 814939804 813048859 813576279 812834167 811857834 812353592 815033722 817364426
885.3 817364426 817298737 816287689 814673920 813499069 812886047 813158340 812221375 811169357 812160034
894 812160034 812805557 812926941 812954559 812674026 812339401 812716751 812415848 811973343 812247849 811772308
903.7 811772308 811955872 812396545 812163773 811530762 811802139 812356186 811885452 811362000 810157623 809811630
913.3 809811630 810676727 811312866 810826416 810272598 810562744 810090027 809997406 809371490 808244553 808013306
922.9 808013306 808387299 808893890 808957672 809817200 810241165 809995880 809040070 807978897 808312454 808106155
932.6 808106155 807785568 807712021 807578354 808023148 809082718 809460678 809127808 809449768 809456253 808962021
942.2 808962021 807817612 807192001 807349854 807768631 807828751 806701660 807450867 809270554 810635376
$$ packed form
876.7H15829773L40424j230393j890945N27420p42112r76333M95758K680130K330704
885.3H17364426o5689j011048j613769j174851o13022K72293r36965j052018R90677
894H12160034O45523J21384K7618k80533l34625L77350l00903m42505K74506m75541
903.7H11772308J83564M40673k32772o33011K71377N54047m70734n23452j204377l45993
913.3H09811630Q65097O36139m86450n53818K90146m72717r2621o25916j126937k31247
922.9H08013306L73993N06591O3782Q59528M23965k45285r55810j061173L33557k06299
932.6H08106155l20587p3547j33667M44794J059570L77960l32870L21960O485m94232
942.2H08962021j144409o25611J57853M18777O0120j127091P49207J819687J364822
$$ plain form
950.9 810635376 811119690 809850845 807616501 804855576 803850937 803834152 804534607 805761948 806147766
959.6 806147766 807188644 807873535 807373962 806056595 804951019 804225769 802988205 801699448 801034698
968.3 801034698 801559677 802208557 802920990 803667679 803738251 803680267 802916718 801171265 799885025 799123611
977.9 799123611 797461472 796273193 796433029 797062683 797916031 798556137 798602524 798094254 797795715 796964111
987.6 796964111 795431900 793947754 792990265 793179169 793617935 793547363 793210526 793990479 794875870 794354477
997.2 794354477 793388901 792090530 790546494 788982544 789091568 789830933 789625244 790276794 790516357
1005.9 790516357 790526810 791507111 791462555 790584106 789978790 788902206 788115005 787964935 787483521 787713776
1015.5 787713776 788324356 788362808 788034210 787254868 786370773 785825882 785513840 784710922 784046097 784246826
$$ packed form
950.9H10635376M84314j268845k234344k760925j004639j6785P00455J227341L85818
959.6H06147766J040878O84891m99573j317367j105576p25250j237564j288757o64750
968.3H01034698N24979O48880P12433P46689P0572n7984p63549j745453j286240p61414
977.9G99123611j662139j188279J59836O29654Q53348O40106M6387n08270k98539q31604
987.6G96964111j532211j484146r57489J88904M38766p0572l36837P79953Q85391n21393
997.2G94354477r65576j298371j544036j563950J09024P39365k05689O51550K39563
1005.9G90516357J0453R80301m4556q78449o05316j076584p87201j50070m81414K30255
1015.5G87713776O10580L8452l28598p79342q84095n44891l12042q02918o64825K00729
$$ plain form
1025.2 784246826 784368286 783356476 782790985 784209137 785916290 786205215 784813843 783980408 784580383
1033.8 784580383 785090256 785261078 785187225 785052414 784972076 785810165 786485062 786409149 786508865 785928574
1043.5 785928574 785631409 785543594 784926910 784591980 784525146 784260712 784205399 784297638 784479675 785596161
1053.1 785596161 785948334 785619736 785362473 784810791 784744034 784536591 784685898 784922714 785002441 784976120
1062.8 784976120 784825134 785443802 785995636 786040115 785321579 785429764 786751175 786766739 785909271 785740128
1072.4 785740128 785899124 785496979 784246674 782826233 783265381 783783188 783279343 783265457 783197937 783273773
1082.1 783273773 783850250 784858170 784246750 783498688 783090057 781655502 782046356 782129898 782192001 782793961
1091.7 782793961 783235931 784729691 784804077 783977509 782969360 782459946 782336731 782277145 782016754 780800781
$$ packed form
1025.2G84246826J21460j011810n65491J418152J707153K88925j391372q33435N99975
1033.8G84580383N09873J70822p3853j34811q0338Q38089O74897p5913R9716n80291
1043.5G85928574k97165q7815o16684l34930o6834k64434n5313R2239J82037J116486
1053.1G85596161L52173l28598k57263n51682o6757k07443J49307K36816P9727k6321
1062.8G84976120j50986O18668N51834M4479p18536J08185J321411J5564q57468j69143
1072.4G85740128J58996m02145j250305j420441M39148N17807n03845j3886o7520P5836
1082.1G83273773N76477J007920o11420p48062m08631j434555L90854Q3542O2103O01960
1091.7G82793961M41970J493760P4386q26568j008149n09414j23215n9586k60391j215973
$$ plain form
1101.4 780800781 781518402 782880173 783468552 783701553 783569412 783419189 782613220 781715775 780321274
1110 780321274 779532089 779408569 779743652 780574188 781275177 782802963 783809662 783870316 783106689 782456360
1119.7 782456360 782413330 781301422 779708633 779147034 779821930 780528870 782362137 784470825 784758606
1128.4 784758606 784634018 784718094 784421234 782763443 781599426 781709976 781986389 782347412 783503036
1137 783503036 785305939 785994568 786913910 787152710 786374207 786236420 785242615 783664703 782495270
1145.7 782495270 782028656 781707840 782140198 782791290 783065033 783858185 784159317 784199066 783061447 781692429
1155.4 781692429 780886536 779375229 779227905 780528946 781656876 782697220 784250488 785215988 785298462
1164 785298462 785208054 784522171 783910675 782784653 781617584 781343689 782509155 784838409 786430511
$$ packed form
1101.4G80800781P17621J361771N88379K33001j32141j50223q05969q97445j394501
1110G80321274p89185j23520L35083Q30536P00989J527786J006699O0654p63627o50329
1119.7G82456360m3030j111908j592789n61599O74896P06940J833267K108688K87781
1128.4G84758606j24588Q4076k96860j657791j164017J10550K76413L61023J155624
1137G83503036J802903O88629R19342K38800p78503j37787r93805j577912j169433
1145.7G82495270m66614l20816M32358O51092K73743P93152L01132L9749j137619j369018
1155.4G81692429q05893j511307j47324J301041J127930J040344J553268R65500Q2474
1164G85298462r0408o85883o11496j126022j167069k73895J165466K329254J592102
$$ plain form
1172.7 786430511 787636719 788381882 788620834 788250656 787068176 786157227 785775223 785475235 785447693
1181.4 785447693 786609726 788338089 790043945 791075897 791296921 791366196 790569763 789373169 788175507
1190.1 788175507 787269745 786917801 787296982 787784195 788246841 789569168 790708389 791503448 791406326
1198.8 791406326 790254974 788589401 786705933 786334000 787201920 788096085 788525314 789100571 789845123
1207.4 789845123 790137405 790136337 789744797 789834824 789294052 788102722 787917786 788207169 788653488 788886108
1217.1 788886108 789250717 790078278 790757828 791100159 790827866 789849701 789005203 788616638 788241348 788351517
1226.7 788351517 788625641 789071884 790083618 790418701 790002289 789532318 788821106 788086624 787737045
1235.4 787737045 787569656 787357864 787436676 788146286 788505020 788646088 788982544 788752213 788252792 787463913
$$ packed form
1172.7G86430511J206208P45163K38952l70178j182480r10949l82004k99988k7542
1181.4G85447693J162033J728363J705856J031952K21024O9275p96433j196594j197662
1190.1G88175507r05762l51944L79181M87213M62646J322327J139221P95059r7122
1198.8G91406326j151352j665573j883468l71933Q67920Q94165M29229N75257P44552
1207.4G89845123K92282j068l91540R0027n40772j191330j84936K89383M46319K32620
1217.1G88886108L64609Q27561O79550L42331k72293r78165q44498l88565l75290J10169
1226.7G88351517K74124M46243J011734L35083m16412m69971p11212p34482l49579
1235.4G87737045j67389k11792P8812P09610L58734J41068L36456k30331m99421p88879
$$ plain form
1245 787463913 787202988 787149200 786821060 787282486 787545242 787933350 788473892 788420410 788339920 788211899
1254.7 788211899 787668762 786612701 786151352 786116028 786325684 787024078 787875290 788494492 788558426 788605347
1264.3 788605347 788023224 787414856 786936340 785999756 785827026 786301346 786732330 787117996 788030930 788430710
1274 788430710 788304291 788217545 787224808 786397934 785930710 785879669 785925446 786019974 786935043 787813644 788497467
1284.6 788497467 788523026 788044891 787217636 785873718 784812927 784418030 784676819 785025711 785710602
1293.3 785710602 786696014 787791443 788599625 788578873 788023376 786588287 784761505 783320847 782859421
1301.9 782859421 783153000 783888321 784819794 785734329 786997452 787763443 787471237 786625290 785130997
1310.6 785130997 782690964 781053085 780811691 780604324 781704330 783467865 784657516 785281830 785644531
$$ packed form
1245G87463913k60925n3788l28140M61426K62756L88108N40542n3482q0490j28021
1254.7G88211899n43137j056061m61349l5324K09656O98394Q51212O19202O3934M6921
1264.3G88605347n82123o08368m78516r36584j72730M74320M30984L85666R12934L99780
1274G88430710j26419q6746r92737q26874m67224n1041M5777R4528R15069Q78601O83823
1284.6G88497467K5559m78135q27255j343918j060791l94897K58789L48892O84891
1293.3G85710602R85412J095429Q08182k0752n55497j435089j826782j440658m61426
1301.9G82859421K93579P35321R31473R14535J263123P65991k92206q45947j494293
1310.6G85130997k440033j637879k41394k07367J100006J763535J189651O24314L62701
$$ plain form
1319.3 785644531 785814438 784764328 783195801 781753082 780845566 780715408 781036682 781867447 783273621
1328 783273621 784703064 785816498 786354218 785638275 784649277 783149948 781394882 779876556 778372192
1336.7 778372192 778837433 779795761 780892639 782278366 783573761 784532318 783697357 782665176 781460037
1345.3 781460037 780006409 778907089 778095474 778202972 779648437 782002182 783375244 784259491 784320526
1354 784320526 782983475 781464996 780023804 778972168 777916031 778116989 778140411 778317871 779766006
1362.7 779766006 780541992 782482147 783470306 782576065 781040421 778136597 776154785 775869827 775928726
1371.4 775928726 776652069 777891159 777905045 778143539 779882736 781047897 780400696 778472748 776932678
1380.1 776932678 775150223 773798523 773176727 773749771 775297775 777164459 778568344 778021545 779109344
$$ packed form
1319.3G85644531J69907j050110j568527j442719r07516j30158L21274Q30765J406174
1328G83273621J429443J113434N37720p15943r88998j499329j755066j518326j504364
1336.7G78372192M65241R58328J096878J385727J295395R58557q34961j032181j205139
1345.3G81460037j453628j099320q11615J07498J445465K353745J373062Q84247O1035
1354G84320526j337051j518479j441192j051636j056137K00958K3422J77460J448135
1362.7G79766006P75986J940155R88159q94241j535644k903824j981812k84958N8899
1371.4G75928726P23343J239090J3886K38494J739197J165161o47201j927948j540070
1380.1G76932678j782455j351700o21796N73044J548004J866684J403885n46799J087799
$$ plain form
1388.7 779109344 779623642 778071060 776293564 775370483 775962067 774250107 772885590 775346527 778037796
1397.4 778037796 779503021 777838898 777787018 778315125 777237625 776120605 775246506 773104401 772868805
1406.1 772868805 774923401 776674423 778146896 778529663 778259811 777808914 776591339 775753098 774653320
1414.8 774653320 774557037 774147568 774122314 775611572 772701874 773633347 776628799 777677994 776319351
1423.4 776319351 773278732 772851181 773207932 772291412 772409058 773172531 772327881 773085327 774729309
1432.1 774729309 775342484 775467911 776457672 777042694 769915695 768876190 771405106 772147675 772690964
1440.8 772690964 773572006 774466248 775580368 775851822 774789429 774429321 773412094 770202103 770412292
1449.5 770412292 771779175 772118607 772296371 772999268 774149017 775025177 773823853 767530975 765096741
$$ packed form
1388.7G79109344N14298j552582j777496r23081N91584j711960j364517K460937K691269
1397.4G78037796J465225j664123n1880N28107j077500j117020q74099k142105k35596
1406.1G72868805K054596J751022J472473L82767k69852m50897j217575q38241j099778
1414.8G74653320r6283m09469k5254J489258k909698R31473K995452J049195j358643
1423.4G76319351l040619m27551L56751r16520J17646P63473q44650P57446J643982
1432.1G74729309O13175J25427R89761N85022p126999j039505K528916P42569N43289
1440.8G72690964Q81042Q94242J114120K71454j062393l60108j017227l209991K10189
1449.5G70412292J366883L39432J77764P02897J149749Q76160j201324o292878k434234
$$ plain form
1458.2 765096741 767035522 768677979 770609665 771256638 771596680 773428345 772173615 771333923 773557587
1466.8 773557587 774683380 774427643 773585281 774190216 773674164 769058075 767387085 770341339 773822098
1475.5 773822098 773361588 773770294 775448914 775386505 775767593 775055695 774014893 774113770 774065704 774598236
1485.2 774598236 775498123 774277954 773270645 774958267 773043976 770376205 772361603 774204636
1492.9 774204636 774682846 775832062 776876602 772466812 774517365 775951843 774535217 776443405
1500.6 776443405 776501617 775630264 775684967 777229919 779846725 773473282 764352112 767888260 772352219
1509.3 772352219 773874588 775649338 775598450 773972473 775559235 775006485 774355011 772538910 768810349
1518 768810349 773206253 776463928 773360596 769404526 770699463 773331909 774775391 771955490 771156693
$$ packed form
1458.2G65096741J938781J642457J931686O46973L40042J831665j254730q39692K223664
1466.8G73557587J125793k55737q42362O04935n16052m616089j670990K954254L480759
1475.5G73822098m60510M08706J678620o2409L81088p11898j040802R8877m8066N32532
1485.2G74598236Q99887j220169j007309J687622j914291k667771J985398J843033
1492.9G74204636M78210J149216J044540m409790K050553J434478j416626J908188
1500.6G76443405N8212q71353N4703J544952K616806o373443r121170L536148M463959
1509.3G72352219J522369J774750n0888j625977J586762n52750o51474j816101l728561
1518G68810349M395904L257675l103332l956070J294937K632446J443482k819901p98797
$$ plain form
1526.6 771156693 772710648 772594833 773572617 775085144 775046082 774975891 773148270 769980850 772321167
1535.3 772321167 773457413 774027939 775656967 771608582 763376999 767869110 769646912 768711853 771460953
1544 771460953 772277451 770412903 772102509 772713470 772846603 770939026 768608246 770551376 772161179
1552.7 772161179 773199768 769691467 769728165 773998260 776152649 765780716 756879349 761155777
1560.4 761155777 766220779 769556198 771391068 772142487 770447922 770320435 771613846 772364426 772844772
1569.1 772844772 767356720 768156433 770086212 769761810 769667511 770759506 771418457 763838043 766163177
1577.7 766163177 769156876 769578629 769660950 769089203 768670197 767452011 766990891 767156067 767429657
1586.4 767429657 767901306 767584457 767668076 767052917 766694870 766021347 765608597 765015259 763278198 763129730
$$ packed form
1526.6G71156693J553955j15815R77784J512527l9062p0191j827621l167420K340317
1535.3G72321167J136246N70526J629028m048385q231583M492111J777802r35059K749100
1544G71460953Q16498j864548J689606O10961J33133j907577k330780J943130J609803
1552.7G72161179J038589l508301L6698M270095K154389j0371933q901367M276428
1560.4G61155777N065002L335419J834870P51419j694565j27487J293411P50580M80346
1569.1G72844772n488052P99713J929779l24402r4299J091995O58951p580414K325134
1577.7G66163177K993699M21753Q2321n71747m19006j218186m61120J65176K73590
1586.4G67429657M71649l16849Q3619o15159l58047o73523m12750n93338j737061j48468
$$ plain form
1596.1 763129730 762756958 762819443 762765656 762624969 762504807 761936340 761243591 759578094 759273453 758891678
1605.7 758891678 758060226 757020187 756624908 755835724 754754181 755454025 754758148 754467163 753582611
1614.4 753582611 753703079 753395386 744435272 747432251 749367294 749560471 749232330 749687347 749347610
1623.1 749347610 744231796 745429153 746550217 747177124 744925919 742655029 744358673 744418488 744435349
1631.7 744435349 744658585 745856247 747915268 740855026 738743668 740951462 741925888 743168793 743982086
1640.4 743982086 743964386 744554596 744650345 746378784 748365402 744997559 743090820 741571732 743168793
1649.1 743168793 746216431 748849335 751506424 740773239 733760986 742491608 747452545 750380096
1656.8 750380096 751240540 751912918 752334671 752529297 753424683 751561356 748904800 751239777 753591003
$$ packed form
1596.1G63129730l72772O2485n3787j40687j20162n68467o92749j665497l04641l81775
1605.7G58891678q31452j040039l95279p89184j081543O99844o95877k90985q84552
1614.4G53582611J20468l07693q960114K996979J935043J93177l28141M55017l39737
1623.1G49347610n115814J197357J121064O26907k251205k270890J703644N9815J6861
1631.7G44435349K23236J197662K059021p060242k111358K207794R74426J242905Q13293
1640.4G43982086j7700N90210R5749J728439J986618l367843j906739j519088J597061
1649.1G43168793L047638K632904K657089j0733185p012253Q730622M960937K927551
1656.8G50380096Q60444O72378M21753J94626Q95386j863327k656556K334977K351226
$$ plain form
1665.5 753591003 754623566 756106567 757677689 753723602 751815109 753594818 753565826 755151672 758158646
1674.2 758158646 756816406 753429642 756415863 758586807 759599304 759799957 757749634 759221573
1681.9 759221573 762635040 761980209 750579834 751854248 757357559 760469055 760477142 761327133 761380844
1690.6 761380844 762138138 762721405 762143936 763553009 764075699 755286255 756514130 761293259 766791534
1699.3 766791534 768960342 756185989 760486145 764349518 764286957 762317200 761710892 760356445 760972366
1707.9 760972366 763417969 764263077 764081268 765461731 766524963 766893921 764695282 763145218 765428162
1716.6 765428162 765063248 757343369 759294586 763057327 764974747 766292343 766572113 766195450 767012939
1725.3 767012939 767043839 766385422 765955429 766240997 763718719 762457809 765733566 767818756 765283127
$$ packed form
1665.5G53591003J032563J483001J571122l954087j908493J779709k8992J585846L006974
1674.2G58158646j342240l386764K986221K170944J012497K00653k050323J471939
1681.9G59221573L413467o54831j1400375J274414N503311L111496Q087Q49991N3711
1690.6G61380844P57294N83267n77469J409073N22690q789444J227875M779129N498275
1699.3G66791534K168808j2774353M300156L863373o2561j969757o06308j354447O15921
1707.9G60972366K445603Q45108j81809J380463J063232L68958k198639j550064K282944
1716.6G65428162l64914p719879J951217L762741J917420J317596K79770l76663Q17489
1725.3G67012939L0900o58417m29993K85568k522278j260910L275757K085190k535629
$$ plain form
1734 765283127 760172577 763839264 766721497 767026215 768310928 765584869 761623688 764035110 765805054
1742.7 765805054 764552460 764152145 766338348 767264709 767028427 765711899 764436493 766680679 764724503
1751.3 764724503 761744003 764229126 765562134 766616135 768115158 766616364 766898880 767969818
1759 767969818 768400497 769080811 764527588 762637100 764413986 764799576 765170670 766647720 767568283
1767.7 767568283 765132370 766100235 768165436 767126236 763190460 761189270 764205704 765380020
1775.4 765380020 764091187 764908371 765427628 766396103 767104797 765948715 766135254 766757660 766628647
1784.1 766628647 765009537 763863602 764529648 764690247 765128250 766411438 766883392 767223816 764606094
1792.8 764606094 763323059 765263672 764972229 763393097 764049225 765481567 764666061 763108139 764583282
$$ packed form
1734G65283127n110550L666687K882233L04718J284713k726059l961181K411422J769944
1742.7G65805054j252594m00315K186203R26361k36282j316528j275406K244186j956176
1751.3G64724503k980500K485123J333008J054001J499023j498794K82516J070938
1759G67969818M30679O80314m553223j890488J776886L85590L71094J477050R20563
1767.7G67568283k435913R67865K065201j039200l935776k001190L016434J174316
1775.4G65380020j288833Q17184N19257R68475P08694j156082J86539O22406j29013
1784.1G66628647j619110j145935O66046J60599M38003J283188M71954L40424k617722
1792.8G64606094j283035J940613k91443j579132O56128J432342q15506j557922J475143
$$ plain form
1801.5 764583282 765223618 765617218 766590347 766251984 765579300 764708099 763984146 764586411 764924088 763562164
1811.1 763562164 763566208 764648361 765279236 765824509 765693436 765177460 763886642 763195190 763670578 763815689
1820.8 763815689 764180450 763818893 764503555 766179047 764031296 763286591 764513092 764855347 763045807
1829.4 763045807 758621368 760059967 762421875 762731781 763038101 763444748 763989410 763953629 763249741
1838.1 763249741 763274841 763042908 762569275 761671371 762441101 762970657 758721466 759941940 762073135
1846.8 762073135 762082825 761924438 762381897 762391739 761194916 760542297 760220795 760129700 760897903 761683655
1856.4 761683655 762145691 762025452 762130508 762256851 761802673 760909958 760148773 759730225 759419861 759613800
1866.1 759613800 759817123 760895691 761010666 759449234 760118866 760398026 759753189 759108963 758451538
$$ packed form
1801.5G64583282O40336L93600R73129l38363o72684q71201p23953O02265L37677j361924
1811.1G63562164M044J082153O30875N45273j31073n15976j290818o91452M75388J45111
1820.8G63815689L64761l61557O84662J675492k147751p44705J226501L42255j809540
1829.4G63045807m424439J438599K361908L09906L06320M06647N44662l5781p03888
1838.1G63249741K5100k31933m73633q97904P69730N29556m249191J220474K131195
1846.8G62073135R690j58387M57459R842j196823o52619l21502r1095P68203P85752
1856.4G61683655M62036j20239J05056J26343m54178q92715p61185m18548l10364J93939
1866.1G59613800K03323J078568J14975j561432O69632K79160o44837o44226o57425
$$ plain form
1874.8 758451538 758109055 758277512 758772736 759094772 759550552 759820633 760180359 760357666 760116882 759393845
1884.4 759393845 757692413 756934967 757006760 757894058 758263397 757123795 758654633 759977646 759594498
1893.1 759594498 759464417 758494720 756922989 756298981 755981903 755799332 756111374 756691055 757606659
1901.8 757606659 758579254 759061813 758974228 758133774 757208328 756102600 755037231 754576492 754090729
1910.4 754090729 754506149 755574722 756291046 757467117 758068771 757841187 757785339 754869537 752811127
1919.1 752811127 753275070 753339081 753990936 753568802 753482819 755635300 756865845 756635056 756085358 755431747
1928.8 755431747 754411163 753363647 752743835 752283707 752349625 753218994 754146042 754787598 755217972
1937.5 755217972 755183258 755044861 754181290 753318100 751994781 749383774 749824142 750907745 751462326
$$ packed form
1874.8G58451538l42483J68457M95224L22036M55780K70081L59726J77307k40784p23037
1884.4G59393845j701432p57446P1793Q87298L69339j139602J530838J323013l83148
1893.1G59594498j30081r69697j571731o24008l17078j82571L12042N79681R15604
1901.8G57606659R72595M82559q7585q40454r25446j105728j065369m60739m85763
1910.4G54090729M15420J068573P16324J176071O01654k27584n5848k915802k058410
1919.1G52811127M63943O4011O51855m22134q5983K152481J230545k30789n49698o53611
1928.8G55431747j020584j047516o19812m60128O5918Q69369R27048O41556M30374
1937.5G55217972l4714j38397q63571q63190j323319k611007M40368J083603N54581
$$ plain form
1946.1 751462326 752736130 753572083 754406357 754604950 753875809 752931519 751783524 750900192 750166321
1954.8 750166321 749854126 750074997 750865707 752079468 753317566 753809891 753408051 752700653 751692734
1963.5 751692734 750855331 750140762 749522476 748944168 749115219 750290070 751413193 752166367 752298126
1972.2 752298126 752101364 751407013 750233002 749063873 748200378 748262177 748492661 748809509 749283981
1980.8 749283981 749976120 750562286 750560837 750536880 749988785 749118958 747858429 746247787 745813904 746993103
1990.5 746993103 748071899 747756958 748453674 749397964 749478607 749205246 748120041 746924896 746036835
1999.2 746036835 745628052 745468140 745526581 745907822 746597824 747483978 747598877 747354279 747136154 746372223
2008.8 746372223 745084305 744412689 744367523 744415817 744581223 744556046 745534210 746146469 745429230 745247650
$$ packed form
1946.1G51462326J273804Q35953Q34274J98593p29141r44290j147995q83332p33871
1954.8G50166321l12195K20871P90710J213761J238098M92325m01840p07398j007919
1963.5G51692734q37403p14569o18286n78308J71051J174851J123123P53174J31759
1972.2G52298126j96762o94351j174011j169129q63495O1799K30484L16848M74472
1980.8G49283981O92139N86166j449k3957n48095q69827j260529j610642m33883J179199
1990.5G46993103J078796l14941O96716R44290Q0643k73361j085205j195145q88061
1999.2G46036835m08783j59912N8441L81241O90002Q86154J14899k44598k18125p63931
2008.8G46372223j287918o71616m5166M8294J65406k5177R78164O12259p17239j81580
$$ plain form
2018.5 745247650 744908752 744313660 743639069 742942581 742228928 742138748 743058090 743806839 744299927 744260864
2028.1 744260864 743948669 743682480 743270340 742782211 742160950 741602097 741003113 741017151 741600266 742175293
2037.7 742175293 742449188 742468872 742396317 741728592 741191254 740724182 740156555 739951782 739902496 740233765
2047.4 740233765 740744400 741404648 741759872 741361008 740894318 740539474 740061340 739674225 739346695 739009399
2057 739009399 739046478 739152527 739384384 739769821 739734802 739730988 739974136 739462433 738260040 737748337
2066.7 737748337 737603760 737715836 738164520 738531342 739244232 739762878 739488678 738793716 738397369 738054657
2076.3 738054657 737332153 736783676 736609955 736918106 737348404 737906265 738239594 738120956 737882156 737370987
2086 737370987 736980209 736350861 735848923 735620346 735626221 736069641 736146698 736660309 737040100 736925812
$$ packed form
2018.5G45247650l38898n95092o74591o96488p13653r0180R19342P48749M93088l9063
2028.1G44260864l12195k66189m12140m88129o21261n58853n98984J4038N83115N75027
2037.7G42175293K73895J9684p2555o67725n37338m67072n67627k04773m9286L31269
2047.4G40233765N10635O60248L55224l98864m66690l54844m78134l87115l27530l37296
2057G39009399L7079J06049K31857L85437l5019l814K43148n11703j202393n11703
2066.7G37748337j44577J12076M48684L66822P12890N18646k74200o94962l96347l42712
2076.3G38054657p22504n48477j73721L08151M30298N57861L33329j18638k38800n11169
2086G37370987l90778o29348n01938k28577N875M43420P7057N13611L79791j14288
$$ plain form
2095.6 736925812 736874084 736159363 735507584 735134201 734782715 734561157 734613571 734910507 735493927 736354599
2105.2 736354599 736576080 736368408 735976257 735436325 734849091 734153442 733875580 733669510 733600845 734201050
2114.9 734201050 735061264 735404968 735084000 734584885 734193802 733685913 732922821 732471161 732326965 732429810
2124.5 732429810 732918854 733621979 734046173 733820038 733990707 734129181 733435440 732798767 732155762 731707993
2134.2 731707993 731493759 731163788 731397858 732078781 732610474 732982788 733196793 733103333 732456360 731542435
2143.8 731542435 730978088 730799561 730554581 730592651 731371536 731894379 731978226 732047119 731957092 731683578
2153.5 731683578 730977249 730364227 729862518 729227371 728950806 729118271 729919739 730856857 731429214 731513748
2163.1 731513748 731247559 730841064 730177994 729579468 729037323 728683243 728416595 728410568 729121780 729958496
$$ packed form
2095.6G36925812n1728p14721o51779l73383l51486k21558N2414K96936N83420Q60672
2105.2G36354599K21481k07672l92151n39932n87234o95649k77862k06070o8665O00205
2114.9G34201050Q60214L43704l20968m99115l91083n07889p63092m51660j44196J02845
2124.5G32429810M89044P03125M24194k26135J70669J38474o93741o36673o43005m47769
2134.2G31707993k14234l29971K34070O80923N31693L72314K14005r3460o46973r13925
2143.8G31542435n64347j78527k44980L8070P78885N22843Q3847O8893r0027k73514
2153.5G31683578p06329o13022n01709o35147k76565J67465Q01468R37118N72357Q4534
2163.1G31513748k66189m06495o63070n98526n42145l54080k66648o027P11212Q36716
$$ plain form
2172.8 729958496 730573807 730718613 730624008 730217438 729414291 728784103 728393173 728305664 728140335 728320389
2182.4 728320389 728926239 729237213 729488220 729674149 729645996 729086227 728371964 727738571 727080078 727187805
2192 727187805 727572861 727623367 727933960 728748169 729330750 729360809 729132843 728533936 727827835 727126389
2201.7 727126389 726654892 726653366 726920319 727457657 727921982 728202667 728336258 728165283 727679138 727213440
2211.3 727213440 726902084 726376495 726046753 726049500 726380234 727035065 727373810 727495575 727507706 727424545
2221 727424545 727025909 726370087 726061859 725591125 725299301 725640030 726003494 726298294 726470032 726587906
2230.6 726587906 726451721 726000137 725641556 725455399 725045853 724572067 724736938 724962234 725187531 725419464
2240.3 725419464 725352631 725492172 725288467 724993668 724686966 724086990 723894119 723787689 723773193 723815765
$$ packed form
2172.8G29958496O15311J44806r4605m06570q03147o30188l90930q7509j65329J80054
2182.4G28320389O05850L10974K51007J85929k8153n59769p14263o33393o58493J07727
2192G27187805L85056N0506L10593Q14209N82581L0059k27966n98907p06101p01446
2201.7G27126389m71497j526K66953N37338M64325K80685J33591j70975m86145m65698
2211.3G27213440l11356n25589l29742K747L30734O54831L38745J21765J2131q3161
2221G27424545l98636o55822l08228m70734k91824L40729L63464K94800J71738J17874
2230.6G26587906j36185m51584l58581j86157m09546m73786J64871K25296K25297K31933
2240.3G25419464o6833J39541k03705k94799l06702n99976j92871j06430j4496M2572
$$ plain form
2249.9 723815765 724097900 724542542 724521103 724545135 724288788 723904953 723567657 723028946 722950897 722901077
2259.5 722901077 722820511 723056641 723637619 724022064 723533325 723079987 722912674 722588196 722022324 721543198
2269.2 721543198 721402206 721357956 721624069 721957169 722420273 722678146 722336273 722083206 721831512 721440201
2278.8 721440201 720866318 720632095 720787277 721015625 721339798 721443176 721826477 721651917 721063614 720775604
2288.5 720775604 720103302 719741440 719321594 719165878 719490280 719684448 719544601 719061356 719323959 719455261
2298.1 719455261 719118805 717922440 716219254 716126328 716504669 716362915 716091995 716248093 716007462
2306.8 716007462 715637589 715831604 715480728 715249634 714393387 713541641 713110428 712921600 713475494 712908630
2316.4 712908630 712196808 711774216 711522446 710911560 709991760 709889069 709055481 707685623 706267853
$$ packed form
2249.9G23815765K82135M44642k1439K4032k56347l83835l37296n38711p8049m9820
2259.5G22901077q0566K36130N80978L84445m88739m53338j67313l24478n65872m79126
2269.2G21543198j40992m4250K66113L33100M63104K57873l41873k53067k51694l91311
2278.8G21440201n73883k34223J55182K28348L24173J03378L83301j74560n88303k88010
2288.5G20775604o72302l61862m19846j55716L24402J94168j39847m83245K62603J31302
2298.1G19455261l36456j196365j703186r2926L78341j41754k70920J56098k40631
2306.8G16007462l69873J94015l50876k31094q56247q51746m31213j88828N53894n66864
2316.4G12908630p11822m22592k51770o10886r19800j02691q33588j369858j417770
$$ plain form
2325.1 706267853 706957016 707838898 707540894 707803268 707226105 706678696 705469742 705749893 706148071
2333.8 706148071 705185471 704798584 703216629 703127518 703798981 704630890 704816360 704115067 704378357 703925629
2343.4 703925629 703540573 702517242 702981110 703958206 704976196 706896896 706836166 705655441 704449005
2352.1 704449005 703104477 702063217 700341873 699941559 698833694 697524567 696417313 694291840
2359.8 694291840 694062805 695195084 695675659 697392197 698548813 697867584 698478470 698767776 699216614
2368.5 699216614 699327698 699331284 700700607 701901703 703261032 704028702 705234909 706658859 706980515
2377.2 706980515 707006989 706791611 706936493 707309799 707905502 708633728 709054489 709452438 710086746 710640335
2386.8 710640335 710609818 710519257 710268402 709850006 709395142 709185028 709232864 709051971 709547348 710018158
$$ packed form
2325.1G06267853O89163Q81882k98004K62374n77163n47409j208954K80151L98178
2333.8G06148071r62600l86887j581955q9111O71463Q31909J85470p01293K63290m52728
2343.4G03925629l85056j023331M63868R77096J017990J920700o0730j180725j206436
2352.1G04449005j344528j041260j721344m00314j107865j309127j107254k125473
2359.8F94291840k29035J132279M80575J716538J156616o81229O10886K89306M48838
2368.5F99216614J11084L586J369323J201096J359329P67670J206207J423950L21656
2377.2G06980515K6474k15378J44882L73306N95703P28226M20761L97949O34308N53589
2386.8G10640335l0517r0561k50855m18396m54864k10114M7836j80893M95377M70810
$$ plain form
2396.5 710018158 710184479 709995270 709353561 709374619 708884277 707977371 707610550 707629471 707742462 707554169
2406.1 707554169 707589111 708104477 708538437 708374786 708090744 707657852 707185440 706769409 706306686 706109695
2415.8 706109695 705723495 705897751 706376266 706701202 707029266 706829300 706601181 705930481 705160370 705024338
2425.4 705024338 705013733 704829407 704656067 704739838 704900284 705156784 705105133 704680176 704045029 703785553
2435.1 703785553 703694687 703214645 703079071 702676544 702598343 703030930 703270416 703719559 703738632 703415070
2444.7 703415070 702810974 702197800 701940079 701794662 701585770 701526794 701815414 701670761 701928711 702183914
2454.3 702183914 701629105 701334381 700809097 700097809 699648514 699412918 699574509 699861526 699908066 700172577
2464 700172577 700570450 700202026 699762726 699559174 699100342 698479919 698064423 698061676 698389435 699001617
$$ packed form
2396.5G10018158J66321j89209o41709K1058m90342r06906l66821J8921J12991j88293
2406.1G07554169L4942N15366M33960j63651k84042m32892m72412m16031m62723j96991
2415.8G06109695l86200J74256M78515L24936L28064j99966k28119o70700p70111j36032
2425.4G05024338j0605j84326j73340Q3771J60446K56500n1651m24957o35147k59476
2435.1G03785553r0866m80042j35574m02527p8201M32587K39486M49143J9073l23562
2444.7G03415070o04096o13174k57721j45417k08892n8976K88620j44653K57950K55203
2454.3G02183914n54809k94724n25284p11288m49295k35596J61591K87017M6540K64511
2464G00172577L97873l68424m39300k03552m58832o20423m15496k747L27759O12182
$$ plain form
2473.6 699001617 699349594 699502106 699607239 699489365 698968582 698116913 697519913 696914597 696570816 696666260
2483.3 696666260 696717682 697127533 697759628 697889252 697885132 697756958 696959991 696432571 696269531 695784683
2492.9 695784683 695433502 695605927 695870438 695995407 696411133 696534882 696251755 696047287 695920868 695469589
2502.6 695469589 694584961 694109192 693801117 694018326 694774704 695165787 695144958 694737930 694644775 694348297
2512.2 694348297 693792114 693400497 692484665 691767731 691816101 692410126 693152618 693813324 694251099 694000702
2521.9 694000702 693428650 693014526 692378159 691594696 691213989 691147537 691352081 691690140 692058563 692296753
2531.5 692296753 692405472 692287216 691763687 691517639 690820847 689951248 689772568 689585266 689540787 689659500
2541.1 689659500 690250397 690682907 690685883 690919342 690451355 689394073 688742828 688638611 688396835 688169174
$$ packed form
2473.6F99001617L47977J52512J05133j17874n20783q51669n97000o05316l43781R5444
2483.3F96666260N1422M09851O32095J29624m120j28174p96967n27420j63040m84848
2492.9F95784683l51181J72425K64511J24969M15726J23749k83127k04468j26419m51279
2502.6F95469589q84628m75769l08075K17209P56378L91083k0829m07028r3155k96478
2512.2F94348297n56183l91617r15832p16934M8370N94025P42492O60706M37775k50397
2521.9F94000702n72052m14124o36367p83463l80707o6452K04544L38059L68423K38190
2531.5F92296753J08719j18256n23529k46048o96792q69599j78680j87302m4479J18713
2541.1F89659500N90897M32510K976K33459m67987j057282o51245j04217k41776k27661
$$ plain form
2550.8 688169174 688369522 688788528 689368286 689675369 689561081 688947220 688361740 687822342 687173386 686863098
2560.4 686863098 686817322 687203064 687619553 688068314 688247299 687743225 687268524 687222824 687240601 686504211
2570.1 686504211 685601883 685277176 685668640 686112595 686156693 686373062 686493683 686492310 686145554 685912399
2579.7 685912399 685647736 684950562 684681091 684342880 684022827 683991165 684450912 685022736 685024643 685057983
2589.4 685057983 684940109 684340286 683417130 683116226 683148117 682945633 682930527 682849808 683038177 683470993
2599 683470993 683964996 683645630 682797546 682460861 682127991 682034607 681733017 681430206 681426544 681639938
2608.6 681639938 682249298 682329865 682151184 681888885 681351089 680715790 680302887 680030441 679683075 679874191
2618.3 679874191 679968109 680052948 680604858 680634003 680144882 679821930 679421310 678980789 679057007 679050446 678671036
$$ packed form
2550.8F88169174K00348M19006N79758L07083j14288o13861n85480n39398o48956l10288
2560.4F86863098m5776L85742M16489M48761J78985n04074m74701m5700J7777p36390
2570.1F86504211r02328l24707L91464M43955M4098K16369J20621j373l46756k33155
2579.7F85912399k64663o97174k69471l38211l20053l1662M59747N71824J907L3340
2589.4F85057983j17874n99823r23156l00904L1891k02484j5106q0719J88369M32816
2599F83470993M94003l19366q48084l36685l32870r3384l01590l02811l662K13394
2608.6F81639938O09360Q0567j78681k62299n37796o35299m12903k72446l47366J91116
2618.3F79874191R3918Q4839N51910K9145m89121l22952m00620m40521P6218o561l79410
$$ plain form
2628.9 678671036 678443985 678692093 679161453 679297333 679012833 678662186 678368683 677658463 677145767 676835022
2638.5 676835022 676550369 676835175 677010803 677137833 677321472 677364883 677212143 676976776 676445923 675439529
2648.2 675439529 675196457 675118408 675043793 675788345 676151810 675770569 675507584 675634613 675606842 675185089
2657.8 675185089 674485703 674015274 673796387 673389587 673372879 673796844 674166260 674430923 674743652 674737167
2667.5 674737167 674301529 673465195 672632294 672589264 672324600 671928329 672168884 672716980 673162842 673115540
2677.1 673115540 673079910 672846756 672125092 671075211 670416489 670464706 670339508 670462570 670830765 671297836
2686.8 671297836 671788788 671687546 671360245 671032104 670768585 670249176 669412994 669099579 669060364 668944397
2696.4 668944397 669412079 670155792 670615387 670660248 670109329 669440689 668816452 668393250 667682266 666708755
$$ packed form
2628.9F78671036k27051K48108M69360J35880k84500l50647k93503p10220n12696l10745
2638.5F76835022k84653K84806J75628J27030J83639M3411j52740k35367n30853j006394
2648.2F75439529k43072p8049p4615P44552L63465l81241k62985J27029k7771m21753
2657.8F75185089o99386m70429k18887m06800j6708M23965L69416K64663L12729o485
2667.5F74737167m35638q36334q32901m3030k64664l96271K40555N48096M45862m7302
2677.1F73115540l5630k33154p21664j049881o58722M8217j25198J23062L68195M67071
2686.8F71297836M90952j01242l27301l28141k63519n19409q36182l13415l9215j15967
2696.4F68944397M67682P43713M59595M4861n50919o68640o24237m23202p10984r73511
$$ plain form
2706 666708755 666812210 667287292 667790375 668820038 669243469 668771057 668575363 668354340 667569809 667001190
2715.7 667001190 666622162 666401978 666245422 666155167 666491699 667017822 667434311 667333374 667069550 666520691
2725.3 666520691 665377197 664464264 664362640 664446259 664428711 665148087 665587845 665450134 665445633 665307770
2735 665307770 665131912 664652634 664217834 663630524 663181610 663423386 663552246 663788071 664160080 664765015
2744.6 664765015 665019989 664254227 663577194 663215485 662989960 662689514 662044983 661590576 661784668 662556152
2754.3 662556152 663136063 663308334 663221512 662663879 662304687 661738892 660805740 660359268 659797821 659819565
2763.9 659819565 660378113 660678940 661061249 661315079 661668472 661108093 660189209 660072174 659729462 659281921
2773.5 659281921 659110947 659319000 659392014 659410019 659738922 660198898 660281754 659559097 658990631 658235626
$$ packed form
2706F66708755J03455M75082N03083J029663M23431m72412j95694k21023p84531n68619
2715.7F67001190l79028k20184j56556r0255L36532N26123M16489j00937k63824n48859
2725.3F66520691j143494r12933j01624Q3619j7548P19376M39758j37711m501j37863
2735F65307770j75858m79278m34800n87310m48914K41776J28860K35825L72009O04935
2744.6F64765015K54974p65762o77033l61709k25525l00446o44531m54407J94092P71484
2754.3F62556152N79911J72271q6822n57633l59192n65795r33152m46472n61447K1744
2763.9F59819565N58548L00827L82309K53830L53393n60379r18884j17035l42712m47541
2773.5F59281921j70974K08053P3014J8005L28903M59976Q2856p22657n68466p55005
$$ plain form
2783.2 658235626 657585754 657287369 657282486 658150101 658347855 658247910 658643188 658831940 658468704 657895203
2792.8 657895203 657570267 657010269 656517487 656066132 656095428 656502609 656681366 657183456 657215195 656775436
2802.5 656775436 656602936 656309967 655354309 654623718 654488907 654141846 654391022 655052032 655404434 655440521
2812.1 655440521 655364532 655400925 654889374 654093018 653589325 653225250 652778625 652736893 653199463 653365326
2821.8 653365326 653629837 653961411 653447037 652811203 652513962 651849594 651220779 651012726 651070251 650982132
2831.4 650982132 651038742 651574097 651785736 652147751 652266922 651792145 650913239 649710999 649213562 648823471
2841.1 648823471 648895874 649203568 649151001 649076920 648849106 649338150 649267578 648520508 647447433 645947037
2850.7 645947037 645612869 645586777 645437851 645571442 646009827 646384888 646640472 647076874 646851578 646632538
$$ packed form
2783.2F58235626o49872k98385m883Q67615J97754r9945L95278J88752l63236n73501
2792.8F57895203l24936n59998m92782m51355K9296M07181J78757N02090L1739m39759
2802.5F56775436j72500k92969r55658p30591j34811l47061K49176O61010L52402L6087
2812.1F55440521p5989L6393n11551p96356n03693l64075m46625m1732M62570J65863
2821.8F53365326K64511L31574n14374o35834k97241o64368o28815k08053N7525q8119
2831.4F50982132N6610N35355K11639L62015J19171m74777q78906j202240m97437l90091
2841.1F48823471P2403L07694n2567p4081k27814M89044p0572p47070j073075j500396
2850.7F45947037l34168k6092j48926J33591M38385L75061K55584M36402k25296k19040
$$ plain form
2860.3 646632538 646370926 645365906 644659653 644722214 644864273 645019150 645415039 645897598 646362991 646064072
2870 646064072 645297241 644617767 644337921 644132462 643273926 643134689 643495178 643291245 643259277 643973694
2879.6 643973694 644281998 643599701 643272934 642863846 642148514 641792068 641541138 641392593 641299210 641109543
2889.3 641109543 641515121 642326660 642141495 642082901 641849899 640681381 640243149 639992485 639588966 639394684
2898.9 639394684 639443398 639634743 639830132 640032272 639904289 639681396 639006805 638028870 637186623 636912613
2908.6 636912613 636936264 636778717 637153893 637221336 637265358 637638359 637280006 636373482 635419197 634752998
2918.2 634752998 634195518 633672218 633276024 633700867 634583588 634607506 634094200 634201050 634769096 634373474
2927.8 634373474 633765793 633562737 633700371 634000015 633866730 633957787 634227676 634664307 634860611 634629021
$$ packed form
2860.3F46632538k61612j005020p06253O2561J42059J54877L95889M82559M65393k98919
2870F46064072p66831o79474k79846k05459q58536j39237L60489k03933l1968P14417
2879.6F43973694L08304o82297l26767m09088p15332l56446k50930j48545r3383j89667
2889.3F41109543M05578Q11539j85165n8594k33002j168518m38232k50664m03519j94282
2898.9F39394684M8714J91345J95389K02140j27983k22893o74591r77935q42247k74010
2908.6F36912613K3651j57547L75176O7443M4022L73001l58353r06524r54285o66199
2918.2F34752998n57480n23300l96194M24843Q82721K3918n13306J06850N68046l95622
2927.8F34373474o07681k03056J37634K99644j33285R1057K69889M36631J96304k31590
$$ plain form
2937.5 634629021 634328384 634289398 634357758 633623657 633327599 633372307 633261261 633848152 634669456 635087128
2947.1 635087128 634904251 634599838 634290352 634195786 633661499 633119621 633522835 633556404 633541183 633567848
2956.8 633567848 633552971 633340263 632950821 633210754 633218803 632943535 632453766 632028618 632103958 632366028
2966.4 632366028 632841225 633249969 633381424 633248863 633601227 633692169 632885208 632391052 632248611 632160378
2976.1 632160378 632257996 632684021 633039894 633203583 633073158 632823334 632961807 632775536 632235374 631574860
2985.7 631574860 631155815 631373024 631726227 631899071 631873550 631858063 631904106 632045212 631921349 631587563
2995.3 631587563 631227684 630677452 630327644 630129890 630404053 630908623 631135750 631254044 630797348 630174026
3005 630174026 630169067 630111008 629430504 629354630 629757729 629318695 629365807 630186844 630066490 629346542 629041328
$$ packed form
2937.5F34629021l00637l8986O8360p34101k96058M4708j11046N86891Q21304M17672
2947.1F35087128j82877l04413l09486r4566n34287n41878M03214L3569j5221K6665
2956.8F33567848j4877k12708l89442K59933Q049k75268m89769m25148P5340K62070
2966.4F32366028M75197M08744J31455j32561L52364R0942q06961m94156j42441q8233
2976.1F32160378R7618M26025L55873J63689j30425k49824J38473j86271n40162o60514
2985.7F31574860m19045K17209L53203J72844k5521j5487M6043J41106j23863l33786
2995.3F31587563l59879n50232l49808j97754K74163N04570K27127J18294m56696o23322
3005F30174026m959n8059o80504p5874M03099m39034M7112Q21037j20354p19948l05214
$$ plain form
3015.6 629041328 629033928 628819389 628254738 627710304 627332001 627383957 627789574 627980003 628058777 627935448
3025.2 627935448 627678070 627576141 627444954 626788521 626182518 626221313 625662575 625528221 626520882 626845398
3034.9 626845398 626439972 626298866 626441994 625828667 624928589 624554939 624350395 624346924 624217148 623979073
3044.5 623979073 624152222 624656105 624782448 624632721 624388618 623944359 623431358 622852020 622620659 622229652
3054.2 622229652 622333984 622958679 622449989 622165680 622657928 622782173 622323189 621652374 621267929 621191292
3063.8 621191292 621013794 620449028 620047493 619915657 619961662 620396461 620674858 620274048 619917908 619946404
3073.5 619946404 619414139 618477211 618135414 618327980 618239174 618293533 618964653 619372673 618999290 618549805
3083.1 618549805 618337631 617289886 616575890 616814194 616820946 616611061 616534157 616861725 616666908 616877327
$$ packed form
3015.6F29041328p400k14539n64651n44434l78303N1956M05617J90429P8774j23329
3025.2F27935448k57378j01929j31187o56433o06003L8795n58738j34354R92661L24516
3034.9F26845398m05426j41106J43128o13327r00078l73650k04544l471j29776k38075
3044.5F23979073J73149N03883J26343j49727k44103m44259n13001n79338k31361l91007
3054.2F22229652J04332O24695n08690k84309M92248J24245m58984o70815l84445p6637
3063.8F21191292j77498n64766m01535j31836M6005M34799K78397m00810l56140K8496
3073.5F19946404n32265r36928l41797J92566q8806N4359O71120M08020l73383m49485
3083.1F18549805k12174j047745p13996K38304O752k09885p6904L27568j94817K10419
$$ plain form
3092.7 616877327 616968384 616133575 616209602 615848999 615183830 614824638 614574814 614284172 613671837 614018288
3102.4 614018288 614316559 614402809 614460983 614303360 613999138 613213692 612401924 611543808 611737251 612175293
3112 612175293 612264595 612732086 612922249 612690773 611897621 611573639 611232758 610608711 610412331 609860840
3121.7 609860840 609483337 609760170 610007477 609921150 610284920 610469055 610144730 609564781 608339844 608013725
3131.3 608013725 608385849 608427582 607932014 607372742 607749672 608097000 607583961 607104225 606957397 606227150
3141 606227150 605549049 605162201 604941940 604869576 604630089 605098267 605411797 605596199 605602303 604792976
3150.6 604792976 604118233 603424530 602756310 602436066 602714729 602788467 602886009 603428955 603457260 603321571
3160.3 603321571 602824135 602428093 601868591 600999031 600782967 600702477 600196190 599837952 600713806 601069756
$$ packed form
3092.7F16877327R1057q34809P6027l60603o65169l59192k49824k90642o12335L46451
3102.4F14018288K98271Q6250N8174j57623l04222p85446q11768q58116J93443M38042
3112F12175293Q9302M67491J90163k31476p93152l23982l40881o24047j96380n51491
3121.7F09860840l77503K76833K47307q6327L63770J84135l24325n79949j224937l26119
3131.3F08013725L72124M1733m95568n59272L76930L47328n13039m79736j46828p30247
3141F06227150o78101l86848k20261p2364k39487M68178L13530J84402O104q09327
3150.6F04792976o74743o93703o68220l20244K78663P3738R7542N42946K8305j35689
3160.3F03321571m97436l96042n59502q69560k16064q0490n06287l58238Q75854L55950
$$ plain form
3169.9 601069756 600582428 600182991 599370346 598807335 598274307 597865219 597655907 597613716 597569809 597649803
3179.5 597649803 597902794 597466431 597048645 596903229 597267570 596745720 595186729 594733200 594442787
3188.2 594442787 594395027 594654694 594661255 594629517 594495621 594169312 593704338 593452034 592946548 592332573
3197.9 592332573 591584663 591180191 591253281 591144257 591278915 591237411 591125832 590840073 590308762 590010262
3207.5 590010262 589876366 589579620 588916168 588618011 588383026 588509865 588714066 588353844 588267136 588127289
3217.2 588127289 588001442 587417374 586444168 586057396 585625725 585194702 585205574 585317078 585381660 585461693
3226.8 585461693 585355721 584803047 583701172 583041840 582754822 582152824 582142754 582578239 582800674 582453041
3236.4 582453041 582223167 582329178 582066574 581682358 581063042 580582581 580187187 579673538 579155197 578970222
$$ packed form
3169.9F01069756m87328l99437q12645n63011n33028m09088k09312m2191m3907P9994
3179.5E97649803K52991m36363m17786j45416L64341n21850j558991m53529k90413
3188.2E94442787m7760K59667O561l1738j33896l26309m64974k52304n05486o13975
3197.9E92332573p47910m04472P3090j09024J34658m1504j11579k85759n31311k98500
3207.5E90010262j33896k96746o63452k98157k34985J26839K04201l60222q6708j39847
3217.2E88127289j25847n84068r73206l86772m31671m31023J0872J11504O4582Q0033
3226.8E85461693j05972n52674j101875o59332k87018o01998j0070M35485K22435l47633
3236.4E82453041k29874J06011k62604l84216o19316m80461l95394n13649n18341j84975
$$ plain form
3246.1 578970222 579556389 580107269 580230179 579765968 578856316 578086128 577795258 577352448 576789742 576721573
3255.7 576721573 576450005 576584473 576893425 576944046 577049446 576975098 576287460 574911232 574361954 574015350
3265.4 574015350 573715858 573724174 573354111 573544350 574221001 574544449 573949165 573921585 573715897 572473221
3275 572473221 572070007 571197319 570427284 570526047 570587387 570787697 571275902 571840858 571692314 571114273
3284.7 571114273 570262337 569490318 568999138 568653450 568333397 568076210 568348541 568426552 568616753 568454704
3294.3 568454704 567932549 567588005 566847458 566509628 566179733 565963669 565704689 564938622 564845543 564884186
3303.9 564884186 564559593 564727173 565146484 564661827 563645515 563062935 562636986 561929588 561749954
3312.6 561749954 561894188 561311378 561032753 561088181 560944405 560455132 560008011 559569778 558861771 558390465
$$ packed form
3246.1E78970222N86167N50880J22910m64211r09652p70188k90870m42810n62706o8169
3255.7E76721573k71568J34468L08952N0621J05400p4348o87638j376228n49278l46604
3265.4E74015350k99492Q316l70063J90239O76651L23448n95284k7580k05688j242676
3275E72473221m03214q72688p70035R8763O1340K00310M88205N64956j48544n78041
3284.7E71114273q51936p72019m91180l45688l20053k57187K72331P8011J90201j62049
3294.3E68454704n22155l44544p40547l37830l29895k16064k58980p66067r3079L8643
3303.9E64884186l24593J67580M19311m84657j016312n82580m25949p07398j79634
3312.6E61749954J44234n82810k78625N5428j43776m89273m47121m38233p08007m71306
$$ plain form
3322.3 558390465 557338829 557159271 557442017 557311554 557947235 557462273 556606636 556231461 555527420
3330.9 555527420 554490662 553596840 553235817 552914391 553148117 553099594 552915764 552962570 552698631 552514038
3340.6 552514038 551904716 550985451 550042801 549196739 548356819 548079948 548062668 547826157 548066216 547862473
3350.2 547862473 547295532 546442528 545742035 545401840 544789085 544298210 543855858 544062881 544137154 543629799
3359.9 543629799 543104744 542731972 542421837 542014122 541903000 540475960 538875656 538692436 538886528
3368.6 538886528 539228020 539114075 538633842 537992439 537856750 537793922 537331696 536937103 536037140 535126419
3378.2 535126419 534385300 533955956 533672333 533274498 533353195 533840103 533894386 533019714 532169838 531533051
3387.8 531533051 531164017 530796814 530326843 530148468 529558601 529291534 529750519 529845657 529042549 528280907
$$ packed form
3322.3E58390465j051636j79558K82746j30463O35681m84962q55637l75175p04041
3330.9E55527420j036758q93822l61023l21426K33726m8523j83830M6806k63939j84593
3340.6E52514038o09322r19265r42650q46062q39920k76871j7280k36511K40059k03743
3350.2E47862473n66941q53004p00493l40195o12755m90875m42352K07023P4273n07355
3359.9E43629799n25055l72772l10135m07715j11122j427040j600304j83220J94092
3368.6E38886528L41492j13945m80233o41403j35689o2828m62226l94593q99963r10721
3378.2E35126419p41119m29344k83623l97835P8697M86908N4283q74672q49876o36787
3387.8E31533051l69034l67203m69971j78375n89867k67067M58985R5138q03108p61642
$$ plain form
3397.5 528280907 527789917 526782722 526115456 526346207 526722412 526444778 526398087 526625328 526251297 525898018
3407.1 525898018 525263634 524191933 523734894 523836937 523430290 523036880 523013573 522881317 522793274 522723999
3416.8 522723999 522805443 522852592 522622452 521224136 520388832 520859108 520268478 519924812 519911537 519853973
3426.4 519853973 520279999 520109100 519687424 519760857 519795494 519000244 518254700 517784004 517579651 517857094
3436.1 517857094 518146362 518093414 517812767 518053589 518121490 518109283 517653542 517394676 517657967 517474709
3445.7 517474709 517647057 516252747 515861092 516788712 516763420 517303391 517119789 516964874 516790581 516222343
3455.3 516222343 516131248 516037903 516180038 515892067 516138077 516455307 516635818 516760788 516468811 516738205
3465 516738205 516755791 516901512 516591148 515903015 515697250 516024132 516812439 516978531 517401314 517443008
$$ packed form
3397.5E28280907m90990j007195o67266K30751L76205k77634m6691K27241l74031l53279
3407.1E25898018o34384j071701m57039J02043m06647l93410k3307j32256q8043o9275
3416.8E22723999Q1444M7149k30140j398316q35304M70276n90630l43666j3275n7564
3426.4E19853973M26026j70899m21676P3433L4637p95250p45544m70696k04353K77443
3436.1E17857094K89268n2948k80647K40822O7901j2207m55741k58866K63291j83258
3445.7E17474709J72348j394310l91655R27620k5292N39971j83602j54915j74293n68238
3455.3E16222343r1095r3345J42135k87971K46010L17230J80511J24970k91977K69394
3465E16738205J7586J45721l10364o88133k05765L26882P88307J66092M22783M1694
$$ plain form
3474.6 517443008 516874390 517040977 517149239 516602249 516064453 516096802 516292076 516113434 515696068 516701927
3484.3 516701927 517610626 517262650 517345848 516950951 516601028 517212982 517772102 517368240 517570038 518721237
3493.9 518721237 518678207 518218956 517921638 518207893 518325233 517708473 517980843 519114342 519775505 518961372
3503.6 518961372 518330536 518397789 518443031 519000130 520877190 521612091 519644318 519609108 520233459 519849014
3513.2 519849014 519514542 519494629 520131035 520597115 521040382 521317139 521246910 521137924 522188492 522964516
3522.9 522964516 521170120 520372467 520748215 521345673 522045441 521863899 521281586 522290497 523366890
3531.5 523366890 522872009 523150902 522936363 522958717 522625122 521401024 522486038 523394585 523884125
3540.2 523884125 524098206 524296494 524651909 524830551 524865341 524219017 524979973 524387131 524447556 525134888
$$ packed form
3474.6E17443008n68618J66587J08262n46990n37796L2349J95274j78642m17366J005859
3484.3E16701927R08699l47976Q3198l94897l49923O11954N59120m03862K01798J151199
3493.9E18721237m3030m59251k97318K86255J17340o16760K72370J133499O61163q14133
3503.6E18961372o30836O7253M5242N57099J877060P34901j967773l5210O24351l84445
3513.2E19849014l34472j9913O36406M66080M43267K76757p0229j08986J050568P76024
3522.9E22964516j794396p97653L75748N97458O99768j81542n82313J008911J076393
3531.5E23366890m94881K78893k14539K2354l33595j224098J085014R08547M89540
3540.2E23884125K14081J98288L55415J78642L4790o46324P60956n92842O0425O87332
$$ plain form
3549.9 525134888 525750427 527472420 526296120 526628151 527157135 527324944 528419724 527470398 527716675
3558.5 527716675 527800026 527443161 527357712 528620911 529495621 528665619 531844063 531771965 529612846 528991547
3568.2 528991547 526530914 528896370 530170479 530559235 531687584 532467613 532184219 531590080 532442970
3576.9 532442970 531910477 532880096 532953110 531478615 532098618 532989578 533728981 533400917 536707726
3585.5 536707726 537601318 532822418 534131393 532206535 532715111 534298592 535491028 535777588 534537926
3594.2 534537926 536734657 535315971 536266289 538626442 537168083 537894859 537102089 536973457 537689552
3602.9 537689552 537389259 537953415 540159073 542076874 538999252 540452461 538847618 535898323 541902161
3611.6 541902161 543060570 539233131 540596924 538914986 541331749 544817085 543368683 543990898
$$ packed form
3549.9E25134888O15539J721993j176300L32031N28984J67809J094780r49326K46277
3558.5E27716675Q3351l56865q5449J263199Q74710q30002L178444p2098k159119o21299
3568.2E28991547k460633K365456J274109L88756J128349P80029k83394n94139Q52890
3576.9E32442970n32493R69619P3014j474495O20003Q90960P39403l28064L306809
3585.5E36707726Q93592m778900J308975j924858N08576J583481J192436K86560j239662
3594.2E34537926K196731j418686R50318K360153j458359P26776p92770j28632P16095
3602.9E37689552l00293N64156K205658J917801l077622J453209j604843k949295O003838
3611.6E41902161J158409l827439J363793j681938K416763L485336j448402O22215
$$ plain form
3619.3 543990898 542460747 540654869 541994476 542913132 543917274 544498138 543839684 544060822 549158478
3628 549158478 550990028 539887848 540868111 543650398 547444153 547556038 543848534 544358635 545388870
3636.6 545388870 546243515 545621758 545758743 547530861 548711853 548110695 546996117 547970390 549689445
3645.3 549689445 554233627 553039169 547740402 552829514 551437378 546440430 543264503 546318359
3653 546318359 549561272 551719360 556479263 548822517 546748695 550122490 549894562 550376511 550150604
3661.7 550150604 550297508 550258980 550624237 551503716 551449165 554372101 555585976 553889427 554954910
3670.4 554954910 547942963 546899529 552585793 560146255 563569412 548182220 546205406 550854149
3678.1 550854149 553828621 551405792 550229759 551621208 552450066 553473320 553433914 552650337 555312881
$$ packed form
3619.3E43990898j530151j805878J339607R18656J004142N80864o58454K21138N097656
3628E49158478J831550j1102180R80263K782287L793755J11885l707504N10101J030235
3636.6E45388870Q54645o21757J36985J772118J180992o01158j114578R74273J719055
3645.3E49689445M544182j194458n298767N089112j392136m996948l175927L053856
3653E46318359L242913K158088M759903p656746k073822L373795k27928M81949k25907
3661.7E50150604J46904l8528L65257Q79479n4551K922936J213875j696549J065483
3670.4E54954910p011947j043434N686264P560462L423157j5387192j976814M648743
3678.1E50854149K974472k422829j176033J391449Q28858J023254l9406p83577K662544
$$ plain form
3686.8 555312881 561818161 556327744 549449539 556017570 552572746 549792709 553491364 553848343
3694.5 553848343 554103127 553666611 553319511 553523788 552672119 554483871 557731285 553844910 549796944
3703.2 549796944 552640457 553730202 553660774 553678017 555340157 559415016 552734184 554165802 560069504
3711.9 560069504 549691658 550461426 553253098 552959518 552869873 554997864 556103401 552159538 551677322
3720.5 551677322 557138290 555534744 548597260 552012749 553534737 553008728 550845184 549310875
3728.3 549310875 551990929 552014503 555963593 555795937 548776054 555340538 557308578 549121056 548867149
3736.9 548867149 550376434 549332809 550165291 552658386 549708710 551208649 562174110 560749359
3744.7 560749359 541285515 546508636 549717178 554653358 555659904 544967499 553140602 554085693
$$ packed form
3686.8E55312881O505280n490417o878205O568031l444824k780037L698655L56979
3694.5E53848343K54784m36516l47100K04277q51669J811752L247414l886375m047966
3703.2E49796944K843513J089745o9428J7243J662140M074859o680832J431618N903702
3711.9E60069504j0377846P69768K791672k93580q9645K127991J105537l943863m82216
3720.5E51677322N460968j603546o937484L415489J521988n26009k163544j534309
3728.3E49310875K680054K3574L949090j67656p019883O564484J968040q187522k53907
3736.9E48867149J509285j043625Q32482K493095k949676J499939J0965461j424751
3744.7E60749359j9463844N223121L208542M936180J006546j0692405Q173103R45091
$$ plain form
3752.4 554085693 545910416 547810097 550826302 553743095 549308090 550379524 556224289 550646896
3760.1 550646896 546859512 549635239 550533524 550285606 553222351 552421951 548149376 548569984 551878281
3768.8 551878281 553718452 547155304 546914597 548867035 549262314 550080299 549715462 550124550 550143890
3777.4 550143890 551629181 552486305 546373940 546962471 548620987 548034897 549283791 548069611 547180023
3786.1 547180023 548028831 548476906 549102135 548690453 548469276 547698364 547316704 547173080 548195038
3794.8 548195038 552018204 549549980 544563980 545162773 548268394 554126778 552117004 542629089
3802.5 542629089 542376022 543087616 546013451 551786079 546610565 541139145 544767532 546396675 546354828
3811.2 546354828 546655846 545859375 545754166 549823647 550448532 538752708 540747528 544961014 548858566
$$ packed form
3752.4E54085693q175277J899681L016205K916793m435005J071434N844765n577393
3760.1E50646896l787384K775727Q98285k47918K936745q00400m272575M20608L308297
3768.8E51878281J840171o563148k40707J952438L95279Q17985l64837M09088J9340
3777.4E50143890J485291Q57124o112365N88531J658516n86090J248894j214180q89588
3786.1E47180023Q48808M48075O25229m11682k21177p70912l81660j43624J021958
3794.8E48195038L823166k468224m986000N98793L105621N858384k009774r487915
3802.5E42629089k53067P11594K925835N772628n175514n471420L628387J629143m1847
3811.2E46354828L01018p96471j05209M069481O24885j1695824J994820M213486L897552
$$ plain form
3819.9 548858566 553508987 542099571 539666748 542568054 543936043 546045761 545741119 541613503
3827.6 541613503 541511459 542540245 545094872 547091827 539850197 540725098 546673203 543508034 541568069
3836.3 541568069 548377075 543662872 536520233 542258186 538656502 538424568 545295639 544786720 540543098
3844.9 540543098 541039886 541558838 540910072 542534294 542099838 542764359 546943054 542501869 547486954
3853.6 547486954 536997337 532153587 540090599 540681229 538985634 540756493 542116394 542908096
3861.3 542908096 538173332 537356071 543458557 540206680 534503021 536857529 539801712 545437202
3869.1 545437202 543258286 534565277 535474205 539683418 543792992 536495476 535237579 538016663
3876.8 538016663 538015976 539214973 542979622 540226059 531997299 535361328 537288399 538899040 544494133
$$ packed form
3819.9E48858566M650421j1409416k432823K901306J367989K109718l04642m127616
3827.6E41613503j02044J028786K554627J996955p241630Q74901N948105l165169j939965
3836.3E41568069O809006m714203p142639N737953l601684k31934O871071n08919m243622
3844.9E40543098M96788N18952o48766J624222m34456O64521M178695m441185M985085
3853.6E47486954j0489617m843750P937012N90630j695595J770859J359901P91702
3861.3E42908096m734764q17261O102486l251877n703659K354508K944183N635490
3869.1E45437202k178916q693009R08928M209213M109574p297516j257897K779084
3876.8E38016663o87J198997L764649k753563q228760L364029J927071J610641N595093
$$ plain form
3885.4 544494133 534289589 532345352 536059570 536829872 539804115 540850525 534476700 534458618 536853447
3894.1 536853447 535498352 535727463 535917168 537768974 540739899 532980881 535073853 537853355 533577271
3902.8 533577271 536903267 534412155 531676712 533281746 534547997 536226768 535635796 535268440 535061073
3911.5 535061073 534613037 534412651 533728256 534568443 535987587 533857689 530382957 533379135 535115662
3920.2 535115662 531225395 532199631 533378525 534251289 533990707 530764961 531021500 531767845 532899971
3928.8 532899971 532640648 531912766 533292236 531749153 530797348 531366692 531262817 531369858 531502419
3937.5 531502419 531139030 530365677 529882011 531262817 533296623 530492859 529221191 530591469 531490402
3946.2 531490402 532218056 530199890 530684090 530667496 528015213 529209785 530059929 529386673 528888969
$$ packed form
3885.4E44494133j0204544j944237L714218P70302K974243J046410o373825j8082K394829
3894.1E36853447j355095K29111J89705J851806K970925p759018K092972K779502m276084
3902.8E33577271L325996k491112k735443J605034J266251J678771n90972l67356k07367
3911.5E35061073m48036k00386o84395Q40187J419144k129898l474732K996178J736527
3920.2E35115662l890267R74236J178894Q72764k60582l225746K56539P46345J132126
3928.8E32899971k59323p27882J379470j543083r51805N69344j03875J07041J32561
3937.5E31502419l63389p73353m83666J380806K033806k803764j271668J370278Q98933
3946.2E31490402P27654k018166M84200j6594k652283J194572Q50144o73256m97704
$$ plain form
3954.9 528888969 529157944 529529457 528732147 528695641 528796921 529297981 529695206 528399544 528309135 529110222
3964.5 529110222 528720627 528398476 528324966 528329887 528056602 527036476 526749535 526524239 526618271 527207603
3974.2 527207603 526919937 526642532 526709595 526716156 526248703 525942039 526109962 526336784 526356773 525790520
3983.8 525790520 525698624 525789642 525432129 525039291 525324669 525716324 525094299 524679070 524491425 524487801
3993.5 524487801 524884453 525127754 525475006 525516777 525227966 524902725 524009209
4000.2 524009209
$$ packed form
3954.9E28888969K68975L71513p97310l6506J01280N01060L97225j295662r0409Q01087
3964.5E29110222l89595l22151p3510M921k73285j020126k86941k25296R4032N89332
3974.2E27207603k87666k77405O7063O561m67453l06664J67923K26822J9989n66253
3983.8E25790520r1896R1018l57513l92838K85378L91655o22025m15229j87645l624
3993.5E24487801L96652K43301L47252M1771k88811l25241q93516
4000.2E24009209
##END=$$ End of the data block
