##TITLE=$$ Begin of the data block
##JCAMP-DX=5.00 $$ ACD/SpecManager v 10.08
##SPECTROMETER/DATA SYSTEM=Varian
##DATE=04 Dec 2012 14:36:34
##DATA TYPE=INFRARED SPECTRUM
##DATA CLASS=XYDATA
##ORIGIN=
##OWNER=
##NPOINTS=3735
##FIRSTX=399.26403809
##LASTX=4000.35498047
##MAXX=4000.35498047
##MINX=399.26403809
##MAXY=84.90098572
##MINY=52.11666870
##XFACTOR=1.0000000000
##YFACTOR=0.000000100000000
##FIRSTY=84.35277557
##DELTAX=0.96440572
##XUNITS=1/CM
##YUNITS=TRANSMITTANCE
##XYDATA=(X++(Y..Y))
$$ plain form
399.3 843527756 849009857 842673111 846283112 834107285 829626007 821966705 798868637 786480713
407 786480713 781113892 787870331 790760498 797617111 819090805 833486404 828717270 811019058
414.7 811019058 807715225 806833649 802102509 796317520 824214172 827845230 805006638 802220154
422.4 802220154 811420517 811721573 805462265 803400116 805096207 805675049 810158157 803489075 799244919
431.1 799244919 805175095 811312866 814614716 815236664 814263229 799842377 795485229 803672180 807384644
439.8 807384644 804889221 804007721 805085831 808947678 822014236 826840363 826132736 816334610 804782333
448.4 804782333 801186142 800845413 806117935 809414062 807537689 803486862 805654144 808356400 801901321
457.1 801901321 790791855 796206512 813293152 808978882 795247192 795753326 798321152 804056702
$$ packed form
399.3H43527756N482101o336746L610001j2175827m481278p659302k3098068j2387924
407G86480713n366821O756439K890167O856613K1473694J4395599m769134j7698212
414.7H11019058l303833q81576m731140n784989K7896652L631058k2838592k786484
422.4H02220154R200363L01056o259308k062149J696091N78842M483108o669082m244156
431.1G99244919N930176O137771L301850O21948r73435j4420852m357148Q186951L712464
439.8H07384644k495423q81500J078110L861847J3066558M826127p07627r798126j1552277
448.4H04782333l596191l40729N272522L296127j876373m050827K167282K702256o455079
457.1H01901321j1109466N414657J7086640m314270j3731690N06134K567826N735550
$$ plain form
464.8 804056702 805996170 815481262 817522202 807688065 804946747 806768188 810097961 795882950
472.6 795882950 792040558 802349625 812056427 814590836 808263626 804438553 799918442 801075592
480.3 801075592 805594254 812369232 814496918 807651291 810172424 814134216 811228180 803445435
488 803445435 801018600 806492615 810430069 804423294 797356796 801035614 802097244 804651337 809903870
496.7 809903870 808727112 803287735 800410690 806465836 810347748 807087402 803873978 803128738 804566269
505.3 804566269 805841446 804907379 803419418 803955231 801902924 800169983 801122131 800621643 798731537
514 798731537 801552658 807938690 806962128 806566238 807199402 805076599 807459183 805067825 798352966
522.7 798352966 797371979 799615173 800061188 799476089 799290085 799140015 802035446 807187805 806972885
$$ packed form
464.8H04056702J939468R485092K040940r834137k741318J821441L329773j4215011
472.6G95882950l842392J0309067R706802K534409o327210l825073m520111J157150
480.3H01075592M518662O774978K127686o845627K521133L961792k906036p782745
488H03445435k426835N474015L937454o006775p066498L678818J061630K554093N252533
496.7H09903870j176758n439377k877045O055146L881912l260346l213424p45240J437531
505.3H04566269J275177r34067j487961N35813k052307j732941R52148n00488j890106
514G98731537K821121O386032r76562l95890O33164k122803K382584k391358o714859
522.7G98352966r80987K243194M46015n85099j86004j50070K895431N152359k14920
$$ plain form
531.4 806972885 803708038 803889847 802414246 800338440 798126297 797471008 800148087 800519180 803661957
540.1 803661957 807933273 808211441 805769653 801272278 799336472 798792496 797674255 796316223 796739578
548.7 796739578 800718613 805466309 807927094 808167419 808445969 806183090 803069534 801188278 798947906
557.4 798947906 797243958 797637482 801014786 803971939 806120453 808279114 809841614 808737564 804655762
566.1 804655762 801120148 797914505 794668655 793074493 796302261 802313156 804957809 806364212
573.8 806364212 809287872 810567856 805349503 801002045 799539413 795153198 791799927 795173645
581.5 795173645 799775925 803885880 809079132 810480042 809660492 808245621 804904556 801720886 797915192
590.2 797915192 795451736 794027481 795256805 799066162 802595520 807563171 810462494 810041580 808208694
$$ packed form
531.4H06972885l264847J81809j475601k075806k212143o55289K677079L71093L142777
540.1H03661957M271316K78168k441788m497375j935806n43976j118241j358032M23355
548.7G96739578L979035M747696K460785K40325K78550k262879l113556j881256k240372
557.4G98947906j703948L93524L377304K957153K148514K158661J562500j104050m081802
566.1H04655762l535614l205643l245850j594162L227768O010895K644653J406403
573.8H06364212K923660J279984n218353m347458j462632m386215l353271L373718
581.5G95173645M602280M109955N193252J400910q19550j414871l341065l183670l805694
590.2G97915192k463456j424255J229324L809357L529358M967651K899323m20914j832886
$$ plain form
598.9 808208694 803432617 796345444 792435303 793492813 794319229 795513306 800477524 805025253 805874100
607.6 805874100 806050644 805927505 802771759 799250565 796004715 792574615 791272659 792171555 794336395
616.3 794336395 798665314 803686295 805820465 806426468 805889740 803414230 798732986 795351791 795503998
624.9 795503998 795427017 796691589 799216003 801953125 807345276 810933685 809383469 805012054 800975418
633.6 800975418 797901840 794519806 793681564 796276169 800036469 803646622 805387802 806804657 808910522
642.3 808910522 808834534 806553116 802616043 798998489 797291641 797654343 798061066 798352280 802275925
651 802275925 805370331 806408157 807695847 805476837 802225952 800302811 798167191 796251297 797535019
659.7 797535019 800260239 802176056 805910950 809224777 808816986 808173676 810997009 810773849 786597290
$$ packed form
598.9H08208694m776077p087173l910141J057510Q26416J194077M964218M547729Q48847
607.6H05874100J76544j23139l155746l521194l245850l430100j301956Q98896K164840
616.3G94336395M328919N020981K134170O06003n36728k475510m681244l381195J52207
624.9G95503998p6981J264572K524414K737122N392151L588409j550216m371415m036636
633.6H00975418l073578l382034q38242K594605L760300L610153J741180J416855K105865
642.3H08910522p5988k281418l937073l617554j706848L62702M06723K91214L923645
651H02275925L094406J037826J287690k219010l250885j923141k135620j915894J283722
659.7G97535019K725220J915817L734894L313827m07791o43310K823333k23160k4176559
$$ plain form
668.3 786597290 788983002 795708008 798500824 801024704 804287262 806833572 807782745 806512146 804826126
677 804826126 804406357 804223938 803936844 801652451 799876175 800687408 802395935 804253006 805447006
685.7 805447006 806555710 805102844 803317947 803682938 803839645 803413315 801952209 802826538 805119476
694.4 805119476 805804520 807123184 809400787 809962463 808160400 806496048 804466324 803671951 804402390
703.1 804402390 804537735 804553528 804322357 806072159 807909775 806744080 805181122 804750595 804979706
711.7 804979706 805367279 805627747 805252762 805746841 807505035 807848282 807306900 807708893 807188416 805228119
721.4 805228119 803718491 803114090 804332352 806842728 808674927 808373947 808383255 809898148 810130539
730.1 810130539 809593582 807962112 806282578 805171280 804364548 805726166 807176971 808122711 808847809
$$ packed form
668.3G86597290K385712O725006K792816K523880L262558K546310R49173j270599j686020
677H04826126m19769j82419k87094k284393j776276Q11233J708527J857071J194000
685.7H05447006J108704j452866j784897L64991J56707m26330j461106Q74329K292938
694.4H05119476O85044J318664K277603N61676j802063j664352k029724p94373P30439
703.1H04402390J35345J5793k31171J749802J837616j165695j562958m30527K29111
711.7H04979706L87573K60468l74985M94079J758194L43247n41382M01993n20477j960297
721.4H05228119j509628o04401J218262K510376J832199l00980R308J514893K32391
730.1H10130539n36957j631470j679534j111298q06732J361618J450805R45740P25098
$$ plain form
738.7 808847809 809412155 810857010 811317825 808706970 805469208 804653091 804482117 805102615 806054764
747.4 806054764 807238998 809917831 812085800 813559875 812586212 809375305 807985764 807828445 805446854
756.1 805446854 803128891 803723297 805257263 808027878 810904388 813125610 814374695 812962112 810827408
764.8 810827408 808769226 806437836 803760834 803331375 805315018 807514267 810460968 813019409 814144821
773.5 814144821 813604431 812771225 810555267 806852798 805018616 804440765 804970398 806459198 808429184
782.1 808429184 811112595 814082336 815596542 814364014 812053452 808881531 806457977 805673981 805241394
790.8 805241394 805347443 807016373 810035248 813372574 817275391 818705215 816543045 813907700 810654144
799.5 810654144 807079849 806124115 807273178 808903656 811416092 813797989 816184998 817016678 816882095
$$ packed form
738.7H08847809N64346J444855M60815k610855l237762q16117j70974O20498R52149
747.4H06054764J184234K678833K167969J474075r73663l210907j389541j57319k381591
756.1H05446854k317963N94406J533966K770615K876510K221222J249085j412583k134704
764.8H10827408k058182k331390k677002m29459J983643K199249K946701K558441J125412
773.5H14144821n40390q33206k215958l702469j834182n77851N29633J488800J969986
782.1H08429184K683411K969741J514206j232528k310562l171921k423554p83996m32587
790.8H05241394J06049J668930L018875L337326L902817J429824k162170k635345l253556
799.5H10654144l574295r55734J149063J630478K512436K381897K387009Q31680j34583
$$ plain form
808.2 816882095 817196045 815479584 813271408 810436172 809107513 809632568 809180069 810487671 813475876
816.9 813475876 816649628 817987595 817403488 816336212 813999252 811386719 810179443 810365601 810574188
825.5 810574188 811768494 813505630 815184402 816674881 817100906 816712418 815342407 814006500 811343613
834.2 811343613 809230576 808586197 808044052 809417267 812280807 816146622 817366104 816348572 815483780
842.9 815483780 813699646 812560501 811382217 810223999 809441605 809925308 810866623 812020950 814473801
851.6 814473801 815845337 816810989 816575699 815317078 813560486 811801453 811547089 810893860 811289062
860.3 811289062 812030106 813056793 815644302 816671677 816992645 817600327 816513062 813916626 811928101
868.9 811928101 811247711 810942917 811222458 813601227 815299835 815303802 815298538 814247665 814596710 814577484
$$ packed form
808.2H16882095L13950j716461k208176k835236j328659N25055m52499J307602K988205
816.9H13475876L173752J337967n84107j067276k336960k612533j207276J86158K08587
825.5H10574188J194306J737136J678772J490479M26025l88488j370011j335907k662887
834.2H11343613k113037o44379n42145J373215K863540L865815J219482j017532q64792
842.9H15483780j784134j139145j178284j158218p82394M83703R41315J154327K452851
851.6H14473801J371536R65652k35290j258621j756592j759033k54364o53229L95202
860.3H11289062P41044J026687K587509J027375L20968O07682j087265k596436j988525
868.9H11928101o80390l04794K79541K378769J698608L967n264j050873L49045j9226
$$ plain form
878.6 814577484 813343201 813584824 813369751 812972183 813028488 813917389 814454422 814455643 814820633 814081268
888.2 814081268 813297424 813572922 813731461 811783142 810514526 811651230 812361221 812717438 813613510
896.9 813613510 813911896 812873917 812449341 812173233 811889038 811717758 811350174 811841965 811617508 811324234
906.5 811324234 810787277 811139450 812596207 812303085 811659927 810306473 810070114 811808853 811889572
915.2 811889572 810412674 810180969 810775986 810407639 810526123 809292908 807292023 807680817 808968582
923.9 808968582 809808426 810280914 810880890 810686188 810390549 810258102 809579163 808735580 807836990 807870941
933.6 807870941 807777252 807120590 807291718 809071960 810371323 809888535 809251785 808716354 808797684 808140564
943.2 808140564 807021408 806906967 807684326 808229752 807643738 808473892 809979706 811454926 811798706
$$ packed form
878.6H14577484j234283K41623k15073l97568N6305Q88901N37033J221L64990p39365
888.2H14081268p83844K75498J58539j948319j268616J136704P09991L56217Q96072
896.9H13613510K98386j037979m24576k76108k84195j71280l67584M91791k24457k93274
906.5H11324234n36957L52173J456757k93122o43158j353454k36359J738739Q0719
915.2H11889572j476898k31705N95017l68347J18484j233215k000885L88794J287765
923.9H08968582Q39844M72488N99976j94702k95639j32447o78939q43583q98590L3951
933.6H07870941r3689o56662J71128J780242J299363m82788o36750n35431Q1330o57120
943.2H08140564j119156j14441P77359N45426n86014Q30154J505814J475220L43780
$$ plain form
951.9 811798706 809874039 807700043 804942398 803678894 803924103 804434357 805767136 806800613 807715149
960.6 807715149 807985306 807555923 806746979 805582199 804260406 802864304 801847839 801401901 801643524
969.2 801643524 801940994 802278442 803095322 804112320 804610901 803775101 801887512 800668640 799871674
977.9 799871674 797992172 796830750 796892624 797542191 798554993 799191284 799119492 798130646 797605896 797409210
987.6 797409210 796174393 794047089 792997894 793190002 793080063 793159256 793680191 795169296 795865707
996.2 795865707 795118713 793667679 791355133 790387115 789816513 789936142 790422134 790033188 790915604
1004.9 790915604 792031937 792644653 792325516 791260376 790530624 789369507 787978516 787742844 788201599
1013.6 788201599 787229462 787136459 788721466 789125214 788907547 788453979 787105179 786029434 785824127
$$ packed form
951.9H11798706j924667k173996k757645j263504K45209N10254J332779J033477R14536
960.6H07715149K70157m29383q08944j164780j321793j396102j016465m45938K41623
969.2H01643524K97470L37448Q16880J016998M98581q35800j887589j218872p96966
977.9G99871674j879502j161422O1874O49567J012802O36291p1792r88846n24750j96686
987.6G97409210j234817k127304j049195J92108j09939P9193N20935J489105O96411
996.2G95865707p46994j451034k312546r68018n70602J19629M85992l88946Q82416
1004.9G90915604J116333O12716l19137j065140p29752j161117j390991k35672M58755
1013.6G88201599r72137r3003J585007M03748k17667m53568j348800j075745k05307
$$ plain form
1022.3 785824127 784835205 783913422 784084625 784163208 784283981 785049667 786416931 787157593 786735992 785913086
1031.9 785913086 785927811 785767136 784682388 784713593 785013275 785080872 785321503 786057587 786929245 786618500
1041.6 786618500 786354294 786002350 785689468 785958023 786043320 786024475 785828018 785102844 784506531 784873657
1051.2 784873657 785389862 785967560 785788116 785285492 785492783 785275726 785399323 785396881 785569839 786161041
1060.9 786161041 786486359 786796799 786222458 786425629 787190323 786768417 785512085 785152969 786366348
1069.5 786366348 785858688 784716873 785535583 786346741 786449585 785491409 783799210 783466263 783916931
1078.2 783916931 784100952 784201508 784003372 783554306 783899536 785054703 784755173 783787079 783071594
1086.9 783071594 782915878 784070053 784204254 783760834 783414688 784077530 785729218 785740509 785310898
$$ packed form
1022.3G85824127r88922r21783J71203P8583J20773P65686J367264P40662m21601q22906
1031.9G85913086J4725j60675j084748L1205K99682O7597K40631P36084Q71658l10745
1041.6G86618500k64206l51944l12882K68555Q5297j8845j96457p25174n96313L67126
1051.2G84873657N16205N77698j79444n02624K07291k17057J23597k442J72958N91202
1060.9G86161041L25318L10440n74341K03171P64694m21906j256332l59116J213379
1069.5G86366348n07660j141815Q18710Q11158J02844r58176j692199l32947M50668
1078.2G83916931J84021J00556j98136m49066L45230J155167k99530r68094p15485
1086.9G83071594j55716J154175J34201m43420l46146O62842J651688J1291m29611
$$ plain form
1095.6 785310898 784621582 783559723 782598038 782979050 783511047 781817703 781626053 782730560 783637924
1104.2 783637924 784720993 784255981 783019409 782907333 783150635 781461258 780194473 780911026 781396179
1112.9 781396179 781264038 781692963 783392258 784581070 784114761 783364944 783571243 782980347 781399994
1121.6 781399994 780742722 780201492 780103683 781236725 783642731 785814514 786432877 786531067 786058350
1130.3 786058350 785053101 783457642 782623291 783088684 783524246 783999023 784882736 786190796 787668304
1139 787668304 788904266 788458252 787316208 786834183 786195831 785391464 783732910 782495193 782725677
1147.6 782725677 783025055 783407211 784549637 785291367 785388184 785279846 783710098 782569122 782301178
1156.3 782301178 781099014 780282593 780933075 782506638 784056549 785482483 786199799 786326294 786157761
$$ packed form
1095.6G85310898o89316j061859r61685L81012N31997j693344j91650J104507R07364
1104.2G83637924J083069m65012j236572j12076K43302j689377j266785P16553M85153
1112.9G81396179j32141M28925J699295J188812m66309p49817K06299n90896j580353
1121.6G81399994o57272n41230r7809J133042K406006K171783O18363R8190m72717
1130.3G86058350j005249j595459q34351M65393M35562M74777Q83713J308060J477508
1139G87668304J235962m46014j142044m82025o38352q04367j658554j237717K30484
1147.6G82725677K99378L82156J142426P41730R6817j08338j569748j140976k67944
1156.3G82301178j202164q16421O50482J573563J549911J425934P17316J26495j68533
$$ plain form
1165 786157761 785420380 785019531 784330444 783551102 783161545 783910751 785780945 787389679 788992233
1173.7 788992233 789796906 790422897 790591354 789104080 787652054 786976776 786928864 787383575 788457947
1182.4 788457947 789838791 791348572 792328720 792085419 791862335 791447906 790730972 789869461 788508987
1191 788508987 787909470 788752365 789645920 790153580 790965042 791682129 792238083 792187271 791079330 790027924
1200.7 790027924 789099274 788045120 788149872 789194565 789888840 790493469 791210327 792063675 792647476
1209.4 792647476 792366409 791440430 790068741 789255524 789346085 789624557 789681931 789958115 790809097 791870651
1219 791870651 792542648 792680588 792544861 791800461 790981140 790021057 789226608 789366989 789501801 790096741
1228.6 790096741 790893173 791181107 790961761 790611038 790509033 789980469 789587021 789153824 788859634 789109726
$$ packed form
1165G86157761p37381m00849o89087p79342l89557P49206J870194J608734J602554
1173.7G88992233Q04673O25991J68457j487274j452026o75278m7912M54711J074372
1182.4G88457947J380844J509781R80148k43301k23084m14429p16934q61511j360474
1191G88508987n99517Q42895Q93555N07660Q11462P17087N55954n0812j107941j051406
1200.7G90027924r28650j054154J04752J044693O94275O04629P16858Q53348N83801
1209.4G92647476k81067r25979j371689q13217R0561K78472N7374K76184Q50982J061554
1219G91870651O71997J37940j35727p44400q19321r60083p94449J40381J34812N94940
1228.6G90096741P96432K87934k19346l50723j02005n28564l93448m33197k94190K50092
$$ plain form
1238.3 789109726 789513245 790112610 790501099 790700760 790452194 790124435 789783096 789088745 788332214 788146515
1247.9 788146515 788714294 788878250 789304581 790011368 790188828 789771957 789182587 789191132 788509827 787595596
1257.6 787595596 787576904 788296738 789043808 789418869 790075378 790322495 790173950 789841232 789276428 788496094
1267.2 788496094 787794876 787523193 787463531 788265915 789080429 789484482 789878616 790019836 789764709 788973236
1276.9 788973236 788448792 787781143 787348251 787747421 788141861 788532639 789208145 790047760 790412827 789977951
1286.5 789977951 788863983 787773895 786874924 786326141 786365509 786627960 787331467 788150558 789046021
1295.2 789046021 789779282 789940338 789502258 788553391 787205582 785491104 784876862 785158539 785908279
1303.9 785908279 786826706 787616196 788675919 789141235 789050446 788749008 787686768 784818649 782390137
$$ packed form
1238.3G89109726M03519N99365L88489J99661k48566l27759l41339o94351p56531j85699
1247.9G88146515N67779J63956M26331P06787J77460m16871n89370Q545o81305r14231
1257.6G87595596j8692P19834P47070L75061O56509K47117j48545l32718n64804p80334
1267.2G88496094p01218k71683n9662Q02384Q14514M04053L94134J41220k55127p91473
1276.9G88973236n24444o67649m32892L99170L94440L90778O75506Q39615L65067m34876
1286.5G89977951j113968j090088q98971n48783L9368K62451P03507Q19091Q95463
1295.2G89046021P33261J61056m38080r48867j347809j714478o14242K81677P49740
1303.9G85908279R18427P89490J059723M65316r0789l01438j062240k868119k428512
$$ plain form
1312.5 782390137 782300491 782536392 783799820 785300980 786529236 787474213 787535477 787533417 786894836 785647202
1322.2 785647202 783799973 782645187 782499161 782459488 783433533 785044708 786137772 787148743 788128433
1330.9 788128433 787416077 785949783 784378052 782910538 781947327 780519867 780634842 781491623 782236099
1339.6 782236099 783773956 785759201 787152863 786419067 785440292 784510040 783117752 781634445 780261688
1348.2 780261688 780005112 781382599 784023972 785332489 785923080 786277847 785060043 783716888 782622757
1356.9 782622757 781432648 779905167 779545364 779518204 780137329 781947479 782525177 784075470 785283813
1365.6 785283813 784403915 782744827 780148163 778020859 777595978 777926559 778721085 779778595 779704971
1374.3 779704971 780423660 782618027 783559494 782495270 780462418 778662109 776773758 775665054 775026474
$$ packed form
1312.5G82390137q9646K35901J263428J501160J228256R44977O1264k060o38581j247634
1322.2G85647202j847229j154786j46026l9673R74045J611175J093064J010971R79690
1330.9G88128433p12356j466294j571731j467514r63211j427460J14975Q56781P44476
1339.6G82236099J537857J985245J393662p33796r78775r30252j392288j483307j372757
1348.2G80261688k56576J377487K641373J308517N90591L54767j217804j343155j094131
1356.9G82622757j190109j527481l59803k7160O19125J810150N77698J550293J208343
1365.6G85283813q79898j659088k596664k127304m24881L30581P94526J057510p3624
1374.3G79704971P18689K194367R41467j064224k032852j800309j888351j108704o38580
$$ plain form
1382.9 775026474 775826797 777655182 779495468 781385498 780790405 781397705 781977158 780260620 778397751
1391.6 778397751 777258759 777393341 775621643 774716187 777680893 780501862 782003250 780489197 780273437
1400.3 780273437 780633545 779306870 778089600 777204132 774929123 774999313 777632828 779651566 780801926
1409 780801926 781016922 780660248 780136871 779377747 778651886 776984863 776175842 775607452 776064987 777498016
1418.6 777498016 774516068 775588608 778645096 779938812 778849335 776273422 775725784 775929642 775000229
1427.3 775000229 774698257 775172119 774388199 775480118 777274933 777773972 777984314 778729706 778823166
1436 778823166 772164841 771661224 774034729 774394608 774985504 776285172 777146912 777866135 778306198
1444.7 778306198 777867508 777365417 775639877 772476730 772803802 774033203 774470825 774654388 775156097
$$ packed form
1382.9G75026474Q00323J828385J840286J890030n95093O07300N79453j716538j862869
1391.6G78397751j138992J34582j771698r05456K964706K820969J501388j514053k15760
1400.3G80273437L60108j326675j217270q85468k275009P0190K633515K018738J150360
1409G80801926K14996l56674n23377p59124p25861j667023q09021n68390M57535J433029
1418.6G77498016k981948J072540L056488J293716j089477k575913n47638K03858r29413
1427.3G75000229l01972M73862p83920J091919J794815M99039K10342P45392R3460
1436G78823166o658325n03617K373505L59879N90896J299668Q61740P19223M40063
1444.7G78306198m38690n02091j725540l163147L27072J229401M37622J83563N01709
$$ plain form
1453.3 775156097 776077423 776882095 776381760 770047302 767095947 769558868 771072235 772986832 773999710
1462 773999710 774696426 776723328 775078583 774037399 776050339 776782990 776924133 776490555 776761551
1470.7 776761551 775358810 770703430 769740601 772758942 776377029 775255203 775618668 777918549 777945480
1479.4 777945480 778100128 777162781 776239548 776431427 776390686 776935425 777680588 776660767 775938034 778156586
1489 778156586 776958694 773678436 775562515 777480392 778111954 779291840 779843521 774954987 776933899
1497.7 776933899 778169861 776823349 778520355 778443298 778090820 778347321 779523544 781712189 778326111
1506.4 778326111 770211029 770431061 774275208 776023941 778451691 779027100 777013550 778235474 777724533
1515.1 777724533 777406464 775537338 771326523 775413284 778415527 775563202 771145248 772934113
$$ packed form
1453.3G75156097R21326Q04672n00335o334458k951355K462921J513367J914597J012878
1462G73999710O96716K026902j644745j041184K012940P32651J41143m33578K70996
1470.7G76761551j402741m655380r62829L018341L618087j121826L63465K299881K6931
1479.4G77945480J54648r37347r23233J91879m0741N44739P45163j019821p22733K218552
1489G78156586j197892l280258J884079J917877O31562J179886N51681m888534J978912
1497.7G76933899J235962j346512J697006p7057l52478K56501J176223K188645l386078
1506.4G78326111q115082K20032L844147J748733K427750N75409k013550J221924n10941
1515.1G77724533l18069j869126m210815M086761L002243k852325m417954J788865
$$ plain form
1522.8 772934113 776289978 778141632 775684357 774761963 775537415 774337311 775336685 776899490 777158432
1531.5 777158432 777900620 776218414 772807159 775396042 776636505 776985703 778317261 774227219 766401978
1540.1 766401978 770372238 771559601 770744781 773847198 775071259 773354645 775054932 775391541 775208435
1548.8 775208435 773507385 771468048 773275299 774339981 775269852 772327118 772163544 776450577 779102554
1557.5 779102554 771511688 761073914 763030853 768846359 772302399 773995438 774693756 773182526
1565.2 773182526 773287430 774716034 775191650 774997253 769060211 770087585 772358856 772294540 772370224
1573.9 772370224 773244705 773679581 767488480 769525223 772110977 772598877 772695541 771686249 771068115
1582.6 771068115 770178986 769791870 769761505 770027466 770307693 769425354 769421844 768996735 768817749 768251495
$$ packed form
1522.8G72934113L355865J851654k457275r22394P75452j200104R99374J562805K58942
1531.5G77158432P42188j682206l411255K588883J240463L49198J331558m090042p825241
1540.1G66401978L970260J187363q14820L102417J224061j716614J700287L36609j83106
1548.8G75208435j701050k039337J807251J064682R29871k942734j63574M287033K651977
1557.5G79102554p590866j0437774J956939N815506L456040J693039O98318j511230
1565.2G73182526J04904J428604M75616j94397n937042J027374K271271o4316P5684
1573.9G72370224Q74481M34876o191101K036743K585754M87900R6664j009292o18134
1582.6G71068115q89129l87116l0365K65961K80227q82339l510m25109j78986n66254
$$ plain form
1592.2 768251495 767364578 766662598 765422897 765305176 764703827 764794083 764822769 764504852 764188690 763527451
1601.9 763527451 762865829 761181793 760668640 760338669 759790421 758519745 757898254 757533264 756361542
1610.5 756361542 756579971 755766602 755395203 754332809 754601593 754813766 744924011 747227173 749196243
1619.2 749196243 749563065 749135132 749505386 749496078 744673996 745590820 746477814 747022476 744913940 742906876
1628.9 742906876 744401169 744424973 744633026 744433289 745579987 748355637 741403351 738348389 740043411
1637.5 740043411 741303177 743066025 743941040 743694382 744725113 745715027 747310791 748704224 745256424
1646.2 745256424 743459244 742276230 743883896 746770554 749365311 752290115 743107758 735420303
1653.9 735420303 744197235 748984985 751576309 752375488 752896423 752910614 752848282 753552628 751750412
$$ packed form
1592.2G68251495q86917p01980j239701j17721o01349R0256K8686l17917l16162o61239
1601.9G63527451o61622j684036n13153l29971n48248j270676o21491l64990j171722
1610.5G56361542K18429q13369l71399j062394K68784K12173r889755K303162J969070
1619.2G49196243L66822m27933L70254r308m822082R16824Q86994N44662k108536k007064
1628.9G42906876J494293K3804K08053j99737J146698K775650o952286l054962J695022
1637.5G40043411J259766J762848Q75015k46658J030731R89914J595764J393433l447800
1646.2G45256424j797180j183014J607666K886658K594757K924804r182357p687455
1653.9G35420303Q776932M787750K591324P99179N20935J4191o2332P04346j802216
$$ plain form
1662.6 751750412 750103302 753103409 755362701 756235657 758049927 759801178 755961456 754342575
1670.3 754342575 755933838 755746460 757359238 760288391 758417206 755274887 758952255 761538239
1678 761538239 762581940 762706223 760994492 762300339 765302200 764183426 752713318 754902573 760280762
1686.7 760280762 763178482 763178635 763932495 763824844 764752502 765849609 765546265 767128983 767239532 757271957
1696.4 757271957 759543915 764392014 768615875 767389069 758530121 763810043 767791443 768464127
1704.1 768464127 766564102 765195923 763706741 764813232 767375259 767788391 767542877 769166412 770369110
1712.8 770369110 771067352 768648911 765964355 768204727 768818893 762155762 763684235 766727676 768348541
1721.4 768348541 769720078 770042725 770027924 771083374 771121597 770383911 769811172 770122299 767770004
$$ packed form
1662.6G51750412j647110L000107K259292Q72956J814270J751251l839722j618881
1670.3G54342575J591263j87378J612778K929153j871185l142319L677368K585984
1678G61538239J043701J24283j711731J305847L001861j118774j1470108K189255N378189
1686.7G60280762K897720J53P53860j07651R27658J097107l03344J582718J10549r967575
1696.4G57271957K271958M848099M223861j226806q858948N279922L981400O72684
1704.1G68464127j900025j368179j489182J106491K562027M13132k45514J623535J202698
1712.8G70369110O98242k418441k684556K240372O14166o663131J528473L043441J620865
1721.4G68348541J371537L22647j4801J055450L8223p37686n72739L11127k352295
$$ plain form
1730.1 767770004 766122131 768988876 771265793 768880081 763611984 767975388 771030502 771010971 772239685
1738.8 772239685 769968643 765912476 768012009 769547806 768392563 768625336 770888519 771434174 771463089
1747.5 771463089 770741348 769299545 770878372 768473969 766002960 768370056 769567413 770916061
1755.2 770916061 772329025 770243378 770581970 772174606 772738037 773642654 769838486 767325745 768630447
1763.9 768630447 769137726 769511414 770831375 771960602 769722672 770564194 772684479 771414642 767815781
1772.5 767815781 766041946 768529587 769122162 767739258 769327927 770282745 771171417 771819077 770548172
1781.2 770548172 770991440 771651535 771548386 769802933 768145828 768875122 769069672 769316940 770306015
1789.9 770306015 770663223 771711349 769604416 768395157 770466080 770132751 768287735 768747711 770379333
$$ packed form
1730.1G67770004j647873K866745K276917k385712n268097M363404L055114j9531J228714
1738.8G72239685k271042m056167K099533J535797j155243K32773K263183N45655K8915
1747.5G71463089p21741j441803J578827k404403k471009K367096J197357J348648
1755.2G70916061J412964k085647L38592J592636N63431R04617l804168k512741J304702
1763.9G68630447N07279L73688J319961J129227k237930Q41522K120285j269837l598861
1772.5G67815781j773835K487641N92575j382904J588669R54818Q88672O47660j270905
1781.2G70548172M43268O60095j03149j745453j657105P29294J94550K47268R89075
1789.9G70306015L57208J048126k106933j209259K070923l33329j845016M59976J631622
$$ plain form
1798.6 770379333 769981537 768430862 769704132 770039902 770236511 771003342 770380630 769924774 769347076
1807.3 769347076 768601761 769123535 769411469 768344574 768431549 769458237 769979248 770318298 770563202
1815.9 770563202 770319290 768943558 768335724 768462448 767914352 768233109 768471909 769350662 770805588
1824.6 770805588 768461761 767686081 768964233 769196777 767793579 764152298 765211334 767418671 767859802
1833.3 767859802 767980118 768266220 768964920 768753967 767764206 767867508 767681046 767250214 766462326 767080154
1842.9 767080154 767504807 763586578 765021133 767436600 767565842 767118454 767072296 767044983 766399689
1851.6 766399689 765694809 765148544 765261993 765899429 766208115 766695709 767083130 767280197 767390594 766660461
1861.3 766660461 765355072 764900513 764491425 763862305 763966293 763912354 764835129 765060883 763765335
$$ packed form
1798.6G70379333l97796j550675J273270L35770J96609P66831o22712m55856n77698
1807.3G69347076p45315N21774K87934j066895Q6975J026688N21011L39050K44904
1815.9G70563202k43912j375732o07834J26724n48096L18757K38800Q78753J454926
1824.6G70805588k343827p75680J278152K32544j403198l641281J059036K207337M41131
1833.3G67859802J20316K86102O98700k10953r89761J03302j86462m30832p87888O17828
1842.9G67080154M24653l918229J434555K415467J29242m47388m6158k7313o45294
1851.6G66399689p04880n46265J13449O37436L08686M87594L87421J97067J10397p30133
1861.3G66660461j305389m54559m09088o29120J03988n3939R22775K25754j295548
$$ plain form
1869.9 763765335 764758759 765555344 765264740 764498520 763900757 763611526 763231735 763461456 764052505 764706345
1879.6 764706345 765057983 765230637 765435944 765409927 764481277 762826614 762367325 762364349 763094940 763408432
1889.2 763408432 762078934 763583679 764954147 764551468 764468002 763379745 761928406 761615219 761284714
1897.9 761284714 761018295 761213074 761712952 762610092 763505630 763931808 763915329 763351135 762583160 761444931
1907.6 761444931 760484772 760074005 759206238 759382782 760741653 761673584 762644806 763166351 763146744 763152924
1917.2 763152924 760076828 757912598 758373337 758242340 758788910 758856583 758962631 760763779 761973801
1925.9 761973801 762368927 762091446 761161957 759990234 758432617 757366333 757116241 757531662 758518219
1934.6 758518219 759353714 759973602 760583649 760834961 760601501 759571228 758978195 757806015 754924240
$$ packed form
1869.9G63765335R93424P96585k90604p66220n97763k89231l79791K29721N91049O53840
1879.6G64706345L51638J72654K05307k6017r28650j654663m59289k976P30591L13492
1889.2G63408432j329498J504745J370468m02679q3466j088257j451339l13187l30505
1897.9G61284714k66419J94779M99878Q97140Q95538M26178j6479n64194p67975j138229
1907.6G61444931r60159m10767q67767J76544J358871R31931R71222N21545j9607O180
1917.2G63152924l076096k164230M60739j30997N46570O7673J06048J801148J210022
1925.9G61973801L95126k77481r29489j171723j557617j066284k50092M15421R86557
1934.6G58518219Q35495O19888O10047K51312k33460j030273n93033j172180k881775
$$ plain form
1943.2 754924240 755177383 756446228 757157364 758222961 759052963 759878922 759907532 759417877 758732758
1951.9 758732758 757577286 756604004 755583801 755295410 755619354 756497116 757932053 758954086 759257126
1960.6 759257126 758740005 758091202 757342987 756211853 755159531 754622803 754130325 754247131 755541458
1969.3 755541458 756675339 757541656 757894592 757379303 756837311 756191788 755147018 754169159 753850861
1978 753850861 753726654 753919754 754676743 755594559 756347580 756565857 756380692 755742111 754914780 753930588
1987.6 753930588 752591782 751824646 752538757 753371048 753121262 753935699 754959488 755208359 755124054
1996.3 755124054 754222870 753035126 751721954 750927734 750863495 751095123 751579208 752188492 753036652
2005 753036652 753468018 753424606 753086166 752441483 751597443 750903320 750403061 749858704 749884186 750208969
$$ packed form
1943.2G54924240K53143J268845P11136J065597Q30002Q25959K8610m89655o85119
1951.9G58732758j155472r73282j020203k88391L23944Q77762J434937J022033L03040
1960.6G59257126n17121o48803p48215j131134j052322n36728m92478J16806J294327
1969.3G55541458J133881Q66317L52936n15289n41992o45523j044770r77859l18298
1978G53850861j24207J93100P56989R17816P53021K18277j85165o38581q27331r84192
1987.6G53930588j338806p67136P14111Q32291k49786Q14437J023789K48871q4305
1996.3G55124054r01184j187744j313172p94220o4239K31628M84085O09284Q48160
2005G53036652M31366m3412l38440o44683q44040o94123n00259n44357K5482L24783
$$ plain form
2014.6 750208969 751030350 751631241 751281586 751053696 750399246 749713287 749304886 748846054 748426208 748285675
2024.2 748285675 748694458 749059143 749647980 750149384 750029068 749760666 749437180 748857803 748047638 747310257
2033.9 747310257 746820526 746884155 747219543 747765808 748302689 748588867 748524170 747878799 747732697 747246323
2043.5 747246323 746263199 746034470 745999374 746369247 746750259 746891785 747330704 747590561 747255707 746638565
2053.2 746638565 746068115 745277786 744818115 744938812 744867554 744788666 745217438 745753937 745986938 746028061
2062.8 746028061 745897141 745337677 744307327 743697128 743614655 743786011 744237289 744720383 745261154 745397110
2072.5 745397110 745211105 745135040 744851837 744176407 743481827 743106384 742748871 742815170 743253632 743747864
2082.1 743747864 744399796 744579315 744241104 743824310 743257065 742499390 742178574 741872330 741505966 741759186
$$ packed form
2014.6G50208969Q21381O00891l49655k27890o54450o85959m08401m58832m19846j40533
2024.2G48285675M08783L64685N88837N01404j20316k68402l23486n79377q10165p37381
2033.9G47310257m89731O3629L35388N46265N36881K86178o4697o45371j46102m86374
2043.5G47246323r83124k28729l5096L69873L81012J41526M38919K59857l34854o17142
2053.2G46638565n70450p90329m59671J20697p1258p8888M28772N36499K33001M1123
2062.8G46028061j30920n59464j030350o10199q2473J71356M51278M83094N40771J35956
2072.5G45397110j86005p6065k83203o75430o94580l75443l57513O6299M38462M94232
2082.1G43747864O51932J79519l38211m16794n67245p57675l20816l06244l66364K53220
$$ plain form
2091.7 741759186 741863098 742238464 743058777 743494110 743228226 742582321 742292023 741832047 741248169 740872421
2101.4 740872421 740838242 741373520 741909637 742382355 742712250 742701569 742416229 741889420 741194839 740593338
2111 740593338 740247421 740051880 740198059 740585709 741028595 741303940 741482086 741500473 741008148 740435028
2120.7 740435028 739798126 739232101 739267883 739690018 739897156 739790344 739756927 740080795 740648727 740658875
2130.3 740658875 740219116 739700089 738930359 738332138 738051071 738059387 738261414 738829880 739511642 739655228
2140 739655228 739679794 739637833 739217300 738492203 737753754 737256622 736961288 737160416 737776871 738261032
2149.6 738261032 738489456 738693008 739091949 739016113 738036499 737282944 737046661 736608124 735986252 735731277
2159.3 735731277 736374130 737493515 738263168 738270721 737935715 737580338 736934280 736355972 735999603 735839996
$$ packed form
2091.7G41759186J03912L75366Q20313M35333k65884o45905k90298m59976n83878l75748
2101.4G40872421l4179N35278N36117M72718L29895j0681k85340n26809o94581o01501
2111G40593338l45917j95541J46179L87650M42886K75345J78146J8387m92325n73120
2120.7G40435028o36902n66025L5782M22135K07138j06812l3417L23868N67932J0148
2130.3G40658875m39759n19027p69730n98221k81067Q316K02027N68466O81762J43586
2140G39655228K4566m1961m20533p25097p38449m97132k95334J99128O16455M84161
2149.6G38261032K28424K03552L98941p5836r79614p53555k36283m38537o21872k54975
2159.3G35731277O42853J119385P69653P553l35006l55377o46058n78308l56369j59607
$$ plain form
2168.9 735839996 735765991 735795822 736300735 736951523 737354202 737287369 737160645 737011337 736237259 735492554
2178.5 735492554 735290909 735223618 735156326 735521698 736240692 736622925 736728821 736898651 736695404 736149521
2188.2 736149521 735740585 735115585 734422379 734230652 734675827 735076370 735085068 735786667 736586151 736530228
2197.8 736530228 736207733 735764236 734973297 734178238 733816528 733649292 733891678 734388275 734852753 735365601
2207.5 735365601 735459061 735315323 734987564 734685364 734449387 733907700 733559189 733484497 733676910 734230499
2217.1 734230499 734855652 735026932 734869690 734914169 734797668 734249420 733406067 732779465 732798157 733234406
2226.8 733234406 733461609 733527298 733955765 734160995 734078751 733900223 733495026 733367538 733127136 732391129
2236.4 732391129 732127762 732518692 732648239 732750320 733076553 733194427 733060455 732769241 732422333 732017441
$$ packed form
2168.9G35839996p4005K9831N04913O50788M02679o6833j26724j49308p74078p44705
2178.5G35492554k01645o7291o7292L65372P18994L82233J05896J69830k03247n45883
2188.2G36149521m08936o25000o93206j91727M45175M00543Q698P01599P99484n5923
2197.8G36530228l22495m43497p90939p95059l61710j67236K42386M96597M64478N12848
2207.5G35365601R3460j43738l27759l02200k35977n41687l48511p4692J92413N53589
2217.1G34230499O25153J71280j57242M4479j16501n48248q43353o26602J8692M36249
2226.8G33234406K27203O5689M28467K05230q2244j78528m05197j27488k40402p36007
2236.4G32391129k63367L90930J29547J02081L26233J17874j33972k91214l46908m04892
$$ plain form
2246 732017441 731870575 731535568 730960236 731276245 731934509 732017517 731928711 732011414 731739273 731264801
2255.7 731264801 731056900 730957031 730939789 730663300 730525055 730711975 730980148 731109467 730696259 730295792
2265.3 730295792 730101929 730183792 730014343 729429398 729185410 729265823 729670639 729866638 730118408 730363998
2275 730363998 730261993 730241470 729922409 729662628 729277191 728955307 729006042 728970947 729035492 729177170 729655991
2285.6 729655991 729621582 729173431 728916092 728378067 727915955 727290573 727084656 727179184 727099304 726874771
2295.2 726874771 726816101 727317123 726975555 726533356 726162949 725220871 724669800 724345856 724209137 724132309
2304.9 724132309 724428177 724317398 723922806 723956757 723585663 723397903 722892227 721848907 720347748
2313.5 720347748 719645691 720114899 720087128 720248337 719658585 718888550 718789673 718897324 718864517 717312012
$$ packed form
2246G32017441j46866l35007n75332L16009O58264Q3008q8806Q2703k72141m74472
2255.7G31264801k07901r9869j7242k76489j38245J86920K68173J29319m13208m00467
2265.3G30295792j93863Q1863j69449n84945k43988Q0413M04816J95999K51770K45590
2275G30363998j02005k0523l19061k59781l85437l21884N0735l5095O4545J41678M78821
2285.6G29655991l4409m48151k57339n38025m62112o25382k05917R4528p9880k24533
2295.2G26874771n8670N01022l41568m42199l70407r42078n51071l23944j36719p6828
2304.9G24132309K95868j10779l94592L3951l71094j87760n05676j043320j501159
2313.5G20347748p02057M69208k7771J61209n89752p70035r8877J07651l2807j552505
$$ plain form
2323.2 717312012 715678864 714606400 714882812 715221176 715110550 715546646 715353775 715191574 714084930
2331.9 714084930 713717804 713658218 712915878 712376328 710677643 711093597 712413406 712789917 712729568 711888733
2341.5 711888733 712151566 712491989 711620407 710659561 710828400 711305161 713045502 714883041 714640045
2350.2 714640045 713634262 712405930 711344147 710979767 710064926 709039536 707207413 705897293 704198837
2358.9 704198837 702540894 702895126 703074188 704084015 706269226 706445618 705649643 705894012 705972595
2367.6 705972595 706745682 707674332 708509598 709624329 709918900 710636673 711914215 713153687 714348984
2376.2 714348984 715266037 715800400 715740814 715473709 715893784 716631088 716716537 717235794 718212280 718814545
2385.9 718814545 719229965 719154968 719116135 719019394 718766937 718519669 717984695 717768326 717830811 718237457
$$ packed form
2323.2G17312012j633148j072464K76412L38364j10626M36096j92871j62201j106644
2331.9G14084930l67126n9586p42340n39550j698685M15954J319809L76511o0349q40835
2341.5G11888733K62833L40423q71582r60846J68839M76761J740341J837539k42996
2350.2G14640045j005783j228332j061783l64380r14841j025390j832123j310120j698456
2358.9G04198837j657943L54232J79062J009827K185211J76392p95975K44369P8583
2367.6G05972595P73087R28650Q35266J114731K94571P17773J277542J239472J195297
2376.2G14348984R17053N34363n9586k67105M20075P37304Q5449N19257R76486O02265
2385.9G18814545M15420p4997l8833r6741k52457k47268n34974k16369O2485M06646
$$ plain form
2395.5 718237457 718674393 718860092 718794556 718264389 718262711 718377228 717687225 716791306 716508560 716778564
2405.2 716778564 716823502 716700821 716770859 717060928 717366714 717412567 716877518 716020432 715469818 715256195
2414.8 715256195 715361938 715424805 715388565 715661697 715856476 715536194 715408554 715637360 715195312 714422607
2424.5 714422607 714148483 714024582 713782043 713703232 713616486 713639755 714124908 714307098 713970566 713488770
2434.1 713488770 713062210 712669449 712340698 712251892 712125549 712316055 712751846 712993317 712853928 712426300
2443.7 712426300 712347870 712054977 711324997 710931549 710993805 711009903 710927734 711117401 711328583 711485672
2453.4 711485672 711622772 711570358 711051941 710353699 709847870 709373550 709118347 708975220 709306793 709898453
2463 709898453 709900894 709681320 709567108 709497604 709114532 708579788 708015747 707355576 707331314 707937088 708650742
$$ packed form
2395.5G18237457M36936J85699o5536n30167j678J14517o90003q95919k82746K70004
2405.2G16778564M4938j22681P0038K90069L05786M5853n35049q57086n50614k13623
2414.8G15256195J05743O2867l6240K73132J94779l20282j27640K28806m42048p72705
2424.5G14422607k74124j23901k42539p8811q6746K3269M85153J82190l36532m81796
2434.1G13488770m26560l92761l28751q8806j26343J90506M35791K41471j39389m27628
2443.7G12426300p8430k92893p29980l93448O2256J6098q2169J89667K11182J57089
2453.4G11485672J37100n2414n18417o98242n05829m74320k55203j43127L31573N91660
2463G09898453K441k19574j14212o9504l83072n34744n64041o60171k4262O05774P13654
$$ plain form
2473.6 708650742 708949966 708797836 708773422 708525238 707775574 707311859 707208176 706875687 706415787 706215057
2483.3 706215057 706470642 706928864 707138596 707051849 707146301 707344589 707078400 706540909 705766907 704906387
2492.9 704906387 704632721 704848557 704975967 705404282 706169968 706467209 706291809 705604095 705178070 704808121
2502.6 704808121 703902969 703799057 703723526 703624344 704228287 704411774 704543915 705010300 705249786 704822845
2512.2 704822845 703789215 702808990 702236176 701968689 701999664 702430801 702971115 703392105 703502197 703418808
2521.9 703418808 703162842 702793274 702527542 701969757 701402054 701241150 701323700 701447525 701786423 702292633
2531.5 702292633 702293396 702016144 701847916 701534424 700988312 700626678 700266113 699650879 699314880 699511185
2541.1 699511185 700478210 701177292 700932999 700879364 700820694 700009842 699159622 698814850 698431931 698409348
$$ packed form
2473.6G08650742K99224j52130k4414k48184p49664m63715j03683l32489m59900k00730
2483.3G06215057K55585M58222K09732q6747R4452J98288k66189n37491p74002q60520
2492.9G04906387k73666K15836J27410M28315P65686K97241j75400o87714m26025l69949
2502.6G04808121r05152j03912p5531r9182O03943J83487J32141M66385K39486m26941
2512.2G04822845j033630r80225n72814k67487L0975M31137N40314M20990J10092q3389
2521.9G03418808k55966l69568k65732n57785n67703j60904Q2550J23825L38898N06210
2531.5G02292633P63k77252j68228l13492n46112l61634l60565o15234l35999J96305
2541.1F99511185R67025O99082k44293n3635n8670q10852q50220l44772l82919k2583
$$ plain form
2550.8 698409348 698882599 699126511 699253998 699459610 699717789 699302979 698340759 697746429 697290497 696981583
2560.4 696981583 697129669 697501678 697762680 697809982 697681885 697664948 697693024 697642365 697301102 696462860
2570.1 696462860 695900879 695663528 695710144 696066895 696374435 696685562 696630630 696576309 696851349 696760864
2579.7 696760864 695968170 695194092 694854126 694561920 694523392 694626160 694980698 695362625 695345230 695391846
2589.4 695391846 695330963 695119247 694609680 694034195 693661804 693104248 693076630 693568802 693903275 694271088
2599 694271088 694562225 694272690 693520813 692993622 692783051 692498779 692102966 691898270 692126541 692583694
2608.6 692583694 692774506 692721710 692815475 692835007 692324905 691708832 691245193 690617752 690358200 690610657
2618.3 690610657 690825424 690943527 691078873 691073227 690737762 690476990 690165405 689507065 689224091 689342041
$$ packed form
2550.8F98409348M73251K43912J27487K05612K58179m14810r62220n94330m55932l08914
2560.4F96981583J48086L72009K61002M7302j28097j6937K8076n0659l41263q38242
2570.1F96462860n61981k37351M6616L56751L07540L11127n4932n4321K75040r0485
2579.7F96760864p92694p74078l39966k92206l8528J02768L54538L81927j7395M6616
2589.4F95391846o0883k11716n09567n75485l72391n57556k7618M92172L34473L67813
2599F94271088K91137k89535p51877n27191k10571k84272l95813k04696K28271M57153
2608.6F92583694J90812n2796R3765J9532n10102o16073m63639o27441k59552K52457
2618.3F90610657K14767J18103J35346n646l35465k60772l11585o58340k82974J17950
$$ plain form
2627.9 689342041 688920059 688651886 689336624 689823914 689744568 689470978 689495316 689216232 688203735 687877884
2637.6 687877884 687697296 687393188 687292023 687278442 687817154 688152161 688206406 688138275 687905655 687404175
2647.2 687404175 686681290 686399231 686144562 686150513 686458130 686600494 686815186 686830978 686656570 686390839
2656.9 686390839 685658340 684914932 684733047 684546585 684284439 684266129 684735489 685296555 685565186 685999908
2666.5 685999908 685679474 685025635 684577637 683657684 683143463 683008728 683033218 683391571 683820190 684245529
2676.1 684245529 684571533 684442062 683926468 683462753 682835846 682406311 681940918 681445084 681479568 681574097
2685.8 681574097 681974869 682569427 682819290 682502136 682145920 681995926 681495438 680887680 680232544 679938431
2695.4 679938431 680274429 680911026 681508255 682042999 682219772 681442108 680841599 680635376 679913940 678943710
$$ packed form
2627.9F89342041m21982k68173O84738M87290p9346k73590K4338k79084j012497l25851
2637.6F87877884j80588l04108j01165j3581N38712L35007N4245o8131k32620n01480
2647.2F87404175p22885k82059k54669N951L07617J42364K14692J5792j74408k65731
2656.9F86390839p32499p43408j81885j86462k62146j8310M69360N61066K68631M34722
2666.5F85999908l20434o53839m47998r19953n14221j34735K4490L58353M28619M25339
2676.1F84245529L26004j29471n15594m63715o26907m29535m65393m95834L4484R4529
2685.8F81574097M00772N94558K49863l17154l56216j49994n00488o07758o55136k94113
2695.4F79938431L35998O36597N97229N34744J76773p77664o00509k06223p21436r70230
$$ plain form
2705.1 678943710 678457794 678397598 678572998 679311752 680003738 680352097 680117340 679726868 679460831 678634796
2714.7 678634796 677975693 677577057 677519531 677696609 677710342 678271866 679104156 679256058 678911591 678703995
2724.4 678703995 677991409 677154312 676625137 676072006 675813980 675813217 676609192 677244873 677158508 677182999
2734 677182999 677199478 677139664 676684113 675933456 674910660 674504852 674750366 674573822 674975891 675822601
2743.7 675822601 676206818 676306992 676374054 675998840 675255966 674582367 673643799 673180161 673167038 673347473
2753.3 673347473 674042587 674457016 674556885 674454041 674173965 673971024 673497543 673082275 672736130 672234039
2762.9 672234039 672338867 672757187 673194733 673454132 673400040 673639069 673197479 672471848 672170258 671557236
2772.6 671557236 671176605 671153030 671076355 670979767 671490173 672077637 672242126 672114334 671235352 670522003
$$ packed form
2705.1F78943710m85916o0196J75400P38754O91986L48359k34757l90472k66037q26035
2714.7F78634796o59103l98636n7526J77078J3733N61524Q32290J51902l44467k07596
2724.4F78703995p12586q37097n29175n53131k58026p63P95975O35681q6365K4491
2734F77182999J6479n9814m55551p50657j022796m05808K45514j76544M02069Q46710
2743.7F75822601L84217J00174O7062l75214p42874o73599r38568m63638j3123J80435
2753.3F73347473O95114M14429R9869j02844k80076k02941m73481m15268l46145n02091
2762.9F72234039J04828M18320M37546K59399n4092K39029m41590p25631l01590o13022
2772.6F71557236l80631k3575p6675r6588N10406N87464J64489j27792q78982p13349
$$ plain form
2782.2 670522003 669700241 669028625 669174271 669159317 669519196 670117798 670672455 671387405 671411133 670821915
2791.9 670821915 670283127 669537201 668997269 668833389 668151474 667813873 668090439 668550415 669091415 669169159
2801.5 669169159 668974991 668631287 668457489 667719421 666538773 666192474 666252441 666582413 666915512 667405624
2811.2 667405624 668049088 668105316 667963181 667456207 666400528 665698242 665324783 664798126 664742203 665011826
2820.8 665011826 665121994 665742416 666444855 666136017 665472717 664982605 664385147 663982468 663364868 662753372
2830.4 662753372 662628174 662880936 663623047 664324341 664801559 664576797 664054947 663481827 662680893 662263947
2840.1 662263947 661618271 661123734 660993347 661264114 661457138 661270523 661545715 661022797 660258255 659416122
2849.7 659416122 658618774 658762054 658259125 657727966 657897110 658363037 658871155 659523163 659955368 659646225
$$ packed form
2782.2F70522003q21762o71616J45646j4954L59879N98602N54657P14950K3728n89218
2791.9F70821915n38788p45926n39932j63880o81915l37601K76566M59976N41000P7744
2801.5F69169159j94168l43704j73798p38068j180648l46299N9967L29972L33099M90112
2811.2F67405624O43464N6228j42135n06974j055679p02286l73459n26657n5923K69623
2820.8F65011826J10168O20422P02439l08838o63300m90112n97458m02679o17600o11496
2830.4F62753372j25198K52762P42111P01294M77218k24762n21850n73120q00934m16946
2840.1F62263947o45676m94537j30387K70767J93024j86615K75192n22918p64542q42133
2849.7F59416122p97348J43280n02929n31159J69144M65927N08118O52008M32205l09143
$$ plain form
2859.4 659646225 659401855 658578262 657692947 657487106 657144165 656872635 657270508 657981567 658436661 658733673
2869 658733673 658237381 657791595 657753220 657207870 656604538 655949326 655684509 655741348 655770340 656206131
2878.7 656206131 656858978 656651077 655918503 655811386 655443726 654862900 654314880 653964691 654281616 654263535
2888.3 654263535 653769455 653939819 654862671 655059357 654695435 654223404 653653107 653045197 652219391 651902847
2897.9 651902847 651578140 651987534 652646255 652438812 652491150 652204361 652125015 651881256 650946045 650328217
2907.6 650328217 650072937 650545044 650681000 650196075 650027237 650260544 650524368 650214615 649393539 648632660
2917.2 648632660 648086624 647488861 646965561 646304626 646279526 646803818 646995926 647491302 647765198 647782059
2926.9 647782059 647375793 646567993 646360779 646124954 645670013 645671310 645997696 646363297 646822891 647170486
$$ packed form
2859.4F59646225k44370q23593q85315k05841l42941k71530L97873P11059M55094K97012
2869F58733673m96292m45786l8375n45350o03332o55212k64817N6839K8992M35791
2878.7F56206131O52847k07901p32574j07117l67660n80826n48020l50189L16925j8081
2888.3F54263535m94080J70364R22852J96686l63922m72031n70297o07910q25806l16544
2897.9F51902847l24707M09394O58721k07443N2338k86789p9346k43759r35211o17828
2907.6F50328217k55280M72107J35956m84925j68838K33307K63824l09753q21076p60879
2917.2F48632660n46036n97763n23300o60935k5100N24292J92108M95376K73896J6861
2926.9F47782059m06266q07800k07214k35825m54941J297L26386L65601M59594L47595
$$ plain form
2936.5 647170486 647703857 647865067 647294235 647108765 647192764 647393112 647201691 646743774 647236938 648154984
2946.2 648154984 648202820 647592010 647379532 647177582 647020569 646800690 646310272 646003647 645806580 646283417
2955.8 646283417 646719513 646845779 646713333 646301117 646570053 646574631 646186371 645903549 645563126 645310516
2965.5 645310516 645327148 646004105 646563187 646596451 646816025 646998444 646537933 646176224 646125412 645717087
2975.1 645717087 645401230 645430069 645631943 645906296 646133499 646101837 646115875 646358109 646037064 645478973
2984.7 645478973 645165558 644738464 644570465 644912033 644835815 644651489 645175781 645572739 645658569 645554352
2994.4 645554352 645300140 644839172 644184799 643868561 643706055 643859711 643742371 643682785 644428406 644211121
3004 644211121 643522797 643616257 643468704 642816849 642474213 642567673 642518616 642621918 642783203 642794342 642943268
$$ packed form
2936.5F47170486N33371J61210n70832j85470Q3999K00348j91421m57917M93164R18046
2946.2F48154984M7836o10810k12478k01950j57013k19879m90418l06625j97067M76837
2955.8F46283417M36096J26266j32446m12216K68936M578l88260k82822l40423k52610
2965.5F45310516J6632O76957N59082L3264K19574J82419m60511l61709n0812m08325
2975.1F45717087l15857K8839K01874K74353K27203l1662J4038K42234l21045n58091
2984.7F45478973l13415m27094j67999L41568p6218j84326N24292L96958Q5830j04217
2994.4F45554352k54212m60968o54373l16238j62506J53656j17340n9586P45621k17285
3004F44211121o88324R3460j47553o51855l42636R3460m9057J03302J61285J1139J48926
$$ plain form
3014.6 642943268 642953110 643099823 642995300 642479477 642030716 641188431 640825806 641187515 641519775 641657028
3024.3 641657028 641105576 640779572 641076736 641113052 640528030 639811058 639513397 639033890 639116020 639813728
3033.9 639813728 639848289 639637642 639576607 639637527 639526939 639125175 638944778 638775291 638350868 637986984
3043.6 637986984 637912216 638148994 638100815 637885895 638037949 637748985 637247849 636669617 636072464 635822258
3053.2 635822258 635437469 635901299 636439247 636025124 635722313 635685844 635953522 635883026 635529785 635539169
3062.9 635539169 635490646 634693336 633909035 633893356 633800659 633846817 634169464 634590988 634580536 634006424
3072.5 634006424 633919373 633861618 633137283 632090607 631734848 631845169 632084579 632645874 632718124 632327538
3082.1 632327538 632017746 631813049 630820961 630177841 630372925 630012436 630050888 630593491 630929260 630671425
$$ packed form
3014.6F42943268R842J46713j04523n15823m48761q42285l62625L61709L32260J37253
3024.3F41657028n51452l26004K97164L6316n85022p16972k97661m79507Q2130O97708
3033.9F39813728L4561k10647o1035O0920j10588m01764j80397j69487m24423l63884
3043.6F37986984p4768K36778m8179k14920J52054k88964n01136n78232n97153k50206
3053.2F35822258l84789M63830N37948m14123l02811l6469K67678p0496l53241R384
3062.9F35539169m8523p97310p84301j5679r2697M6158L22647M21524j0452n74112
3072.5F34006424q7051n7755p24335j046676l55759J10321K39410N61295P2250l90586
3082.1F32327538l09792k04697r92088o43120J95084l60489L8452N42603L35769k57835
$$ plain form
3091.8 630671425 630539513 630406494 629809914 629651070 628941956 628392982 628194962 628020363 628199997 627795143
3101.4 627795143 627695122 627962303 628182907 628316307 628077965 627148628 626173019 626069260 626045036 626388397
3111.1 626388397 626441765 626033783 625828629 625641975 625784988 625631981 625576897 625189362 623971519 623206520
3120.7 623206520 623198357 623351021 623339806 623546944 623668442 623540802 623002892 622687454 622543945 621784172
3130.4 621784172 621414070 621333351 621219826 620942688 621167870 621978798 621781731 621203690 621001396 620574265
3140 620574265 619725800 619152679 618869209 618888512 619033546 618806496 618794823 618737946 618893433 618897285 618359642
3150.6 618359642 617734184 617191010 616909904 616024055 615559616 615767555 616061172 616331482 616154785 616374893
3160.3 616374893 616260490 615661774 614807625 613764801 613164444 613202057 613586273 613127556 613073578 613594856
$$ packed form
3091.8F30671425j31912j33019n96580j58844p09114n48974j98020j74599J79634m04854
3101.4F27795143j00021K67181K20604J33400k38342r29337r75609j03759k4224L43361
3111.1F26388397N3368m07982k05154j86654J43013j53007n5084l87535j217843p64999
3120.7F23206520q163J52664j1215K07138J21498j27640n37910l15438j43509p59773
3130.4F21784172l70102q0719j13525k77138K25182Q10928j97067n78041k02294m27131
3140F20574265q48465n73121k83470J9303J45034k27050j1673n6877J55487L852n37643
3150.6F18359642o25458n43174k81106q85849m64439K07939K93617K70310j76697K20108
3160.3F16374893j14403n98716q54149j042824o00357L7613L84216m58717n3978N21278
$$ plain form
3169.9 613594856 613583565 613506737 613113289 612567596 612043190 611315689 610706978 610535393 610108261 609982414
3179.5 609982414 610435295 610466614 610353584 610059280 609799385 609181290 608227348 607443085 606924820 607036438
3189.2 607036438 607199211 607793579 608060112 607629471 607190552 606493568 605977669 605560875 605202370 604743614
3198.8 604743614 604392624 603905411 603344231 603488808 603953552 604141884 603434181 602795143 602384911 602137527
3208.5 602137527 601634254 600641403 600570488 600297279 600475731 600676193 600039482 599883690 599561729 599730797
3218.1 599730797 599491653 598437424 597474556 597020721 597643700 597693138 597635689 597898521 597742653 597596626
3227.8 597596626 597172165 596338120 595470352 594866943 594320869 594016075 593930702 593817635 593929710 593967438
3237.4 593967438 593834572 593876495 593487091 592520752 591687622 591257858 591573105 591370926 590633812 590485306
$$ packed form
3169.9F13594856j1291p6828l93448n45693n24406p27501o08711j71585m27132j25847
3179.5F09982414M52881L1319j13030k94304k59895o18095r53942p84263n18265J11618
3189.2F07036438J62773N94368K66533m30641m38919o96984n15899m16794l58505m58756
3198.8F04743614l50990m87213n61180J44577M64744J88332p07703o39038m10232k47384
3208.5F02137527n03273r92851p0915k73209J78452K00462o36711j55792l21961J69068
3218.1E99730797k39144j054229r62868m53835O22979M9438n7449K62832j55868j46027
3227.8E97596626m24461q34045q67768o03409n46074l04794q5373j13067J12075L7728
3237.4E93967438j32866M1923l89404r66339q33130m29764L15247k02179p37114j48506
$$ plain form
3247 590485306 590488663 590877190 590654182 590014191 589732056 589420738 589174232 588551407 588131485 588050613
3256.7 588050613 588150139 588237343 587881393 587521973 587574425 587569237 586943016 586263924 585352821 585009804
3266.3 585009804 585280991 585182571 585305939 585374146 585508690 585548859 585669899 585146523 583910446 583472137
3276 583472137 582675743 582086525 581778793 581603127 582098999 582315903 582523384 582370758 582170601 581688957
3285.6 581688957 580581551 580021095 579504433 578708344 578134613 578154678 578761253 579484444 579320717 578373833
3295.3 578373833 577960587 578024368 577642136 576495171 575657845 575644035 575736618 575622673 575435448 575176735
3304.9 575176735 575177917 575298767 574516830 573323212 572462883 572007713 571558266 571159019 570988426 570643158
3314.6 570643158 571024055 571406593 571126556 570514603 569755325 569411545 568658714 567826614 567530098 567687492
$$ packed form
3247E90485306L357L88527k23008o39991k82135l11318k46506o22825m19922q0872
3256.7E88050613R9526Q7204l55950l59420N2452n188o26221o79092r11103l43017
3266.3E85009804K71187r8420J23368O8207J34544M0169J21040n23376j236077m38309
3276E83472137p96394n89218l07732j75666M95872K16904K07481j52626k00157m81644
3285.6E81688957j107406n60456n16662p96089n73731K0065O06575P23191j63727r46884
3295.3E78373833m13246O3781l82232j146965q37326j3810R2583j13945j87225k58713
3304.9E75176735J182J20850p81937j193618q60329m55170m49447l99247j70593l45268
3314.6E70643158L80897L82538k80037o11953p59278l43780p52831q32100k96516J57394
$$ plain form
3324.2 567687492 567657700 567307930 567107391 566383247 565665894 565255280 564948158 564012756 562995720 562738686
3333.8 562738686 562203865 562089119 562058220 561860657 561556396 560990143 560946693 560593948 559985962 559207726
3343.5 559207726 558007393 556957703 556532822 556558609 556502762 556465797 556204338 555720787 554873619 554113731
3353.1 554113731 553544807 552870827 552573700 552446213 552576447 552236900 551586151 551336060 550769272 549917412
3362.8 549917412 549699402 549833641 548603096 547222099 546856537 546570282 546216469 546101227 546146507
3371.4 546146507 545646286 545318413 544723969 543986015 543743362 542553062 541371460 540799141 540332565
3380.1 540332565 540294533 540598564 540790901 540613899 540249100 539695091 539004936 537949562 537223206 536921234
3389.8 536921234 536540718 536214294 535735741 535931854 536170273 535821266 535338669 534638367 534113083 533669434
$$ packed form
3324.2E67687492k9792l49770k00539p24144p17353m10614l07122r35402j017036k57034
3333.8E62738686n34821j14746l0899j97563l04261n66253m3450l52745o07986p78236
3343.5E59207726j200333j049690m24881K5787n5847l6965k61459m83551q47168p59888
3353.1E54113731n68924o73980k97127j27487J30234l39547o50749k50091n66788q51860
3362.8E49917412k18010J34239j230545j380997l65562k86255l53813j15242M5280
3371.4E46146507n00221l27873n94444p37954k42653j190300j181602n72319m66576
3380.1E40332565l8032L04031J92337j77002l64799n54009o90155j055374p26356l01972
3389.8E36921234l80516l26424m78553J96113K38419l49007m82597p00302n25284m43649
$$ plain form
3399.4 533669434 533521767 533389816 532554283 531878433 531969872 532193947 532048912 531841164 531627350 531012840
3409.1 531012840 530532188 530220680 529499969 528941650 528720703 528767509 528420601 527720222 527417946 527285423
3418.7 527285423 527738266 527304535 526267509 525813560 525037537 524966774 524907913 525202065 526065598 525695839
3428.3 525695839 525201721 525190544 524823494 524422226 524328613 523702011 523203545 523201256 523152351 523266411
3438 523266411 523254967 523672218 524203148 524036179 522794113 521959305 522021523 522282181 522894402 521570549
3447.6 521570549 521179848 521994820 521636047 522161636 522485161 522621422 522355690 521368484 521274452 521244049
3457.3 521244049 521166687 521242371 521917992 522456665 522149391 521913910 522092323 522357216 521841660 521473503
3466.9 521473503 521658020 521756592 521990471 522266884 522362785 522409821 522841873 523038101 522488251 521979790
$$ packed form
3399.4E33669434j47667j31951q35533o75850R1439K24075j45035k07748k13814o14510
3409.1E31012840m80652l11508p20711n58319k20947M6806l46908p00379l02276j32523
3418.7E27285423M52843m33731j037026m53949p76023p0763n8861K94152Q63533l69759
3428.3E25695839m94118j1177l67050m01268r3613o26602m98466k289m8905J14060
3438E23266411j1444M17251N30930j66969j242066q34808O2218K60658O12221j323853
3447.6E21570549l90701Q14972l58773N25589L23525J36261k65732r87206r4032l0403
3457.3E21244049p7362P5684O75621N38673l07274k35481J78413K64893n15556l68157
3466.9E21473503J84517R8572K33879K76413R5901M7036M32052J96228n49850n08461
$$ plain form
3476.6 521979790 521747627 521809120 522284737 522348938 522627258 522999039 522793770 523427277 523449554 523615417
3486.2 523615417 524637718 524281616 523271828 522709007 523382339 523955765 523904686 524483528 525049591
3494.9 525049591 525496750 525501480 525268745 525230980 525355797 525264931 525846138 526637154 525535774 524955444
3504.5 524955444 525561790 526141701 526545143 527729721 528181915 526628304 526624260 526615601 526290855 526836700
3514.2 526836700 527442970 527771072 527711792 528361588 528865929 528604698 528587341 530048065 531030655 529410820
3523.8 529410820 528841209 529347420 529445381 529338341 529957619 530347595 530523911 530979576 531180382 531831245
3533.5 531831245 531668510 532109871 532014618 530761604 531803474 532791252 533250504 533726196 534360657
3542.1 534360657 534315338 534259796 534481430 533703308 533813934 532558098 533054047 534578667 536337395
$$ packed form
3476.6E21979790k32163O1493M75617O4201K78320L71781k05269O33507K2277J65863
3486.2E23615417J022301l56102j009788n62821O73332N73426n1079N78842N66063
3494.9E25049591M47159M730k32735l7765J24817r0866N81207P91016j101380n80330
3504.5E24955444O06346N79911M03442J184578M52194j553611m044q659l24746N45845
3514.2E26836700O06270L28102n9280O49796N04341k61231j7357J460724R82590j619835
3523.8E29410820n69611N06211R7961j07040O19278L89976J76316M55665K00806O50863
3533.5E31831245j62735M41361r5253j253014J041870R87778M59252M75692O34461
3542.1E34360657m5319n5542K21634p78122J10626j255836M95949J524620J758728
$$ plain form
3550.8 536337395 538563194 536292191 535769348 536119537 536577415 538053589 537415085 538180199 538795815
3559.5 538795815 538144798 536977692 538283348 540709991 540658569 542620621 540805664 538671036 538483849
3568.2 538483849 536377907 538801422 540074234 541016960 542361412 542836800 542706184 542502785 543528252
3576.9 543528252 542612343 543144608 544026337 543685951 544558105 545099220 545490608 545524940 548941154 549911079
3586.5 549911079 546015854 547203522 544813118 545742035 547587776 548545990 548853607 547896805 550179405
3595.2 550179405 548058472 548607903 551536751 550343475 551040802 550165482 549917946 551078682 550745811
3603.9 550745811 550772171 552775345 554818382 552662582 555594139 554508286 551021271 557108803 557484398
3612.5 557484398 553108406 555090675 552729340 554777641 558461685 557304611 558297997 556757355
$$ packed form
3550.8E36337395K225799k271003n22843L50189M57878J476174o38504P65114O15616
3559.5E38795815o51017j167106J305656K426643n1422J962052j814957k134628j87187
3568.2E38483849k105942K423515J272812R42726J344452M75388j30616k03399J025467
3576.9E43528252r15909N32265Q81729l40386Q72154N41115L91388L4332L416214R69925
3586.5E49911079l895225J187668k390404R28917J845741R58214L07617r56802K282600
3595.2E50179405k120933N49431K928848j193276O97327q75320k47536J160736l32871
3603.9E50745811K6360K003174K043037k155800K931557j085853l487015O087532L75595
3612.5E57484398m375992J982269k361335K048301L684044j157074R93386j540642
$$ plain form
3620.3 556757355 554923706 556324921 557666016 558628311 559109039 559047699 559343643 564768410 567056351
3628.9 567056351 554543724 555309410 557933578 562217560 563484039 559581909 559814224 561224022
3636.6 561224022 561935158 561420898 561941719 563676262 565506744 565463409 563793907 564415436 566177139
3645.3 566177139 570120773 567914696 563306160 568451843 567216568 563367424 560779953 563357506
3653 563357506 565952988 568408546 573270416 565613785 563818626 567377663 567452507 567527924 567308540
3661.7 567308540 567856255 568057518 568786163 569470406 568751831 571219139 572316551 570357170 571862755
3670.4 571862755 565313606 563655319 569263840 577463837 583567619 567898064 563698730 568010406
3678.1 568010406 571869278 570388870 568730392 569887199 570367470 571119308 571584282 571223640 574120674
$$ packed form
3620.3E56757355j833649J401215J341095R62295M80728o1340K95944N424767K287941
3628.9E67056351j2512627P65686K624168M283982J266479l902130K32315J409798
3636.6E61224022P11136n14260N20821J734543J830482m3335j669502O21529J761703
3645.3E66177139L943634k206077m608536N145683j235275l849144k587471K577553
3653E63357506K595482K455558M861870p656631j795159L559037P4844P5417k19384
3661.7E67308540N47715K01263P28645O84243p18575K467308J097412j959381J505585
3670.4E71862755o549149j658287N608521Q199997O103782j5669555m199334M311676
3678.1E68010406L858872j480408j658478J156807M80271P51838M64974l60642K897034
$$ plain form
3686.8 574120674 581123695 576625671 568240051 573761063 570021439 566761246 570829849 571776581
3694.5 571776581 572502518 571938744 571454659 572416267 571446419 572852669 576559677 572766228 567771263
3703.2 567771263 570269394 571536674 571498985 571440353 572635155 576475067 569854050 571445847 578902550
3711.9 578902550 568225555 568506432 571725540 571441536 571285782 572691040 573928185 571620941 570885124
3720.5 570885124 575602760 574044991 567186813 570364418 571787529 571823502 569790154 568113480 570585747
3729.2 570585747 570992050 576238480 575687370 567259941 573902359 576016273 568445702 567988129 568443375
3737.9 568443375 566919899 568783798 572049561 568959465 570636292 582429695 582064743 558780022
3745.6 558780022 564071884 569001770 574711494 574717751 563542480 572266083 570799675 562475662 565668144
$$ packed form
3686.8E74120674P003021m498024q385620N521012l739624l260193M068603R46732
3694.5E71776581P25937n63774m84085R61608r69848J406250L707008l793449m994965
3703.2E67771263K498131J267280l7689n8632J194802L839912o621017J591797P456703
3711.9E78902550j0676995K80877L219108k84004j55754J405258J237145k307244p35817
3720.5E70885124M717636j557769o858178L177605J423111L5973k033348j676674K472267
3729.2E70585747M06303N246430n51110q427429O642418K113914p570571m57573M55246
3737.9E68443375j523476J863899L265763l090096J676827J1793403l64952k3284721
3745.6E58780022N291862M929886N709724O257j1175271Q723603j466408q324013L192482
$$ plain form
3754.3 565668144 568543816 571945267 568695946 569041786 573653603 569245262 566336365 568635368
3762 568635368 569726143 569846306 573115158 572081909 567315025 568091698 571316719 573016281 566775627
3770.7 566775627 566514130 568274307 568431664 569051476 568592834 569427719 569691887 570970688 571521454
3779.4 571521454 565295677 565878868 567465439 567886620 570029030 568220787 566982231 567451019 567559204
3788 567559204 568401413 568042679 567928619 567691803 567500305 566598053 567013054 570949631 568647499 563902855
3797.7 563902855 564959259 568278809 573553963 570355301 561370201 561711044 562648468 565757141 571937370
3806.4 571937370 566636391 560276527 563535614 565596390 566244164 566524925 565554123 565109215 569267807
3815.1 569267807 571229668 558543434 559721680 564170532 568782806 573576584 560664177 558854523
$$ packed form
3754.3E65668144K875672L401451l249321L45840M611817m408341k908897K299003
3762E68635368J090775J20163L268852j033249m766884P76673L225021J699562o240654
3770.7E66775627k61497J760177J57357O19812m58642Q34885K64168J278801N50766
3779.4E71521454o225777N83191J586571M21181K142410j808243j238556M68788J08185
3788E67559204Q42209l58734j14060k36816j91498r02252M15001L936577k302132m744644
3797.7E63902855J056404L319550N275154l198662q985100L40843R37424L108673O180229
3806.4E71937370n300979o359864L259087K060776O47774K80761r70802m44908M158592
3815.1E69267807J961861j2686234J178246M448852M612274M793778j2912407j809654
$$ plain form
3822.8 558854523 562118874 563326988 565480843 565799942 562213821 561698380 561985550 563890877 566181030
3831.4 566181030 559122696 559881706 566186600 562005157 559649544 567068939 563571396 557985001
3839.2 557985001 563630867 559079819 558790359 565428276 563639221 559040413 560732422 562552223
3846.9 562552223 562057190 563189507 561878433 561850433 567226677 563604698 566718788 556149979 551503334
3855.6 551503334 559385948 559137611 557204628 559514885 561672974 563887939 559301796 557613907
3863.3 557613907 563448410 560145683 553948021 555685501 559329224 566703835 565058250 554518890
3871 554518890 554338455 558400688 563378525 556527176 554799614 557993126 558163185 558917122 563091812
3879.7 563091812 561226006 553384590 556990204 558291855 559131241 565004807 555768356 553786125
$$ packed form
3822.8E58854523L264351J208114K153855L19099l586121n15441K87170J905327K290153
3831.4E66181030p058334P59010O304894m181443k355613P419395l497543n586395
3839.2E57985001N645866m551048k89460O637917j789055m598808J692009J819801
3846.9E62552223m95033J132317j311074k8000N376244l621979L114090j0568809m646645
3855.6E51503334P882614k48337j932983K310257K158089K214965m586143j687889
3863.3E57613907N834503l302727o197662J737480L643723P374611j645585j0539360
3871E54518890j80435M062233M977837o851349j727562L193512J70059P53937M174690
3879.7E63091812j865806p841416L605614J301651Q39386N873566r236451j982231
$$ plain form
3887.4 553786125 556698265 556843338 559732018 560370102 553740158 553879471 556649818 555631599 555951805
3896.1 555951805 556064262 557478828 560136948 552618828 555244408 557754517 552675400 556926231
3903.8 556926231 555856361 553320122 553856392 553912277 555563736 555451241 555262642 554932098 554599533
3912.5 554599533 554673004 553995895 555206795 557411842 555256310 551076431 553622627 555033684 551517830
3921.1 551517830 552533455 553729210 555203476 554373550 550709000 551558456 552568054 553530426 552766190
3929.8 552766190 551716385 553140144 551580734 550403175 550892754 550815125 551426430 552324257 551989326
3938.5 551989326 551382484 551109161 552248497 554084206 551270103 550254173 551036453 551515274 553002205
3947.2 553002205 551097717 551199341 551408768 548797569 549607353 550422897 550419044 550389290 550067139 549750633
$$ packed form
3887.4E53786125K912140J45073K888680O38084o629944J39313K770347j018219L20206
3896.1E55951805J12457J414566K658120p518120K625580K510109n079117M250831
3903.8E56926231j069870k536239N36270N5885J651459j12495j88599l30544l32565
3912.5E54599533P3471o77109J210900K205047k155532m179879K546196J411057l515854
3921.1E51517830J015625J195755J474266q29926l664550Q49456J009598R62372p64236
3929.8E52766190j049805J423759j559410j177559M89579p7629O11305Q97827l34931
3938.5E51989326o06842k73323J139336J835709k814103j015930P82280M78821J486931
3947.2E53002205j904488J01624K09427k611199Q09784Q15544l853k9754l22151l16506
$$ plain form
3956.8 549750633 548914795 548798485 548970680 549239349 549178810 548204575 548197174 548770599 548703423 548867874
3966.5 548867874 548797913 548716469 548513908 547760353 548500137 548692322 547419472 546923676 547056465 547130699
3976.1 547130699 547210770 547787933 547329903 546748161 547183647 547268753 547405663 547573471 547285004 546655731
3985.7 546655731 546332169 546250000 546663666 546895256 546030045 545648842 545483131 545614586 546304741 546052322
3995.4 546052322 545042648 544885750 545365372 545366325 545151138
4000.2 545151138
$$ packed form
3956.8E49750633q35838j16310J72195K68669o0539r74235p401N73425o7176J64451
3966.5E48867874o9961q1444k02561p53555P39784J92185j272850m95796J32789P4234
3976.1E47130699Q0071N77163m58030n81742M35486Q5106J36910J67808k88467o29273
3985.7E46655731l23562q2169M13666K31590q65211l81203j65711J31455O90155k52419
3995.4E46052322j009674j56898M79622R53k15187
4000.2E45151138
##END=$$ End of the data block
