##TITLE=Sample description $$ Begin of the data block
##JCAMP-DX=5.00 $$ ACD/SpecManager v 10.08
##SPECTROMETER/DATA SYSTEM=Alpha
##DATE=03 Jun 2014 08:27:10
##DATA TYPE=INFRARED SPECTRUM
##DATA CLASS=XYDATA
##ORIGIN=
##OWNER=
##NPOINTS=1765
##FIRSTX=399.75695801
##LASTX=3997.56933594
##MAXX=3997.56933594
##MINX=399.75695801
##MAXY=0.64607227
##MINY=0.24952386
##XFACTOR=1.0000000000
##YFACTOR=1.000000000000000e-9
##FIRSTY=0.60343349
##DELTAX=2.03957629
##XUNITS=1/CM
##YUNITS=ARBITRARY UNITS
##XYDATA=(X++(Y..Y))
399.8F03433490N77688m19557r61900L58462J898766J591265j24395q48114J57237
418.1F05662942J081049l2961j423359j038432K03252L06904p48932j394928m53949
436.5F02161586J090110J274109r6560q03947N70893J956045R53317j302063j654864
454.8F04148626K94030J675546J48833k108216k146364j66773J007318n15461k762258
473.2E99575281k068758O64055J665354j48475j977444r83297J366972J565934p37965
491.5E98921657k333522r55642J356364J304090j101494k425492q43346J194894P51555
509.9E95869064j584172k619386j081884Q02100K75552j765906k067447K29239K312422
528.3E90369582J661420k63751m84943J368880K689660J708269k60949p46369N26309
$$ plain form
399.8 603433490 604011178 603591621 602629721 602988183 604886949 606478214 606353819 605505705 605662942
418.1 605662942 606743991 606711030 605287671 604249239 604452491 604759395 604010463 602615535 602161586
436.5 602161586 603251696 604525805 604429245 603625298 604196191 606152236 607105553 605803490 604148626
454.8 604148626 604442656 606118202 606267035 604158819 602012455 601845682 602853000 602337539 599575281
473.2 599575281 597506523 598170578 599835932 599687457 597710013 596726716 598093688 599659622 598921657
491.5 598921657 596588135 595632493 596988857 598292947 597191453 594765961 593922615 595117509 595869064
509.9 595869064 594284892 591665506 590583622 591385722 591661274 589895368 587827921 588057160 590369582
528.3 590369582 592031002 591767251 591282308 592651188 595340848 597049117 596788168 596041799 596568108
546.6E96568108J340627K60055j465737j700283l84450L69192o76096k180934k075076
565E90055406o93440j31011r03666j554966q69036O38008J357853P97689L43442J044870
585.4E90085149J901924J600683M02093l38614p570M74990K34008n03660q82685l82542
605.8E92583776L47197K92480j70231J8477P17104J196563J170695R84966J275361
624.1E98416388J743257J553714Q22187L06427L54469N35786L27349m8220o9857K53082
644.5F04194582M99844L93331J5438m6432L40759M65990Q3684k69770j54257K07543
664.9F05730712N35906L63529j32144J19507O51002O82116J00136k55406J36435O82831
685.3F08614624O10113j6690m25875k32816O5208l09467j165212j414835q28862k23100
$$ plain form
546.6 596568108 597908735 598168790 596703053 595002770 594618320 594987512 594311416 592130482 590055406
565 590055406 589361966 589230955 588327289 586772323 585903287 586541295 587899148 588696837 589040279 590085149
585.4 590085149 591987073 593587756 593989849 593651235 593643665 594118655 594352663 593849003 592966318 592583776
605.8 592583776 592930973 593223453 593053222 593071699 593788803 594985366 596156061 597141027 598416388
624.1 598416388 600159645 601713359 602535546 602841973 603196442 603732228 604059577 604011357 603941500 604194582
644.5 604194582 604694426 605087757 605103195 605056763 605397522 605863512 605947196 605677426 605523169 605730712
664.9 605730712 606266618 606630147 606498003 606617510 607268512 607950628 608050764 607795358 607931793 608614624
685.3 608614624 609224737 609208047 608782172 608549356 608614564 608305097 607139885 605725050 604896188 604673088
705.7F04673088j02401k53797r119R58264J800000J657248J064181J048029J670301
724F12505794K135098J743674Q31365M74215Q41677J063764N50509k55585n82457m42802
744.4F18865252n81027j301944k010643k098084j576423j077354j050353j034260m09365
762.8F07725799P29442J599729J729250J646101J857460K157926K216637J961649J665652
781.2F23289645J589596J561582J347363J059294R38117J050175J318275J571715J679421
799.5F35405183J736581J822591J779854J461864J087427R03547P91907O08683L43263
817.9F45940900J31368%l67283j070142j732051k061248k104938k141893k384186k477884
838.3F31732643k032400j385331j072466j057148q90911m07695P0810J79052j08361
$$ plain form
705.7 604673088 604570687 604316890 604307771 605266035 607066035 608723283 609787464 610835493 612505794
724 612505794 614640892 616384566 617215931 617690146 618531823 619595587 620146096 619890511 619308054 618865252
744.4 618865252 618284225 616982281 614971638 612873554 611297131 610219777 609169424 608135164 607725799
762.8 607725799 608455241 610054970 611784220 613430321 615287781 617445707 619662344 621623993 623289645
781.2 623289645 624879241 626440823 627788186 628847480 629785597 630835772 632154047 633725762 635405183
799.5 635405183 637141764 638964355 640744209 642206073 643293500 644197047 644988954 645597637 645940900
817.9 645940900 646072268 646072268 645704985 644634843 642902792 640841544 638736606 636594713 634210527 631732643
838.3 631732643 629700243 628314912 627242446 626185298 625294387 624886692 624957502 625136554 625028193
856.6F25028193k94149K61843J326442J963854J915395J854539K151728K270579J660943
875F38139367N89430j32501j97172j96397p97033j851440k433896k011061j279533
893.3F29829764j212120j703500j887322j469493j115620j536012k461373k917409
909.6F15526915k611936k305150k624929l188669l094673k121747j084328q26060j159430
928E96509993j050413p7188Q46386Q74043N39958Q98898K015114K793908K280950Q71242
948.4F06502891k98560q12888j263082k262771l460467l935099l569662l290236l835500
966.8E83774626m717648m930138m422784m016698m242897m665792m413187l385186
983.1E48980296k397001k081573k112687j735389q34048j69873l12984p47502o88016
$$ plain form
856.6 625028193 624734044 624995887 626322329 628286183 630201578 632056117 634207845 636478424 638139367
875 638139367 638728797 638596296 638399124 638202727 637405694 635554254 633120358 631109297 629829764
893.3 629829764 628617644 626914144 625026822 623557329 622441709 620905697 618444324 615526915
909.6 615526915 612914979 610609829 607984900 604796231 601701558 599579811 598495483 597669423 596509993
928 596509993 595459580 595382392 596228778 597102821 597642779 598541677 600556791 603350699 605631649 606502891
948.4 606502891 606204331 605391443 604128361 601865590 598405123 594470024 590900362 587610126 583774626
966.8 583774626 579056978 574126840 569704056 565687358 561444461 556778669 552365482 548980296
983.1 548980296 546583295 544501722 542389035 540653646 539819598 539649725 539336741 538589239 537901223
1001.4E37901223k10345m6611n55754j237750j385569r75549n79060o10828q48770
1019.8E31450987o64354n364M44770L10957n7995j64211J9431K8611m30227r76324
1040.2E29956281j008928m69088R5129K76446L26336P08222J411736J950622K001702
1058.5E35248458J788676J776397K006293J869976Q37446p63357k050817k425432k061785
1076.9E36225855j522600j013995m48167J99139P61330J001835R52661R14097J022279
1095.2E38092434J027227P27534L32832J35959K08079L92080M61876L82126L36945
1113.6E42097092M56750N76615N31137L96312L24249L84211N58794Q00669Q54433N64992
1134E47545254J04845m32551r88603j435756j744509j877248j747430j475632j244724
$$ plain form
1001.4 537901223 537690878 537644267 537088513 535850763 534465194 533489645 532910585 532299757 531450987
1019.8 531450987 530786633 530781269 531226039 531536996 531479001 531314790 531334221 531362832 530932605 529956281
1040.2 529956281 528947353 528478265 528573394 528849840 529176176 529884398 531296134 533246756 535248458
1058.5 535248458 537037134 538813531 540819824 542689800 543527246 542763889 540713072 538287640 536225855
1076.9 536225855 534703255 533689260 533241093 533440232 534201562 535203397 536156058 537070155 538092434
1095.2 538092434 539119661 539847195 540180027 540315986 540524065 540916145 541378021 541760147 542097092
1113.6 542097092 542553842 543130457 543661594 544057906 544382155 544766366 545325160 546125829 546980262 547545254
1134 547545254 547650099 547217548 546228945 544793189 543048680 541171432 539424002 537948370 536703646
1152.4E36703646r99868o71148k77340J83522O45697J060427J507103K051175K630770
1170.7E42833984L096938L329754L352821L316819L246546L002763K521038J914501
1187E66615164J370848R45031N17368N2214k82168l70503j97410J04010L40819N45800
1207.4E69641173P98762J083493J231968J057089O85870L51549P6174j92523m64320
1225.8E74269235o98149p87139o98030n46813m64678m43160l61443j47939Q4102J77444
1246.2E70383430J59978J54198K27153L00348K45511J21475Q1658J37508J99675J92225
1266.6E72203159J13190N6266O8665P8738L934j46747k73943l17335l42667m14551
1287E71028709n35965o50107o83308o51956o28411o07551n10633l10838r6082Q106
$$ plain form
1152.4 536703646 535703778 535032630 534755290 534938812 535584509 536644936 538152039 540203214 542833984
1170.7 542833984 545930922 549260676 552613497 555930316 559176862 562179625 564700663 566615164
1187 566615164 567986012 568931043 569448411 569500625 569218457 568847954 568650544 568754554 569095373 569641173
1207.4 569641173 570439935 571523428 572755396 573812485 574498355 574849904 574926078 574733555 574269235
1225.8 574269235 573571086 572783947 572085917 571539104 571074426 570631266 570269823 570121884 570205986 570383430
1246.2 570383430 570543408 570697606 570924759 571225107 571470618 571592093 571673751 571811259 572010934 572203159
1266.6 572203159 572316349 572372615 572441280 572520018 572523952 572377205 572103262 571785927 571443260 571028709
1287 571028709 570492744 569842637 569159329 568507373 567878962 567271411 566760778 566449940 566353858 566361964
1307.4E66361964m6253k17915m14372n95510p11858p79331r56356j135588j147806
1325.7E60356975j092792j085758j106084j078844r07778m69387j9312r1731m08113
1344.1E54097176m79222m22477m32313n66721o80029p16091p85648o78540l22282l93212
1364.5E48620641p64787o49810m86553l35216N3823P3731o1751q1300k81215j66059
1384.9E45921504P94709J153887J94191k09331M3094j17421j86622m20630p95663o07132
1405.3E45770586o05524o75678m49062n99980j079142n08666Q60274M27961k48551
1423.6E42892218k39015l03209K05040K43902m16040M50313J347244J87397k98977
1442E44068873k82347m10736j70946k93791j056850j424253L75390K269089K17080
$$ plain form
1307.4 566361964 566315711 566097796 565683424 565087914 564376056 563596725 562640369 561504781 560356975
1325.7 560356975 559264183 558178425 557072341 555993497 555085719 554616332 554597020 554505289 554097176
1344.1 554097176 553617954 553195477 552763164 552196443 551516414 550800323 550014675 549336135 549013853 548620641
1364.5 548620641 547855854 547206044 546719491 546384275 546438098 546511829 546450078 546368778 546087563 545921504
1384.9 545921504 546716213 547870100 548064291 547854960 547898054 547780633 547594011 547173381 546377718 545770586
1405.3 545770586 545165062 544489384 544040322 543440342 542361200 541852534 542712808 543140769 542892218
1423.6 542892218 542653203 542349994 542555034 542798936 542382896 542833209 544180453 544367850 544068873
1442 544068873 543786526 543375790 543204844 542911053 541854203 540429950 540805340 543074429 543291509
1460.3E43291509o31094J103521J838147M33266P06613L505707M433751K950073K137720
1478.7E59769213K254307K467752K018869J938462L069639L501714J707017J233280
1495E77960253K839386K720177O64771q55327P10547M881203K838791j15693j35958
1513.4E91508150M65393P66576O79671J918316J883447P71761P25150l00645k74897
1531.7E98142922J231432k87593j697301J700401L481090J070201j06275o57439n39005
1550.1F02338433n06282r68635j385808K096534M863322n10216k152145j209974q3745
1568.4F02481484O83248j211881j386821J327812L96431j666904j470327j079798j206398
1586.8E96866846j414835j672507j859903j913607k126873k489566k667189k739728
$$ plain form
1460.3 543291509 542660415 543763936 545602083 546035349 546741962 550247669 554681420 557631493 559769213
1478.7 559769213 562023520 564491272 566510141 568448603 571518242 575019956 576726973 577960253
1495 577960253 580799639 583519816 584184587 583329260 584039807 588921010 591759801 591644108 591508150
1513.4 591508150 591973543 592740119 593419790 595338106 597221553 597993314 598718464 598417819 598142922
1531.7 598142922 599374354 599086761 597389460 599089861 602570951 603641152 603534877 602877438 602338433
1550.1 602338433 601832151 600863516 599477708 601574242 606437564 605927348 603775203 602565229 602481484
1568.4 602481484 603164732 601952851 600566030 601893842 602290273 600623369 599153042 598073244 596866846
1586.8 596866846 595452011 593779504 591919601 590005994 587879121 585389555 582722366 579982638
1603.1E79982638k956688l095746l100455l532350m263997l482878j981259l201306
1619.4E54367959l938972k671421k273500k404749k368689l147840k507687O77586
1635.7E35732687Q54492j388490j887084j457691Q47399J605690j586616O45876O495118
1654.1E39861381J839221j437962k29598K046049K345920M59909J441062L472328K086878
1672.4E51885188K467394L579020J314402l45111J980066P028520M572332R98676J071811
1690.8E74552298M11927J828492L325939L432632N287945K392471J012504K502799
1707.1E94747007J475572J85907m2796J294255M612744L924847K57373O735Q77023
1725.5F07338667N12481j62542j67430L372550L958762j23084J81735J310587M62294
$$ plain form
1603.1 579982638 577025950 573930204 570829749 567297399 563033402 559550524 557569265 554367959
1619.4 554367959 550428987 547757566 545484066 543079317 540710628 537562788 535055101 535732687
1635.7 535732687 536587179 535198689 533311605 531853914 532701313 534307003 532720387 533366263 539861381
1654.1 539861381 541700602 540262640 540033042 542079091 544425011 544884920 546325982 549798310 551885188
1672.4 551885188 554352582 557931602 559246004 558900893 560880959 567909479 572481811 573480487 574552298
1690.8 574552298 574964225 576792717 580118656 583551288 588839233 591231704 592244208 594747007
1707.1 594747007 596222579 596408486 596365690 597659945 602272689 606197536 606454909 606461644 607338667
1725.5 607338667 607851148 607688606 607521176 610893726 614852488 614729404 614911139 616221726 616684020
1743.8F16684020P8380M59253J872063K042890J2755j31011N12481K98977J124620
1762.2F22954428M43280p17402l66628L13938K060175J754641m80353o21677K32935
1780.5F25573337K76566L48389J17123r90272j56998K042710R45569q19803k38836
1798.9F27097785Q46446N59330l02553m26114P5281N71370K19584k69592p212L6180
1819.3F28400505n79596m66228J97173m6969N64754Q53300o69777r32753k79963q30174
1839.7F26210272j262366N60343J377940l15189q75116o56008n51999m38631k87950
1858F23761296k14994m63545j008749r47177O71029J288533l14951r87470m70102j66237
1878.4F21147633j84179l03447m48644n93960o2049L51131l59118n33879k25067l38673
$$ plain form
1743.8 616684020 616762400 617221653 619093716 621136606 621149361 621018350 621530831 621829808 622954428
1762.2 622954428 623397708 622680306 622313678 622627616 624687791 626442432 625962079 625340402 625573337
1780.5 625573337 625849903 626198292 626315415 625325143 625168145 627210855 628156424 627336621 627097785
1798.9 627097785 627944231 628503561 628201008 627774894 627850175 628421545 628641129 628371537 628364325 628400505
1819.3 628400505 627820909 627354681 627551854 627504885 628069639 628922939 628253162 627320409 627040446 626210272
1839.7 626210272 624947906 625508249 626886189 626571000 625695884 625039876 624487877 624049246 623761296
1858 623761296 623546302 623082757 622074008 621126831 621797860 623086393 622771442 621783972 621313870 621147633
1878.4 621147633 620963454 620660007 620211363 619617403 619555354 619906485 619547367 619013488 618788421 618449748
1898.8F18449748m21048m51743n90146n47647k07424j65821p56561j086355j87754
1917.2F14035249L11553l96430l82424k40802m90427m17591l27646l14117l04699m46617
1937.6F11026049o16193j40608L06547j39117m15027k91169k60949k91109k66254j39654
1958F08772516m3273k54988n37098k95043M0651j58012m11690m36544l94940l14117
1978.4F05967462k86043l49283m83215n49435n38886l17216m1008l71992p40827o18815
1998.8F01670742n21779o26922p40349p49171p15852p63118r40382j038373q69334
2017.1E94705462p77006r11593r98795j036585j040995r63330q94904r01699r64642
2035.5E86215913r85920q37863o29186o39320p42018o95288n56946m43041m22716m77612
$$ plain form
1898.8 618449748 618028700 617576957 616986811 616439164 616231740 616065919 615309358 614223003 614035249
1917.2 614035249 614346802 613950372 613567948 613327146 612836719 612419128 612091482 611777365 611472666 611026049
1937.6 611026049 610409856 610269248 610575795 610436678 610021651 609730482 609469533 609178424 608912170 608772516
1958 608772516 608729243 608474255 607937157 607642114 607682765 607524753 607113063 606676519 606281579 605967462
1978.4 605967462 605681419 605332136 604848921 604299486 603760600 603443384 603402376 603030384 602289557 601670742
1998.8 601670742 601148963 600522041 599781692 599032521 598316669 597553551 596613169 595574796 594705462
2017.1 594705462 593928456 593016863 592018068 590981483 589940488 588977158 588082254 587180555 586215913
2035.5 586215913 585229993 584392130 583762944 583123624 582381606 581686318 581129372 580686331 580263615 579786003
2055.9E79786003m89712m02510l25263k74718k70366l56198l74555k99990k83361l42011
2076.3E76367319l76761l44992k98798l10719l83377l78251k63751k10702k63214l33310
2096.7E73203444l46362k87771k45214k77102l40521l72768l61204l23534l07858l66091
2117.1E69975019m21525l93927l49998l62754m01080l93510l77118l76403l49224l66032
2137.5E66183448m54247m64022l45111k83361l38196l50535k77281k13146j72377j39833
2157.9E63145339j06632l1054K6762K1279L0279R1315J48177J57475J16110O6400R4294
2180.3E63759744J56880J49488J07050J10269J47938J61290J34945J05560J07408J43170
2200.7E65083742J74523J70588J55032J55031J70708J72675J34468O1869L2366O6519
$$ plain form
2055.9 579786003 579296291 578893781 578568518 578293800 578023434 577667236 577292681 576992691 576709330 576367319
2076.3 576367319 575990558 575645566 575346768 575036049 574652672 574274421 574010670 573799968 573536754 573203444
2096.7 573203444 572857082 572569311 572324097 572046995 571706474 571333706 570972502 570648968 570341110 569975019
2117.1 569975019 569553494 569159567 568809569 568446815 568045735 567652225 567275107 566898704 566549480 566183448
2137.5 566183448 565729201 565265179 564920068 564636707 564298511 563947976 563670695 563457549 563285172 563145339
2157.9 563145339 563038707 563007653 563034415 563055694 563085973 563177288 563325465 563482940 563599050 563665450 563759744
2180.3 563759744 563916624 564066112 564173162 564283431 564431369 564592659 564727604 564833164 564940572 565083742
2200.7 565083742 565258265 565428853 565583885 565738916 565909624 566082299 566216767 566278636 566311002 566377521
2221.1E66377521P4565L6538j3352n9128o4551l7015n9605j36554j85251j60396j06335
2243.5E65666437r4473j25885j52230j64688j60158j22070r8229q9049o3360k8014
2263.9E64568281k682k8610p6652n4538J7643K0444m6789j43528k54870l07619k57135
2286.3E63433945k08020k35677k59578k53081k63691l41356m71830n72563n80012n38826
2306.7E59709311m88103l91006l55900n87582q45015o23167j12057Q1182k85566o38783
2327.1E55463314k38895K41935k03014p16328m62473O2168N82576J740098J767099
2345.5E58236480k575338o271005m750073o93977J219690J399279J466632J277923
2361.8E49309611R55522P01785M89772L17633N6803k74956n38290q12232j159489j435757
$$ plain form
2221.1 566377521 566452086 566488624 566475272 566416144 566351593 566314578 566254973 566118419 565933168 565772772 565666437
2243.5 565666437 565571964 565446079 565293849 565129161 564969003 564846933 564748704 564659655 564596295 564568281
2263.9 564568281 564565599 564536989 564460337 564405799 564423442 564443886 564397097 564253569 563998699 563691080 563433945
2286.3 563433945 563225925 562990248 562730670 562477589 562213898 561872542 561400712 560828149 560248137 559709311
2306.7 559709311 559221208 558830202 558474302 557886720 557041705 556418538 556306481 556387663 556102097 555463314
2327.1 555463314 555224419 555466354 555263340 554547012 554084539 554146707 554729283 556469381 558236480
2345.5 558236480 555661142 549390137 544640064 543946087 545165777 546565056 548031688 549309611
2361.8 549309611 550265133 550966918 551456690 551774323 551831126 551556170 551017880 550205648 549046159 547610402
2382.2E47610402j461923j236200q82984o12914n48899o31571o76394o02662n29587
2400.6E40427268n66781o92010p79509p28608o10590o13272p34329q11935p69436o92248
2421E33428550p07090q09014q74162q39412p75278p79032q77500r46402q84295q01325
2441.3E25135040q19146q75116q80956q13961p15852p21455q50260r06229q04186p02620
2461.7E17045259o81936p40350q18967p94590o81102n98014o30498p28726p39872o34909
2482.1E09996295n63860o04093o66142o33418n23269m78924n29348n69046n20170m02629
2502.5E04505396l69907n05626o36041o13272n04196m58717n31078o03318n90205n37306
2522.9D99155730n37097o33866p20739p03454o24896n78969o50078p60973p59452o76901
$$ plain form
2382.2 547610402 546148479 544912279 544029295 543416381 542867482 542235911 541559517 540956855 540427268
2400.6 540427268 539860487 539168477 538388968 537660360 537049770 536436498 535702169 534890234 534120798 533428550
2421 533428550 532721460 531912446 531038284 530198872 529423594 528644562 527767062 526820660 525936365 525135040
2441.3 525135040 524315894 523440778 522559822 521745861 521030009 520308554 519458294 518552065 517747879 517045259
2461.7 517045259 516363323 515622973 514804006 514009416 513328314 512730300 512099802 511371076 510631204 509996295
2482.1 509996295 509432435 508828342 508162200 507528782 507005513 506526589 505997241 505428195 504908025 504505396
2502.5 504505396 504135489 503629863 502993822 502380550 501876354 501417637 500886559 500283241 499693036 499155730
2522.9 499155730 498618633 497984767 497264028 496560574 495935678 495356709 494706631 493945658 493186206 492509305
2543.3D92509305o25818o50019p17550p25389o47008n75781n70059o26475o59883n90563
2563.7D86120760n21600n53876o24657o45727o08831n61804n53369o07014o31273n45293
2584.1D80267316m77016n01841n32091n42193n43774n25146n25624n79417o47872o63519
2604.5D74728823o20604o04898o77824p90894q24690p69525p63595q54373r40144r38476
2624.9D66943800q78930q48263r09686j000136j000882r24676q92490r78321j064480
2643.3D58445936j014053q97438q37862q52376q97080r11713q43614p60675p74979
2661.6D50656146q40277q49664p91967p16895o89685p19011p27802o99908o64592o39110
2682D43317235o58662o95914o80685o17921n92232o29008o73890o86228o65188o49929
$$ plain form
2543.3 492509305 491883487 491233468 490515918 489790529 489143521 488567740 487997681 487371206 486711323 486120760
2563.7 486120760 485599160 485045284 484420627 483774900 483166069 482604265 482050896 481443882 480812609 480267316
2584.1 480267316 479790300 479288459 478756368 478214175 477670401 477145255 476619631 476040214 475392342 474728823
2604.5 474728823 474108219 473503321 472825497 472034603 471209913 470440388 469676793 468822420 467882276 466943800
2624.9 466943800 466064870 465216607 464306921 463306785 462305903 461381227 460488737 459510416 458445936
2643.3 458445936 457431883 456534445 455696583 454844207 453947127 453035414 452191800 451431125 450656146
2661.6 450656146 449815869 448966205 448174238 447457343 446767658 446048647 445320845 444620937 443956345 443317235
2682 443317235 442658573 441962659 441281974 440664053 440071821 439442813 438768923 438082695 437417507 436767578
2702.4D36767578o74635p03305o86199o54429o55859o69152o60896o38366o08146n94378
2722.8D30222213o36816p15494p31170o34760n57005n87821o34283o16699n79119n66334
2743.2D23962712n62191n84364n99384n54800n03957n06819n61893n78701n06967m53592
2763.6D18550044m74274n02318n19186n05328m56900m84317n81533o39379o22034n46009
2784D13218766n07354n79775o74992o88911o47962o27965o84500p79628p99477p37787
2804.4D06490415p10725p61003q13812q37207q14825p88838q27998q61346q45790q19922
2824.8C98408949q32319q82327r12697r09328q67724q33452r39518j124233j149148
2843.1C89958203j039982r89497j037389j091331j073003r91970q96126r47178j170516
$$ plain form
2702.4 436767578 436092943 435389638 434703439 434049010 433393151 432723999 432063103 431424737 430816591 430222213
2722.8 430222213 429585397 428869903 428138733 427503973 426946968 426359147 425724864 425108165 424529046 423962712
2743.2 423962712 423400521 422816157 422216773 421661973 421158016 420651197 420089304 419510603 419003636 418550044
2763.6 418550044 418075770 417573452 417054266 416548938 416092038 415607721 415026188 414386809 413764775 413218766
2784 413218766 412711412 412131637 411456645 410767734 410119772 409491807 408807307 408027679 407228202 406490415
2804.4 406490415 405779690 405018687 404204875 403367668 402552843 401764005 400936007 400074661 399228871 398408949
2824.8 398408949 397576630 396694303 395781606 394872278 394004554 393171102 392231584 391107351 389958203
2843.1 389958203 388918221 387928724 386891335 385800004 384727001 383735031 382838905 381891727 380721211
2861.5C80721211j292228j260132j237482j237839j234085j260250j281947j190752
2877.8C70726496j031816r22114q48263p69288o95437o57409n88626m70459m53353
2896.2C64289731m98653m58926m21196m76956n29945n01543m79609n71191p29681q35865
2916.6C58786166q26270p23213n97894m68075l04312j68740j26362n5939J15692K44439
2937C55875492L14951M41402N34028M93199M25130M38452N04106M98384M08143L44664
2957.4C60277951L64989M11302L53515K10792Q9973J8030Q2731K75255M53025O76453
2977.8C63214016R25988R79513R33111R54955R30727P92444O33418N26995L92049J70499
2998.1C70453715j6033p2420o2555j26928k12520j80036k02805m01080n78731o83397
$$ plain form
2861.5 380721211 379428983 378168851 376931369 375693530 374459445 373199195 371917248 370726496
2877.8 370726496 369694680 368772566 367924303 367155015 366459578 365802169 365213543 364743084 364289731
2896.2 364289731 363791078 363332152 362910956 362434000 361904055 361402512 360922903 360351712 359622031 358786166
2916.6 358786166 357959896 357236683 356638789 356170714 355866402 355697662 355571300 355515361 355631053 355875492
2937 355875492 356190443 356631845 357165873 357659072 358084202 358522654 359026760 359525144 359933287 360277951
2957.4 360277951 360642940 361054242 361407757 361618549 361708522 361726552 361809283 362084538 362537563 363214016
2977.8 363214016 364140004 365119517 366052628 367007583 367938310 368730754 369364172 369891167 370283216 370453715
2998.1 370453715 370437682 370365262 370302707 370175779 369963259 369783223 369580418 369179338 368600607 367917210
3018.5C67917210p46668p12186o74545p35909p23452n24640m62681o94871q61257p82251
3038.9C60998750o88195p41601q45910q44448p43479p45654q23528p87139p58469q14169
3059.3C53206158p96140o63638n85228p02083q51274q38965p39693o30945n65678o25581
3079.7C46206933p26729p94858q11428p48515p28667q04871p77811o46293o26505o36160
3100.1C38905096o20961o70642o51479o13689o98656o94334n09113m31925o07610p77036
3120.5C32629651p81864p19965o43313o65605p08490n77837m77463n08756n89549p07537
3140.9C26249272p26283o30230n46604n02437m93020n75990p05331p02322n99235n83917
3161.3C20183903o31303o43223o21766n65380n44458n92858n73814m85331n41270o62177
$$ plain form
3018.5 367917210 367170542 366458356 365783811 365047902 364324450 363799810 363337129 362642258 361781001 360998750
3038.9 360998750 360310555 359568954 358723044 357878596 357135117 356389463 355565935 354778796 354020327 353206158
3059.3 353206158 352410018 351746380 351161152 350459069 349607795 348768830 348029137 347398192 346832514 346206933
3079.7 346206933 345480204 344685346 343873918 343125403 342396736 341591865 340814054 340167761 339541256 338905096
3100.1 338905096 338284135 337613493 336962014 336348325 335649669 334955335 334446222 334014297 333406687 332629651
3120.5 332629651 331847787 331127822 330484509 329818904 329110414 328532577 328055114 327546358 326956809 326249272
3140.9 326249272 325522989 324892759 324346155 323843718 323350698 322774708 322069377 321367055 320767820 320183903
3161.3 320183903 319552600 318909377 318287611 317722231 317177773 316584915 316011101 315525770 314984500 314322323
3181.7C14322323n93067n07682n61387n89877o11663o14792m83990m32819n71221o44147
3202.1C08711678o20991o34968n76377n00113n37276n54741n33223m77284m57049n86569
3222.5C03233087o60956n49018m16994l83318m37438n49645o37531o35773n90950m77850
3242.9B97893614l35485m25965o33180n91427l95864l57777m64201m82380m33296m13388
3263.3B93360651l99977l93570l76016l84807m26203m58837n15819n41478n00232m95255
3283.7B88868457m96805m23729l03358k36988l64006n58853o13540n62489m20541l16709
3304.1B84571439m46707o53684p16895o38902n69970o06894o28471n55605n05626n55039
3324.5B78693646o26415o43849o52880o36428m94719l93331n77450p99477p96109p37906
$$ plain form
3181.7 314322323 313729256 313221574 312660187 312070310 311458647 310843855 310359865 309927046 309355825 308711678
3202.1 308711678 308090687 307455719 306879342 306379229 305841953 305287212 304753989 304276705 303819656 303233087
3222.5 303233087 302572131 302023113 301606119 301222801 300785363 300235718 299598187 298962414 298371464 297893614
3242.9 297893614 297558129 297132164 296498984 295907557 295511693 295153916 294689715 294207335 293774039 293360651
3263.3 293360651 292960674 292567104 292191088 291806281 291380078 290921241 290405422 289863944 289363712 288868457
3283.7 288868457 288371652 287947923 287644565 287407577 287043571 286484718 285871178 285308689 284888148 284571439
3304.1 284571439 284124732 283471048 282754153 282115251 281545281 280938387 280309916 279754311 279248685 278693646
3324.5 278693646 278067231 277423382 276770502 276134074 275639355 275246024 274668574 273869097 273072988 272335082
3344.9B72335082o47366n43982o40034p95543p57873o63937o60687o75589n92083l88503
3365.3B65969485l30418n98878q87781q52526o52194n63860o30319p19934o32346m74781
3385.7B59626448m43458m23223l70920m92960n39959l08394k59161m86612o24001n39035
3406.1B55138725m05103l95805m52369n01752n47439m09812j33276j38729l46393l09288
3426.5B51498759j29342j04189j15723r2595k29240m52936m07740k75582j03384L36617
3446.8B49924645K50056l09080l23057j8701J02386P3746P5817J41218J97530K19435
3467.2B50333995K4229j97411r9450Q1956M7058J18643L83526K34455l2276J28001
3487.6B51022726K09958L1382Q8423L16560J07348j55538M37945P54029q1331j82778
$$ plain form
3344.9 272335082 271687716 271143734 270503700 269708157 268950284 268286347 267625660 266950071 266357988 265969485
3365.3 265969485 265639067 265040189 264152408 263299882 262647688 262083828 261453509 260733575 260101229 259626448
3385.7 259626448 259182990 258759767 258388847 257895887 257355928 257047534 256788373 256301761 255677760 255138725
3406.1 255138725 254733622 254337817 253885448 253383696 252836257 252426445 252293169 252154440 251808047 251498759
3426.5 251498759 251369417 251265228 251149505 251056910 250827670 250374734 249966994 249691412 249588028 249924645
3446.8 249924645 250174701 249865621 249542564 249523863 249626249 249699995 249775812 249917030 250114560 250333995
3467.2 250333995 250358224 250160813 250061363 250143319 250190377 250309020 250692546 250927001 250894725 251022726
3487.6 251022726 251232684 251264066 251352489 251669049 251776397 251620859 252058804 252812833 252731502 252548724
3508B52548724N54741M85539o55p5758m2885P808M18424O59645N28395O57559M35471
3530.5B56177008j61797Q3000O64174L08335l66449j19955J067848J467406J26571
3548.8B59246141k17736P79033M90963k04772L5912j95652j126200O27547M422278
3567.2B63857514K996266r89646j152277K34246O74635O16223k07156j336813M97550
3585.5B65190542M445791K654821j385957k66254J743942J163632R92238Q06570j047879
3603.9B74297446q68380K238959K848625J334369L31551n76406K472639M968792Q3744
3622.2B87131339m793167k628416P546187Q998483j56700j564920K60085N81264O13868
3640.6B95988023j062602l113895M69476J0211557R761423j409769k096832L853977
$$ plain form
3508 252548724 253103465 253589004 253588349 253512591 253469706 253477514 253895938 254555583 255083978 255741537 256177008
3530.5 256177008 256015211 256098211 256762385 257070720 256704271 256584316 257652164 259119570 259246141
3548.8 259246141 259028405 259807438 260298401 260093629 260129541 259933889 258807689 259435236 263857514
3567.2 263857514 266853780 265864134 264711857 264946103 265620738 266236961 266029805 264692992 265190542
3585.5 265190542 269636333 272291154 270905197 270638943 272382885 273546517 274538755 275345325 274297446
3603.9 274297446 273429066 275668025 278516650 279851019 280182570 279606164 282078803 287047595 287131339
3622.2 287131339 282338172 279709756 287255943 296254426 296097726 294532806 294792891 295374155 295988023
3640.6 295988023 294925421 291811526 292281002 302492559 312253982 310844213 308747381 312601358
3656.9C12601358K368301m99040l21358j864017j754403M637033M971355k12401P054776
3675.3C26981604Q485496p91401k798467l251583l649056K471924R900093N574435
3691.6C42923045j522332k687812j814813L33280L669917J528621l735095l288329
3707.9C35406482L403425Q672446K422035m426986l598571m54962J242846J862646
3724.2C44529361J424759k469480m560351M4614O726980P286757j596838r660780l885985
3742.6C37839037Q662760K136887l759206O675303O292552m365236m897952J200974
3758.9C49785119J399160k641619j732289M62413K555549L007620j404881l875494
3775.2C47555578j191020K749115J579553r38445J36971K00301q99702j810104k138704
$$ plain form
3656.9 312601358 314969659 314470619 314149261 312285244 310530841 315167874 320139229 319926828 326981604
3675.3 326981604 335467100 334675699 331877232 328625649 324976593 327448517 337348610 342923045
3691.6 342923045 341400713 338712901 336898088 337231368 340901285 342429906 338694811 335406482
3707.9 335406482 338809907 347482353 349904388 345477402 341878831 341423869 342666715 344529361
3724.2 344529361 345954120 343484640 338924289 338968903 345695883 352982640 351385802 341725022 337839037
3742.6 337839037 346501797 348638684 344879478 351554781 357847333 353482097 348584145 349785119
3758.9 349785119 351184279 348542660 346810371 347272784 349828333 352835953 351431072 347555578
3775.2 347555578 346364558 349113673 350693226 349754781 349891752 350092053 349192351 347382247 345243543
3793.6C45243543l65615j007676J69158N966634J332968j168877L276915j771301p259816
3811.9C44415933l253609L633141J073003J650244O109953r03904m031509k280206
3828.2C46413046j881719j060366j555979J202732N892426K926200p23540j333684
3844.6C49879116m604548q771509o109208J0856867J7251342k183914r773612n312413
3860.9C41232121O98864J881063j922339P48337M450947R00089k004087m238009j504839
3879.2C40242147J853079k12789J853973M14699k843797J703710J027733n144656m214734
3897.6C34679365J081109L980905M752576J984358k796292l567547k401083k009780
3913.9C35703611J64122K293318N73099j405567k85149J5647j672417o05405J832873
$$ plain form
3793.6 345243543 344877928 343870252 344039410 350006044 351339012 350170135 353447050 351675749 344415933
3811.9 344415933 341162324 344795465 345868468 347518712 353628665 352724761 348693252 346413046
3828.2 346413046 344531327 343470961 341914982 343117714 349010140 351936340 351212800 349879116
3844.6 349879116 345274568 336503059 330393851 341250718 358502060 356318146 346544534 341232121
3860.9 341232121 341930985 343812048 341889709 342638046 347088993 347989082 345984995 341746986 340242147
3879.2 340242147 342095226 341882437 343736410 344151109 341307312 343011022 344038755 338894099 334679365
3897.6 334679365 335760474 339741379 344493955 346478313 343682021 340114474 337713391 335703611
3913.9 335703611 335867733 338161051 338734150 337328583 337043434 337059081 335386664 334781259 336614132
3932.3C36614132O94781j604706j894235p61002Q72880L35216r29296J41889O47307
3950.6C34116966m21197q56936n77926l83526o6728P2122m74423o98001l31968j91956
3971C30186427j67579l606j42485l96877l06338j84924l38167m65423l04579j66446
3991.4C27710003j81735j66327k73555
3997.5C27088386
$$ plain form
3932.3 336614132 337308913 335704207 333809972 333048970 333921850 334257066 333327770 333469659 334116966
3950.6 334116966 333695769 332838833 332260907 331877381 331810653 331882775 331408352 330710351 330378383 330186427
3971 330186427 330018848 330015242 329872757 329475880 329169542 328984618 328646451 328181028 327876449 327710003
3991.4 327710003 327528268 327361941 327088386
3997.5 327088386
##END=$$ End of the data block
