##TITLE=Sample description $$ Begin of the data block
##JCAMP-DX=5.00 $$ ACD/SpecManager v 10.08
##SPECTROMETER/DATA SYSTEM=Alpha
##DATE=03 Jun 2014 08:26:58
##DATA TYPE=INFRARED SPECTRUM
##DATA CLASS=XYDATA
##ORIGIN=
##OWNER=
##NPOINTS=1765
##FIRSTX=399.75695801
##LASTX=3997.56933594
##MAXX=3997.56933594
##MINX=399.75695801
##MAXY=0.64573151
##MINY=0.25032067
##XFACTOR=1.0000000000
##YFACTOR=1.000000000000000e-9
##FIRSTY=0.60418338
##DELTAX=2.03957629
##XUNITS=1/CM
##YUNITS=ARBITRARY UNITS
##XYDATA=(X++(Y..Y))
399.8F04183376K17080p55668p37965J01984R26375P63595q8155j04070Q42095Q54611
420.2F06203258q92460j849711n35727J173437P84099j193702k077759m81426J496136
438.5F02626145J150608o42180r69410O46352J859010R20474r84251j233638N21899
456.9F03895009J654744j44959k567947k349555N5134J142562m92990k416194j772046
475.2E97003758O17802J435638m31836k111614j008272J452982J828373m98414k346456
493.6E95941961j241505J166463J386821j075924k564072r27627J138210O82890j511633
511.9E92995584k512813j222550N15401K68400j387895j723647J12832J990974J606047
530.3E90642333l1531j95861J454413K626479J668990k85924p96437M08888J199484
$$ y = [604183376, 604400456, 603644788, 602906823, 603008807, 603935182, 604698777, 604610622, 604506552, 605348647, 606203258, 605310798, 603461087, 602925360, 604098797, 604882896, 603689194, 601611435, 601130009, 602626145, 603776753, 603134573, 602165163, 602811515, 604670525, 605590999, 604606748, 603373110, 603895009, 605549753, 605404794, 602836847, 600487292, 600542426, 601684988, 601191998, 598775804, 597003758, 597621560, 599057198, 598625362, 596513748, 595505476, 596958458, 598786831, 598288417, 595941961, 594700456, 595866919, 597253740, 596177816, 593613744, 592686117, 593824327, 594507217, 592995584, 590482771, 589260221, 589775622, 590044022, 588656127, 586932480, 587045312, 589036286, 590642333, 590610802, 590414941, 591869354, 594495833, 596164823, 595878899, 595082462, 595491350, 596690834]
548.6E96690834J00851j661778j677036r3699M97699p43091k051175j873850p95842
567E88392913m04179j087010j559555p74324O25193J343369R09687M44710J011789
585.4E88902593J725852J458049N15580p8440R0480L92139J27614n04792p54833k94149
605.8E91580093K55287J48117j93834O0975P77364J224637J140773J033068J321137
624.1E97347617J692474J533568Q58128L69668L70860M92156L41892K8908K8074L07858
644.5F03371203M12345J77145j44124l5465M29988N43654R0122l15368j15871L47971
664.9F04761600O57619M11570j33813Q7381O43015O99758J23322k16126J47402O24478
685.3F07806206N55157n7995m41313q1777K38538l03805j258195j552224r04977j62125
$$ y = [596690834, 596791685, 595129907, 593452871, 593359172, 593856871, 593113780, 591062605, 589188755, 588392913, 587988734, 586901724, 585342169, 584567845, 585193038, 586536407, 587446094, 587890804, 588902593, 590628445, 592086494, 592602074, 592523634, 592614114, 593006253, 593133867, 592629075, 591874242, 591580093, 591835380, 591983497, 591789663, 591850638, 592628002, 593852639, 594993412, 596026480, 597347617, 599040091, 600573659, 601431787, 601801455, 602172315, 602664471, 603006363, 603035271, 603063345, 603371203, 603783548, 603960693, 603816569, 603781104, 604211092, 604754746, 604844868, 604529500, 604413629, 604761600, 605419219, 605830789, 605696976, 605784357, 606427372, 607127130, 607250452, 607034326, 607181728, 607806206, 608361363, 608303368, 607862055, 607780278, 608018816, 607715011, 606456816, 604904592, 603999615, 603837490]
705.7F03837490j9371k61426r9659Q71479J787484J676619J010239R69410J723528
724F11495793K245664J801372Q92758N23270Q50439J050353N37991l01420p19905n38588
744.4F17837727n06759j173138j983702k114296j533986j022100r99212r28641k79963
762.8F07295930P22766J427293J617670J717866J969218K207100K217412J899302J563192
781.2F22637749J521587J568973J422465J129866R63986J132845J469076J616836J609564
799.5F35072947J720428J835227J688004J369535J094223R09030P82847O74248M57823
817.9F45604312J27197j47403m20808r41873j580417j941383k052486k242744k521753
836.2F33882642k529860k047002j389861j037955r87053q90315n03063P9870L19004
$$ y = [603837490, 603818119, 603556693, 603457034, 604328513, 606115997, 607792616, 608802855, 609772265, 611495793, 613741457, 615542829, 616435587, 616958857, 617809296, 618859649, 619397640, 619096220, 618376315, 617837727, 617330968, 616157830, 614174128, 612059832, 610525846, 609503746, 608504534, 607575893, 607295930, 608018696, 609445989, 611063659, 612781525, 614750743, 616957843, 619175255, 621074557, 622637749, 624159336, 625728309, 627150774, 628280640, 629244626, 630377471, 631846547, 633463383, 635072947, 636793375, 638628602, 640316606, 641686141, 642780364, 643689394, 644472241, 645146489, 645604312, 645731509, 645584106, 645163298, 644221425, 642641008, 640699625, 638647139, 636404395, 633882642, 631352782, 629305780, 627915919, 626877964, 625890911, 625000596, 624497533, 624577403, 624896407]
854.6F24896407j5497k55048K49326J270831J960694J959086J900971K161085K230704
872.9F36358559J609147N32508j97649k24114k07186q85546j874029k294422j930356
891.3F30886912j284182j188099j695395j907587j503110j129627j479149k396345
907.6F18303418k911806k624690k289951k594412l153860l051460k100527j120806
923.9E98455906q88407j168192j014232q0765Q21472R09686N87165Q88884K003849
942.3F00515366K798438K269029Q76487k68341p99775j284539k295494l447771l882468
960.6E94480932l570318l360987l875613m681111m873097m419446m107237m358589
977E61234534m687309m336417l283799k326608k090156k179622j769722q43346j62780
$$ y = [624896407, 624880910, 624625862, 624875188, 626146019, 628106713, 630065799, 631966770, 634127855, 636358559, 637967706, 638500214, 638302565, 638078451, 637871265, 636985719, 635111690, 632817268, 630886912, 629602730, 628414631, 626719236, 624811649, 623308539, 622178912, 620699763, 618303418, 615391612, 612766922, 610476971, 607882559, 604728699, 601677239, 599576712, 598455906, 597567499, 596399307, 595385075, 595304310, 596125782, 597035468, 597622633, 598511517, 600515366, 603313804, 605582833, 606459320, 606190979, 605391204, 604106665, 601811171, 598363400, 594480932, 590910614, 587549627, 583674014, 578992903, 574119806, 569700360, 565593123, 561234534, 556547225, 552210808, 548927009, 546600401, 544510245, 542330623, 540560901, 539717555, 539554775]
995.3E39554775k35975o95765p26342k24352J0908m73083j183271j407862j020133
1013.7E33598900n70953o13332r11534p16865J5915N20944L79801m9651k13980m1783
1034.1E31397462O497m02868r74894j071810n17905J20163L29554L30985O68585J387775
1054.5E31273544J963556K021134J811802J801312J971066J814008Q70347o92427k018750
1072.8E40815592k430201k085387j535535j014352m27246K21431P27415R44436R44376
1091.2E36160529R70363J086414J035273O99520L04044J31130K51233M40479M62234
1109.5E41541219L69549L61681M90546O00755N30422L58879K95341L61383N38767Q15630
1129.9E46264172Q90255N75602P8499m51982r72569j419544j748324j876771j762271
$$ y = [539554775, 539318800, 538623035, 537896693, 537672341, 537683249, 537210166, 536026895, 534619033, 533598900, 533027947, 532414615, 531503081, 530786216, 530802131, 531323075, 531702876, 531653225, 531439245, 531397462, 531403959, 531001091, 530026197, 528954387, 528436482, 528556645, 528886199, 529217184, 529885769, 531273544, 533237100, 535258234, 537070036, 538871348, 540842414, 542656422, 543526769, 542834342, 540815592, 538385391, 536300004, 534764469, 533750117, 533322871, 533544302, 534271717, 535216153, 536160529, 537130892, 538217306, 539252579, 539952099, 540256143, 540387273, 540638506, 541078985, 541541219, 541910768, 542272449, 542762995, 543363750, 543894172, 544253051, 544548392, 544909775, 545448542, 546264172, 547154427, 547730029, 547808528, 547356546, 546383977, 544964433, 543216109, 541339338, 539577067]
1148.3E39577067j492977j223922r88245o81102k60890K04802O39975J066744J532734
1166.6E38374186K055406K599895L053904L324985L399194L366708L250003K964199
1182.9E62388480K497315J931667J385987R22799M93884O8486k58565l80456k27869
1201.3E68821728R6143L61800N38706P57814J043975J229108J117170P38024L32535
1219.7E75037003M7802j71124m29869o79314p73371o96182n41389m43578m18186l33369
1240.1E70598423j34766P0811J44779J15216J30832K40922L33071K77519J27793O8903
1260.4E71973503J34408K16067K25127J36435K8014K980N6863M5657j24991l17454
1280.8E72376609l62873l21329l56972n09024o56068o96719o55353o02960n70953n08368
$$ y = [539577067, 538084090, 536860168, 535871923, 535190821, 534929931, 535134733, 535774708, 536841452, 538374186, 540429592, 543029487, 546083391, 549408376, 552807570, 556174278, 559424281, 562388480, 564885795, 566817462, 568203449, 569126248, 569620132, 569688618, 569430053, 569049597, 568821728, 568917871, 569279671, 569818377, 570576191, 571620166, 572849274, 573966444, 574704468, 575037003, 575084805, 574913681, 574483812, 573804498, 573031127, 572334945, 571793556, 571349978, 570931792, 570598423, 570463657, 570534468, 570679247, 570794463, 570925295, 571166217, 571499288, 571776807, 571904600, 571973503, 572107911, 572323978, 572549105, 572685540, 572713554, 572716534, 572773397, 572819054, 572694063, 572376609, 572013736, 571692407, 571335435, 570826411, 570170343, 569473624, 568818271, 568215311, 567644358, 567135990]
1301.2E67135990l44873j19686J3053n4180k43187m19498n89191o93441p47263r26435
1321.6E63011289j113356j163840j148820j118600j088083j060426r10282m59433R120
1340E54957569r8050m64439n01573l72947l79920n55217o84142p10607p89582p13885
1360.4E49687207l75390m21346p45415o30737m92334l14832J00196R3877q8870j40906
1380.8E46671450l10838j20878Q64148J179099J86920k31802J7762j23084j72674l96252
1401.2E47563851p87974o23881o19293o65128m11451n62489j097202n65589Q77917
1419.5E43108761M91739k36452k64406l61264J55628K66850l62814M80116J342117
1437.9E44620275J51039l29197k70486l97741j91033l18110j059771j409113L92019
$$ y = [567135990, 566791117, 566671431, 566684484, 566630304, 566387117, 565967619, 565378428, 564684987, 563937724, 563011289, 561897933, 560734093, 559585273, 558466673, 557378590, 556318164, 555407882, 554948449, 554957569, 554859519, 554395080, 553893507, 553520560, 553140640, 552585423, 551901281, 551190674, 550401092, 549687207, 549311817, 548890471, 548145056, 547514319, 547021985, 546707153, 546807349, 546901226, 546812356, 546671450, 546360612, 546239734, 547103882, 548282981, 548469901, 548238099, 548255861, 548132777, 547960103, 547563851, 546775877, 546151996, 545532703, 544867575, 544456124, 543893635, 542796433, 542230844, 543108761, 543600500, 543364048, 543099642, 542738378, 542894006, 543160856, 542798042, 543278158, 544620275, 544771314, 544442117, 544171631, 543773890, 543582857, 543264747, 542204976, 540795863, 541187882]
1456.2E41187882K296269K43545o25551J085401J827776M36723P05183L546417M503190
1474.6E55206835K947986K064169K186239K453804K041220J963497L114879L566205
1490.9E75544834J703322J188040K858698K776265O43731r68278N66244M906237L033460
1509.3E92252553l3737j78098M33206P90298O86944J904666J885355P79926P18296
1527.6E99239409l27826k98976J233041k72393j681090J731634L497899J071095j19567
1546F04073226o89327n32627m65036r64641j414657K104819M871964n48184k166092
1564.3F04269445j213491j02639P09116j169264j374841J343131M05431j669407j488507
1582.7E99708974j125395j247287j440346j695216j880943j926601k123297k509355
$$ y = [541187882, 543484151, 543727696, 543102145, 544187546, 546015322, 546452045, 547157228, 550703645, 555206835, 558154821, 560218990, 562405229, 564859033, 566900253, 568863750, 571978629, 575544834, 577248156, 578436196, 581294894, 584071159, 584714890, 583746612, 584312856, 589219093, 592252553, 592218816, 592040718, 592473924, 593264222, 593951166, 595855832, 597741187, 598521113, 599239409, 598911583, 598612607, 599845648, 599573255, 597892165, 599623799, 603121698, 604192793, 604073226, 603383899, 602851272, 602386236, 601421595, 600006938, 602111757, 606983721, 606435537, 604269445, 603055954, 602953315, 603662431, 602493167, 601118326, 602461457, 602866888, 601197481, 599708974, 598583579, 597336292, 595895946, 594200730, 592319787, 590393186, 588269889, 585760534]
1599E85760534k728522k810895l025890l127932l108621l563464m296362l531098k055944
1617.4E57511806l241777l960967k695262k297223k424598k366960l162622k558649
1633.7E34803748O25253Q60810j327157j841485j455963Q39293J618624j581133O54877
1652E33196867O559848J905620j362443j27196K138615K384186M35054J410603L490508
1670.4E50031662K143145K551853L666222J355470l63291J936555P089675M690587
1686.7E73101878J019418J037717M03762J870573L375530L430843N271793K429783
1703E91941297J106203K592206J481712J45435m9889J331687M672050L968179K57194
1721.4F07446074M828Q71718M65274k26319k16722L380120M004121r9063K47419J375436
$$ y = [585760534, 583032012, 580221117, 577195227, 574067295, 570958674, 567395210, 563098848, 559567750, 557511806, 554270029, 550309062, 547613800, 545316577, 542891979, 540525019, 537362397, 534803748, 535429001, 536289811, 534962654, 533121169, 531665206, 532504499, 534123123, 532541990, 533196867, 539756715, 541662335, 540299892, 540172696, 542311311, 544695497, 545130551, 546541154, 550031662, 552174807, 554726660, 558392882, 559748352, 559385061, 561321616, 568411291, 573101878, 574121296, 575159013, 575562775, 577433348, 580808878, 584239721, 589511514, 591941297, 593047500, 595639706, 597121418, 597266853, 597216964, 598548651, 603220701, 607188880, 607446074, 607450902, 608322620, 608787894, 608561575, 608344853, 611724973, 615729094, 615630031, 615877450, 617252886]
1741.8F17252886M46499L1709M49896J929939K097309O973j60217M82857K83957J149356
1762.2F23971164M74096p21932l94165K97665K098561J801490m86850o57201K26557
1780.5F26609385L21627L89993J38938r85622j80066K048135R69529q58307k95043
1798.9F28158569Q53956O15478k72096m36663Q2612N93185K26200k48373Q941J311
1819.3F29583120o27756m67956K34008k8253N35489Q39471o18636q90196k99990q87513
1839.7F27371788j320839N44489J388847l12745q41439n96642n08070m30406l09348
1858F24985635k12192m31955j004934r57907O68228J284122l08990r70364m53651j70171
1878.4F22427821j89781k90155m54128o11723o0737L53933l49522n00560k09033l61979
$$ y = [617252886, 617699385, 617731094, 618180990, 620110929, 622208238, 622215211, 622054994, 622537851, 622821808, 623971164, 624445260, 623723328, 623329163, 623626828, 625725389, 627526879, 627040029, 626382828, 626609385, 626931012, 627321005, 627459943, 626474321, 626294255, 628342390, 629311919, 628453612, 628158569, 629012525, 629628003, 629355907, 628919244, 629001856, 629595041, 629821241, 629572868, 629581809, 629583120, 628955364, 628487408, 628721416, 628693163, 629228652, 630068123, 629449487, 628559291, 628259301, 627371788, 626050949, 626595438, 627984285, 627671540, 626830101, 626233459, 625725389, 625294983, 624985635, 624773443, 624341488, 623336554, 622378647, 623046875, 624330997, 624022007, 623051643, 622597992, 622427821, 622238040, 621947885, 621493757, 620882034, 620821297, 621175230, 620825708, 620325148, 620116115, 619754136]
1898.8F19754136m47214m62830n95391n42343j85430j36375p38263j078546j78516
1917.2F15389228L18706l70681l42667k42949n17249m10557l15547l46124l54529m75466
1937.6F12332165o31869j52409L01361j36375l85165k48790k45810k86698k42889j27256
1958F10176265o8784k63512m95076k66611L1232j67548m21345m42386l83258k92003
1978.4F07406974k70307l60668n18143n83232n43713k97070j6927l65198p69258o37531
1998.8F03044927m89414n81801p39872p94292p31110p27594r18508j025199q44896
2017.1E96192241p87854r47237j017094j046837j033604r30965q59856q58903r47356
2035.5E87762535j032353q94487o41942o19411p28369o79195n22554m42862m59552
$$ y = [619754136, 619306922, 618844092, 618248701, 617706358, 617520928, 617384553, 616646290, 615567744, 615389228, 615707934, 615337253, 614994586, 614751637, 614234388, 613823831, 613508284, 613162160, 612807631, 612332165, 611700296, 611547887, 611849248, 611712873, 611327708, 611078918, 610833108, 610546410, 610303521, 610176265, 610107481, 609843969, 609348893, 609082282, 609113514, 608945966, 608524621, 608082235, 607698977, 607406974, 607136667, 606775999, 606257856, 605674624, 605130911, 604833841, 604816914, 604451716, 603682458, 603044927, 602555513, 601973712, 601233840, 600439548, 599708438, 598980844, 598062336, 597037137, 596192241, 595404387, 594457150, 593440056, 592393219, 591359615, 590428650, 589568794, 588709891, 587762535, 586730182, 585835695, 585193753, 584574342, 583845973, 583166778, 582644224, 582201362, 581741810]
2053.8E81741810m97878m75526l80456l41117k90156k40803l20732l48151k91824l04282
2074.2E78250885l53396l61741l26156k89142l08633l72827l48330k32577k17259k97129
2094.6E75143695l60847l82185l13878k29478k40087k91288l35216l67582l43025l21090
2115E71959019l82543m30763l84032l40820l67939l88503l70801l61442l64006l72827
2135.4E68195343l89218m09305m00424l36349l18945l54171l19540k58148k32994k08796
2155.8E64967453j83582j05977K0445M6730p511K2173J26839J80542J54198J08540
2176.2E65329850R2685J21176J62840J61707J21713R1553J14262J93059K30372J72675
2196.6E66791892J05977J09196J50800J71065J82748J89125J68681J36316J08660Q1241
$$ y = [581741810, 581243932, 580768406, 580387950, 580046833, 579756677, 579515874, 579195142, 578846991, 578555167, 578250885, 577897489, 577535748, 577209592, 576920450, 576611817, 576238990, 575890660, 575658083, 575440824, 575143695, 574782848, 574400663, 574086785, 573857307, 573617220, 573325932, 572990716, 572623134, 572280109, 571959019, 571576476, 571145713, 570761681, 570420861, 570052922, 569664419, 569293618, 568932176, 568568170, 568195343, 567806125, 567396820, 566996396, 566660047, 566341102, 565986931, 565667391, 565409243, 565176249, 564967453, 564783871, 564677894, 564698339, 564745069, 564737558, 564759731, 564886570, 565067112, 565221310, 565329850, 565422535, 565543711, 565706551, 565868258, 565989971, 566081524, 566195786, 566388845, 566619217, 566791892, 566897869, 567007065, 567157865, 567328930, 567511678, 567700803, 567869484, 568005800, 568114460, 568195701]
2217E68195701O1988M7267K2232o973l0041l1471j1087j0252o6042j41024j66595j36316
2241.5E67727387j15633j36554j59800j44482j17838r9361r1076j13845r2924l6716
2261.9E66619158j7107k8610n9426p3194m3869J192R596r060p2181k19941l41416k96711
2286.3E65468431k17677k61962l02017k61605k40564l06845m31895n62012n88358n02586
2306.7E61792910m28796l81767l69490n65231q16762o41763j51873Q8513k76208o54936
2327.1E57594597k22683K63572j88231o96421m74215L1591N94914J797318J801193
2345.5E60501635k599001o310701m752994o55889J268267J455844J500904J218617
2361.8E51626682Q73208P50423N73695K89559L0756k20835n26429r07778j237631j407743
$$ y = [568195701, 568257689, 568304956, 568327188, 568320215, 568290174, 568258703, 568247616, 568237364, 568171322, 568030298, 567863703, 567727387, 567611754, 567475200, 567315400, 567170918, 567053080, 566953719, 566862643, 566748798, 566655874, 566619158, 566602051, 566573441, 566514015, 566440821, 566396952, 566398144, 566407740, 566398680, 566326499, 566106558, 565765142, 565468431, 565250754, 564988792, 564686775, 564425170, 564184606, 563877761, 563445866, 562883854, 562295496, 561792910, 561364114, 560982347, 560612857, 560047626, 559230864, 558589101, 558437228, 558525741, 558249533, 557594597, 557371914, 557635486, 557447255, 556750834, 556276619, 556308210, 556903124, 558700442, 560501635, 557902634, 551591933, 546838939, 546183050, 547451317, 548907161, 550408065, 551626682, 552499890, 553250313, 553824008, 554113567, 554144323, 553923488, 553397059, 552489281, 551251650, 549843907]
2382.2E49843907j419782j236081r02534o64592n95987o24895o52909n76496m77433
2400.6E42693198n21779o63460p30276o94096o57081o89507p64966q25286p84039o83964
2421E35678744p00831q36194q75234p87378p50184q07643r04202r25481q28624p41184
2441.3E27521789p85410q95560r28164q46147p33733p12693p93576q69036q31544p33555
2461.7E19392371o86824p34985q19385p90596o67095o07848o57738p25388o87063n70536
2482.1E12444913n40018o21199o96659o71626n50508m48883m67300n48005n51641m68910
2502.5E06880164m18722m77016n71549n70774m86136m69089n46634o05464n81979n18918
2522.9E01633883n32449o31571p21663p41392o66172n84453o21050p32899p70390o89864
$$ y = [549843907, 548424125, 547188044, 546285510, 545620918, 545024931, 544400036, 543747127, 543170631, 542693198, 542171419, 541507959, 540777683, 540083587, 539426506, 538736999, 537972033, 537146747, 536362708, 535678744, 534977913, 534141719, 533266485, 532479107, 531728923, 530921280, 530017078, 529091597, 528262973, 527521789, 526736379, 525840819, 524912655, 524066508, 523332775, 522620082, 521826506, 520957470, 520125926, 519392371, 518705547, 517970562, 517151177, 516360581, 515693486, 515085638, 514427900, 513702512, 513015449, 512444913, 511904895, 511283696, 510587037, 509915411, 509364903, 508916020, 508448720, 507900715, 507349074, 506880164, 506461442, 505984426, 505412877, 504842103, 504355967, 503886878, 503340244, 502734780, 502152801, 501633883, 501101434, 500469863, 499748200, 499006808, 498340636, 497756183, 497135133, 496402234, 495631844, 494941980]
2543.3D94941980n97448n99592o89179p28637o46919n78553o22123o99222o79136n66363
2563.7D88534808m89414n40822o48499o59287n85615n21631n23805n96881o36935n77331
2584.1D82754588n08159n02855n11944n15610n11766m73886m81814n84305o87480p13408
2604.5D77263361o34908n68688o65367q08805q27104p68334p70241q38339r04441r33319
2624.9D69543815r10700q95679r48339r96501r60916q86887q46803q98838j002163
2643.3D61196989j030892r64701q66533q35985r02802r37283q49515p41243p64251
2661.6D53303784q58188q65370q06421p38114o73264o69271p21454p47741o94632o39290
2682D45890039o63072o73711o24359n84662n82456o26564o98447p27266o90520o40691
$$ y = [494941980, 494344532, 493744940, 493055761, 492327124, 491680205, 491101652, 490479529, 489780307, 489101171, 488534808, 488045394, 487504572, 486856073, 486196786, 485611171, 485089540, 484565735, 483968854, 483331919, 482754588, 482246429, 481743574, 481231630, 480716020, 480204254, 479730368, 479248554, 478664249, 477976769, 477263361, 476628453, 476059765, 475394398, 474585593, 473758489, 472990155, 472219914, 471381575, 470477134, 469543815, 468633115, 467737436, 466789097, 465792596, 464831680, 463944793, 463097990, 462199152, 461196989, 460166097, 459201396, 458334863, 457498878, 456596076, 455658793, 454809278, 454068035, 453303784, 452445596, 451580226, 450773805, 450035691, 449362427, 448693156, 447971702, 447223961, 446529329, 445890039, 445226967, 444553256, 443928897, 443344235, 442761779, 442135215, 441436768, 440709502, 440018982, 439378291]
2702.4D39378291o40154p01248p34270o61313n82576o07252o71804p08729o71774n86331
2722.8D32812840n96673o76482o88971o18815n64396n97030o29932o09904n92351n77420
2743.2D26660866n50956n54472n87672n83202n29796m99934n39660n85169n35130m28975
2763.6D21265900m09365m93794n58734n21571m62442m97848n85675o07461n56082n31971
2784D16040957n57363o09785o86795p01904o33657n87017o47693p70420q02249p36713
2804.4D09307361p14600p69914q21977q23588p89255p75575q15869q71807q94487q72284
2824.8D01158005q37147q28594q69066r37581r37044q59738r05543j083523j123548
2843.1C92776221j041710j041055j076371j048803j005262r87381r59605r91583j160413
$$ y = [439378291, 438738137, 438036889, 437302619, 436641306, 436058730, 435451478, 434779674, 434070945, 433399171, 432812840, 432216167, 431539685, 430850714, 430231899, 429667503, 429070473, 428440541, 427830637, 427238286, 426660866, 426109910, 425555438, 424967766, 424384564, 423854768, 423354834, 422815174, 422230005, 421694875, 421265900, 420856535, 420362741, 419804007, 419282436, 418819994, 418322146, 417736471, 417129010, 416572928, 416040957, 415483594, 414873809, 414187014, 413485110, 412851453, 412264436, 411616743, 410846323, 410044074, 409307361, 408592761, 407822847, 407000870, 406177282, 405388027, 404612452, 403796583, 402924776, 402030289, 401158005, 400320858, 399492264, 398623198, 397685617, 396748573, 395888835, 394983292, 393899769, 392776221, 391734511, 390693456, 389617085, 388568282, 387563020, 386575639, 385616034, 384624451, 383464038]
2861.5C83464038j294285j272142j211732j197934j222104j280844j295507j175106
2877.8C73514384j029491r70602q97378p51943o40124o01470n86420n66423n26399
2896.2C66944134m73439m27336m24236m64767m97431m85301m68582n33640o86646q22484
2916.6C61660272q38369p61748o44713m95166l17037j68830j09047l2931J06305K15888
2937C58614624L14384M46409N16385M88639M69118N17637N47767M63604L67523L51548
2957.4C63097638L69131L75420L24697K44230J65164Q6874J24305K88427M50135O43223
2977.8C66169244Q74430R71407R34660R32396R37014Q45880O97195N29528L48210J65791
2998.1C73405755K4646l0398n1797j37001k44349k33948k09541l63499n60402o74814
$$ y = [383464038, 382169753, 380897611, 379685879, 378487945, 377265841, 375984997, 374689490, 373514384, 372484893, 371514291, 370616913, 369864970, 369224846, 368623376, 368036956, 367470533, 366944134, 366470695, 366043359, 365619123, 365154356, 364656925, 364171624, 363703042, 363169402, 362482756, 361660272, 360821903, 360060155, 359415442, 358920276, 358603239, 358434409, 358325362, 358292431, 358398736, 358614624, 358929008, 359375417, 359891802, 360380441, 360849559, 361367196, 361914963, 362378567, 362746090, 363097638, 363466769, 363842189, 364166886, 364411116, 364576280, 364663154, 364787459, 365075886, 365526021, 366169244, 367043674, 368015081, 368949741, 369882137, 370819151, 371665031, 372362226, 372891754, 373239964, 373405755, 373430401, 373400003, 373348206, 373211205, 372966856, 372732908, 372523367, 372159868, 371599466, 370924652]
3018.5C70924652p39307p13735o65218p12127p31766n88566n08100o62386q11368p75486
3038.9C64016593p01786p38233q21173q38637p66635p63834q31216p73579p28220q13067
3059.3C56240213q39114o95408n36322o40303q96931r10699p48307o49005n88328o06477
3079.7C49129319o90847p40231p82132q11219q23915q40366p34657n79923o16521o76483
3100.1C41833025o46502o68972o58751o23047o90580o95496n29766m42297n92887p82550
3120.5C35502177q21977p64788o73532o31154o22421n49823n45740n71966n85020o81460
3140.9C29054296p21127o84082o35684n01960l89099n20200p54267q13782p12753n73813
3161.3C22747529n06759n49406o26534o54668o30319o16997n79179m70638m87477o40124
$$ y = [370924652, 370185345, 369471610, 368806392, 368094265, 367362499, 366773933, 366265833, 365603447, 364792079, 364016593, 363314807, 362576574, 361755401, 360916764, 360150129, 359386295, 358555079, 357781500, 357053280, 356240213, 355401099, 354705691, 354169369, 353529066, 352632135, 351721436, 350973129, 350324124, 349735796, 349129319, 348438472, 347698241, 346916109, 346104890, 345280975, 344440609, 343705952, 343126029, 342509508, 341833025, 341186523, 340517551, 339858800, 339235753, 338545173, 337849677, 337319911, 336877614, 336284727, 335502177, 334680200, 333915412, 333241880, 332610726, 331988305, 331438482, 330892742, 330320776, 329735756, 329054296, 328333169, 327649087, 327013403, 326511443, 326122344, 325602144, 324847877, 324034095, 323321342, 322747529, 322240770, 321691364, 321064830, 320410162, 319779843, 319162846, 318583667, 318113029, 317625552, 316985428]
3181.7C16985428o52522n76645n82248o06835o40183o67811n68181m54098n02229n86509
3202.1C11148167o08385o18190n90473n78701n75513n19306n43057n69970n27710n70476
3222.5C05446386o31123n74977m31776l36915m38541o27250o63906n93603n55276m60804
3242.9C00132215l16203l93778o15924o31601m54277l59028m33356m95642n05925m90427
3263.3B95436054m28825l86268l71218l94195m26978m41194n11676n65379n11557m58062
3283.7B90940702m83125m76808l27170k37256l95834n79805o26236n90294m61638l70384
3304.1B86392152m45008n76317o71625o88971o76810o85066o70254o27071n47826n00828
3324.5B80302376n80937o90669p40439o84738m80622l70741n65350p87675p95245p24465
$$ y = [316985428, 316332906, 315756261, 315174013, 314567178, 313926995, 313259184, 312691003, 312236905, 311734676, 311148167, 310539782, 309921592, 309331119, 308752418, 308176905, 307657599, 307114542, 306544572, 306016862, 305446386, 304815263, 304240286, 303808510, 303471595, 303033054, 302405804, 301741898, 301148295, 300593019, 300132215, 299816012, 299422234, 298806310, 298174709, 297720432, 297361404, 296928048, 296432406, 295926481, 295436054, 295007229, 294620961, 294249743, 293855548, 293428570, 292987376, 292475700, 291910321, 291398764, 290940702, 290457577, 289980769, 289653599, 289416343, 289020509, 288440704, 287814468, 287224174, 286762536, 286392152, 285947144, 285370827, 284699202, 284010231, 283333421, 282648355, 281978101, 281351030, 280803204, 280302376, 279721439, 279030770, 278290331, 277605593, 277124971, 276754230, 276188880, 275401205, 274605960, 273881495]
3344.9B73881495o56486o20007p20203q44806p74891o36905o36399p01964o50733m19736
3365.3B67219365l38406o25550r45241r19997o81550n77688o55442p46847o31451m37349
3385.7B60659844m44293m78745m20809m92394m90903k83182l10391n48244o62058n94736
3406.1B55934089m46111l66032m03702n15073n73457l87758j10984j56998l77089l52204
3426.5B52244681j77055q4371o5446j17451k89499m60476l81172k47985q9020L37184
3446.8B50669390K85029k35200k78681q8334l1531M9502J61409J57833J65671K82645
3467.2B51137733R7782k07663j06543J11461L1173O3240L56675K45869K9117K30193
3487.6B51989037K85357M2975P4446L22432J22249j60486M49747Q03500l7133j50889
$$ y = [273881495, 273225009, 272605002, 271884799, 271039993, 270265102, 269628197, 268991798, 268289834, 267639101, 267219365, 266880959, 266255409, 265310168, 264390171, 263708621, 263130933, 262475491, 261728644, 261097193, 260659844, 260215551, 259736806, 259315997, 258823603, 258332700, 258049518, 257739127, 257190883, 256528825, 255934089, 255487978, 255121946, 254718244, 254203171, 253629714, 253241956, 253130972, 252973974, 252596885, 252244681, 252067626, 251983255, 251917809, 251800358, 251510859, 251050383, 250669211, 250421226, 250332206, 250669390, 250954419, 250719219, 250440538, 250352204, 250320673, 250370175, 250531584, 250689417, 250855088, 251137733, 251235515, 251027852, 250921309, 251032770, 251063943, 251127183, 251483858, 251729727, 251758844, 251989037, 252274394, 252317369, 252391815, 252714247, 252836496, 252676010, 253125757, 253929257, 253892124, 253741235]
3508B53741235O00844N21779k3007r9302k9236J8031M27842O90758O00785P28548M88013
3530.5B57666290o5953J64122O28322K17199m24862r9718J205563J642257K38598j77413
3550.9B60994405P66873M75347j96397L6627k03550j104117O91802M514038L064603
3569.2B69039631j008302j198232K84791P68393O90132j26808j282186N49436M483670
3587.6B72200525K630561j360476j31636J859486J130521Q92699P72953j012028p73996
3605.9B76208609K349168K897650J374513L96073n06639K611756N098999M7653m953205
3624.3B85524577k751738P644445R137124j52111j524181L30240O32226O55145j092404
3642.6B98403323l234148M47720J0478616R981245j505465k159446L988981K459437
$$ y = [253741235, 254342079, 254863858, 254840851, 254741549, 254712313, 254730344, 255158186, 255848944, 256449729, 257178277, 257666290, 257600337, 257764459, 258392781, 258609980, 258185118, 258085400, 259290963, 260933220, 261171818, 260994405, 261761278, 262236625, 262040228, 262076855, 261873305, 260769188, 261460990, 265975028, 269039631, 268031329, 266833097, 267117888, 267886281, 268576413, 268449605, 267167419, 267716855, 272200525, 274831086, 273470610, 273338974, 275198460, 276328981, 277221680, 277994633, 276982605, 276208609, 278557777, 281455427, 282829940, 283226013, 282719374, 285331130, 290430129, 290477782, 285524577, 282772839, 290417284, 299554408, 299402297, 297878116, 298208356, 298840582, 299495727, 298403323, 295169175, 295616895, 306095511, 316076756, 314571291, 312411845, 316400826, 318860263]
3659C18860263m95643l31402j905024j733571M787594N041957k58237P150262Q616031
3677.3C39732230q04186k855390l311694l692359K562255J0146916N716234j577705
3693.6C45916301k832472k000392K32697L795922J682847l764271l383846L455818
3709.9C43102604Q912891K566755m477084l655582m14253J277268J837463J426696
3726.3C50576758k502739m670441j7196O804913P432848j636922r900093l983110Q786022
3744.6C50890040K083928l822476O926060O562412m319907m980743J102299J333147
3760.9C55774760k699047j783788M31269K591789L057748j420438l909707j180828
3777.3C50861758K828449J675248q32677K43753J91302j009047j905770k172559l28124
$$ y = [318860263, 318364620, 318033218, 316128194, 314394623, 319182217, 324224174, 323965937, 331116199, 339732230, 338928044, 336072654, 332760960, 329068601, 331630856, 341777772, 347494006, 345916301, 343083829, 341083437, 341316134, 345112056, 346794903, 343030632, 339646786, 343102604, 352015495, 354582250, 350105166, 346449584, 346035331, 347312599, 349150062, 350576758, 348074019, 343403578, 343386382, 350191295, 357624143, 355987221, 346087128, 342104018, 350890040, 352973968, 349151492, 356077552, 362639964, 358320057, 353339314, 354441613, 355774760, 353075713, 351291925, 351723194, 354314983, 357372731, 355952293, 352042586, 350861758, 353690207, 355365455, 354532778, 354776531, 354967833, 353958786, 352053016, 349880457, 349552333]
3795.6C49552333r75459K36481O071061J218438j220644L505618j745850p575899l470898
3814C45595181L777593J213074J700401O216824r04440m086823k325803j915723j087904
3832.3C48182380j604587J235456O013125L021240o21110j313597m799426r086042
3848.6C41027439o328524J1125178J7791032k144962r950668n385548O69450J822621
3865C48626018j910449R44347M631966R08196k072036m407853j648933J815915j87784
3883.3C46699387K005219M44770k954513J768887J115978n221754m307211J105905
3899.6C40656668M142791M881918J946032k885043l593058k404153k098828O1392K346605
3918C43054324O70582j384884k47210M5449j710326o33448J875609P52896j663625
$$ y = [349552333, 348576874, 348813355, 354884416, 356102854, 354882210, 358387828, 356641978, 349066079, 345595181, 349372774, 350585848, 352286249, 358503073, 357598633, 353511810, 351186007, 349270284, 348182380, 346577793, 347813249, 353826374, 356847614, 356226504, 354912907, 350113481, 341027439, 334698915, 345824093, 363615125, 361470163, 351519495, 346133947, 346803397, 348626018, 346715569, 347659916, 352291882, 353200078, 351128042, 346720189, 345071256, 346887171, 346699387, 348704606, 349149376, 346194863, 347963750, 349079728, 343857974, 339550763, 340656668, 344799459, 349681377, 351627409, 348742366, 345149308, 342745155, 340646327, 340707719, 343054324, 343724906, 342340022, 342092812, 342138261, 340427935, 339794487, 341670096, 342422992, 340759367]
3936.3C40759367k042800q00193R65715L87817r21011J65791O01261m92990q14646
3954.7C37808311n02080l75092o6161J03444l89487o16937l65943k73824j94937n96
3975.1C35126698j76549m52042l13162j47462l23177m78029k92361j56313j56134p3314
3995.5C32558155j91748
3997.5C32366407
$$ y = [340759367, 338716567, 337916374, 338882089, 339269906, 338348895, 338514686, 339115947, 338622957, 337808311, 337306231, 336931139, 336864978, 336968422, 336578935, 335961998, 335596055, 335322231, 335127294, 335126698, 334950149, 334498107, 334184945, 334037483, 333714306, 333236277, 332943916, 332787603, 332631469, 332558155, 332366407]
##END=$$ End of the data block
