##TITLE=Sample description $$ Begin of the data block
##JCAMP-DX=5.00 $$ ACD/SpecManager v 10.08
##SPECTROMETER/DATA SYSTEM=Alpha
##DATE=03 Jun 2014 08:26:48
##DATA TYPE=INFRARED SPECTRUM
##DATA CLASS=XYDATA
##ORIGIN=
##OWNER=
##NPOINTS=1765
##FIRSTX=399.75695801
##LASTX=3997.56933594
##MAXX=3997.56933594
##MINX=399.75695801
##MAXY=0.64524627
##MINY=0.25149587
##XFACTOR=1.0000000000
##YFACTOR=1.000000000000000e-9
##FIRSTY=0.60246468
##DELTAX=2.03957629
##XUNITS=1/CM
##YUNITS=ARBITRARY UNITS
##XYDATA=(X++(Y..Y))
399.8 602464676 602337539 601698816 601197183 601613581 602867484 604008734 604062021 603670716 603934228 604373157
420.2 604373157 603627205 602143466 601335645 601681113 602131486 601332188 599841595 599630058 601076424
438.5 601076424 602374494 602056444 600986600 601278186 603236675 604592443 603602588 601810396 601803064
456.9 601803064 603374660 603745878 601851344 599628329 599368095 600320935 599927783 597581089 595537424
475.2 595537424 595800102 597358286 597547114 595845938 594616115 595471025 596795022 596165240 594012320
493.6 594012320 593174398 594565988 595683157 594319165 591738641 590773046 592047095 593092978 591611087
511.9 591611087 588859260 587724090 588591754 589025140 587581992 585786939 585847616 587665498 589130759
530.3 589130759 589050889 588721156 590166569 592964470 594688594 594257891 593403697 593984604 595273316
548.6 595273316 595372438 593857944 592331827 592236161 592704952 591971338 589851677 587811649 586953521
567 586953521 586593211 585505188 583908379 583126485 583867013 585314870 586188316 586580932 587610841
585.4 587610841 589381874 590782523 591125309 590901852 590963066 591464400 591807306 591455221 590725899 590450585
605.8 590450585 590735316 590849102 590579629 590579629 591265380 592352867 593415141 594466567 595895469 597789049
626.1 597789049 599448383 600223005 600484788 600952208 601624727 601949215 601790428 601695657 602094352 602719128
646.5 602719128 603016853 602825642 602667928 603073895 603684187 603808522 603500962 603377998 603681028 604266465
666.9 604266465 604678690 604564488 604592264 605256259 606096148 606268585 605962873 606028795 606704652 607369542
687.3 607369542 607341409 606846273 606642365 606778145 606465161 605235934 603733361 602917790 602826416 602734566
707.7 602734566 602372348 602372408 603338063 605001688 606586337 607720733 608833671 610518396 612665832
726.1 612665832 614462137 615394592 615977347 616904616 618048668 618670046 618351460 617564619 616995633
744.4 616995633 616486371 615341485 613397121 611297607 609767199 608760655 607767165 606798887 606446266
762.8 606446266 607123554 608625531 610363007 612030804 613850474 616041362 618410766 620511174 622171581
781.2 622171581 623659432 625169635 626580000 627755821 628801107 629957199 631319225 632850230
797.5 632850230 634538710 636356890 638198495 639866531 641205549 642277002 643247783 644133508 644818306
815.8 644818306 645188868 645246267 645112157 644710243 643750966 642127514 640136123 638125420 635955095
834.2 635955095 633412421 630852580 628834784 627515674 626567721 625616014 624741971 624296486 624328554
852.5 624328554 624499381 624458730 624321222 624704540 626055479 627987325 629826069 631629527 633777738
870.9 633777738 636046231 637724340 638335407 638174653 637937427 637693584 636794269 634910882 632622242
889.3 632622242 630791545 629587173 628366709 626617551 624680519 623190582 622079015 620574474
905.6 620574474 618154228 615230680 612609327 610352635 607833922 604766071 601685584 599476814
921.9 599476814 598314404 597427189 596280634 595343471 595292866 596060395 596941948 597533762 598431289 600466549
942.3 600466549 603287101 605512321 606297970 605985463 605222464 603982568 601698279 598251760 594382644
960.6 594382644 590858340 587544680 583679080 578977048 574063540 569657564 565653443 561357439
977 561357439 556629360 552254975 548967898 546647966 544609666 542479277 540688992 539837420 539704144
995.3 539704144 539465189 538775265 538077533 537846804 537839115 537317932 536049426 534637392 533675969 533099771
1015.7 533099771 532458484 531609356 530994833 531027496 531491220 531811893 531749308 531552672 531479478 531397462
1036.1 531397462 530912578 529923141 528892338 528403461 528526247 528862476 529248714 530005574 531436086
1054.5 531436086 533400059 535413623 537202001 538973033 540952802 542818189 543708861 542983174 540934920
1072.8 540934920 538526595 536457956 534865499 533772171 533311367 533556104 534352958 535370409 536337554
1091.2 536337554 537281454 538318574 539320409 540028811 540375590 540556133 540817916 541228652 541663766
1109.5 541663766 542042434 542438567 542948425 543532431 544040263 544397533 544697046 545069993 545595109 546347141
1129.9 546347141 547187924 547772467 547909498 547536433 546605825 545189559 543464661 541626811 539857447
1148.3 539857447 538308263 537069261 536130548 535461128 535147309 535321236 535981297 537077665 538629711
1166.6 538629711 540685117 543277562 546341956 549676478 553049922 556379795 559626341 562613428
1182.9 562613428 565145195 567103982 568494678 569419205 569919050 569993436 569744408 569378138 569150805
1201.3 569150805 569235444 569607019 570179880 570968866 572024524 573242068 574335158 575069547 575426936
1219.7 575426936 575497210 575339496 574910641 574181676 573347151 572667480 572177112 571734548 571266472 570879936
1240.1 570879936 570738852 570845246 571035266 571192145 571360946 571615875 571915865 572156250 572277129 572353482
1260.4 572353482 572501302 572715640 572901666 572989464 573030829 573108912 573192298 573178232 573017895 572749436
1280.8 572749436 572433293 572116375 571770608 571270168 570576072 569823384 569161415 568592727 568054020 567574739
1301.2 567574739 567240655 567100286 567095160 567047536 566832960 566417754 565806448 565148473 564455271 563522518
1321.6 563522518 562375486 561191320 560066760 558983028 557880342 556780219 555833340 555348992 555370390
1340 555370390 555319369 554891169 554380476 553968132 553562343 553012729 552350998 551666141 550891161 550180912
1360.4 550180912 549822509 549416065 548655748 548025787 547563076 547253549 547324479 547381520 547297657 547211587
1380.8 547211587 546922505 546770334 547627687 548831403 549019933 548776984 548808396 548713207 548539937 548122346
1401.2 548122346 547341704 546753943 546151459 545468092 545039058 544484675 543378592 542770028 543621540
1419.5 543621540 544110119 543880045 543655515 543351889 543516755 543734968 543320835 543792307 545165837
1437.9 545165837 545345724 545045137 544779599 544357300 544166923 543888211 542842925 541389048 541747868
1456.2 541747868 544073462 544310689 543644667 544738054 546601832 547030985 547712386 551265121 555811703
1474.6 555811703 558805645 560904443 563113689 565571845 567591727 569532514 572656393 576228321
1490.9 576228321 577923775 579126954 582013309 584802568 585447848 584480345 585052252 589939296 592936695
1509.3 592936695 592921734 592771232 593169689 593933940 594657600 596587360 598450184 599203825 599950254
1527.6 599950254 599668503 599368572 600584388 600293577 598571301 600292563 603814244 604886711 604805768
1546 604805768 604174495 603645325 603129089 602107525 600620389 602666736 607654035 607233465 605079293
1564.3 605079293 603822887 603701472 604420125 603237748 601827145 603148162 603545070 601861954 600379467
1582.7 600379467 599267900 597995698 596512139 594798684 592909753 590940297 588744283 586192846
1599 586192846 583463192 580654323 577609181 574411988 571217000 567597747 563234925 559617877 557517648
1617.4 557517648 554259360 550263941 547532737 545187950 542691410 540268302 537066400 534475207
1633.7 534475207 535125494 536043048 534736633 532914460 531491697 532362044 534003913 532423735 533087194
1652 533087194 539752662 541759789 540409982 540262699 542429745 544894457 545410931 546923995 550514817
1670.4 550514817 552674592 555227757 558952630 560348094 559982419 561950684 569132924 573896825
1686.7 573896825 574978769 576075077 576481640 578326046 581685424 585108817 590441108 592944026
1703 592944026 594070315 596692860 598239243 598423421 598327160 599550545 604143322 608132243 608469605
1721.4 608469605 608554959 609492481 610004008 609800935 609584987 612974882 617006898 616902232 617114246
1739.7 617114246 618481934 618970573 619025588 619435191 621329963 623460591 623506248 623358250 623852491
1758.1 623852491 624152184 625332534 625825405 625074685 624635160 624920011 627062380 628949642 628517807
1776.5 628517807 627853453 628052711 628355503 628725350 628837645 627844989 627691805 629750669 630721331
1794.8 630721331 629903615 629637480 630468905 631067753 630820811 630407870 630482197 631080747 631322503 631070614
1815.2 631070614 631102622 631162167 630556822 630039811 630215347 630178273 630763292 631655097 631035030 630149484
1835.6 630149484 629885316 629006565 627660632 628205597 629626393 629314661 628458321 627870739 627375245
1854 627375245 626932561 626577437 626308084 625882685 624949098 624024272 624673307 625965238 625692546 624727607
1874.4 624727607 624231279 624029577 623848855 623571575 623130918 622527957 622468829 622828603 622474074 621985853
1894.7 621985853 621827185 621483803 621000469 620528102 619964540 619445443 619278193 619150579 618384719 617262602
1915.1 617262602 617070317 617397547 617042720 616736114 616519868 616007864 615595818 615282059 614947915 614601493
1935.5 614601493 614122748 613487124 613345683 613663375 613529146 613125920 612861991 612633765 612361431 612099409
1955.9 612099409 611949086 611881077 611626804 611124277 610865116 610922813 610749543 610308647 609854758 609460831
1976.3 609460831 609181166 608935237 608601630 608124733 607570887 607046783 606785774 606786072 606393099 605601668
1996.7 605601668 604971051 604489803 603897870 603135407 602341175 601618469 600864947 599921465 598901451
2015.1 598901451 598076105 597318113 596392989 595385194 594357073 593333066 592387378 591509521 590614259
2033.4 590614259 589642406 588649333 587793231 587148249 586532950 585819542 585129499 584588587 584164977 583739698
2053.8 583739698 583256006 582768202 582359433 582019031 581761479 581527829 581182182 580818832 580545306 580279469
2074.2 580279469 579957068 579611719 579284489 578980803 578665793 578310370 577977717 577715516 577461481 577174246
2094.6 577174246 576850712 576508522 576215684 575982988 575722337 575396597 575062573 574753582 574457586 574119449
2115 574119449 573703706 573294461 572939873 572573483 572167516 571764827 571402490 571072698 570734501 570352674
2135.4 570352674 569944263 569543242 569179952 568884075 568599164 568260193 567902744 567605913 567397177 567225099
2155.8 567225099 567053854 566923618 566909671 566995084 567060888 567101240 567206204 567348659 567488134 567642629
2176.2 567642629 567782342 567905068 568049610 568194985 568312764 568442881 568616092 568813264 568995535 569131017
2196.6 569131017 569255292 569405913 569553494 569699109 569863319 570032239 570206761 570373535 570498943 570578337
2217 570578337 570634544 570707440 570793569 570830882 570798337 570748568 570734859 570742965 570695817 570569575 570416331 570264339
2241.5 570264339 570117950 569986820 569853008 569722891 569630563 569552124 569470584 569396138 569310665 569222331 569171548
2263.9 569171548 569144249 569098234 569043934 569036126 569068789 569078505 569052875 568950832 568703413 568394125 568172753
2286.3 568172753 568002343 567775071 567498982 567231536 566969454 566625476 566182196 565658867 565091074 564567566
2306.7 564567566 564110219 563717961 563359976 562797368 561970294 561335564 561209917 561328530 561102450 560487032
2327.1 560487032 560236216 560472190 560308397 559639513 559171021 559219718 559888244 561745465 563502431
2345.5 563502431 560769379 554321766 549573362 549090326 550480962 551867187 553152561 554245770
2361.8 554245770 555226326 556154013 556881607 557258904 557258606 556941688 556341171 555440664 554245532 552817881
2382.2 552817881 551354766 550122261 549263954 548672020 548126161 547482908 546772897 546139896 545639932
2400.6 545639932 545134783 544471502 543721497 543029726 542386234 541705549 540957451 540162086 539402902 538729668
2421 538729668 538043022 537230074 536346614 535520852 534760237 533978999 533098400 532168031 531315863 530563056
2441.3 530563056 529801488 528926969 527988136 527139008 526433229 525736570 524908721 524005353 523178875 522474408
2461.7 522474408 521811724 521091938 520308793 519548535 518877089 518249452 517567694 516827345 516126812 515532374
2482.1 515532374 514988899 514386714 513706028 513062000 512545347 512108266 511634827 511072636 510522604 510086000
2502.5 510086000 509693384 509210706 508622885 508044064 507558465 507116973 506612599 506016672 505412579 504882872
2522.9 504882872 504382908 503778160 503029346 502270877 501625121 501043618 500398934 499643415 498867273 498187691
2543.3 498187691 497596264 496990323 496309578 495604217 494966567 494412184 493859589 493219405 492534399 491932243
2563.7 491932243 491406143 490847528 490226805 489588082 488966703 488404483 487909108 487359345 486721247 486139089
2584.1 486139089 485648483 485187948 484700233 484121889 483505547 482973069 482512772 481993467 481350005 480658203
2604.5 480658203 480019480 479404658 478730947 477994442 477226555 476442665 475622833 474761695 473867297 472943366
2624.9 472943366 472041816 471162498 470229894 469246030 468283176 467376232 466498524 465576231 464565188
2643.3 464565188 463529229 462572545 461711556 460886240 460028470 459112614 458228976 457462490 456742913
2661.6 456742913 455961168 455104709 454260826 453519017 452854872 452173889 451460242 450762451 450104922 449459463
2682 449459463 448780805 448083431 447415859 446804017 446216047 445580333 444900155 444264710 443679154 443059474
2702.4 443059474 442382753 441664755 440943807 440277636 439661622 439047068 438410848 437750161 437084585 436454415
2722.8 436454415 435815424 435104787 434410840 433821619 433268219 432653755 431985438 431362927 430836827 430349976
2743.2 430349976 429830968 429240853 428601205 427991182 427459329 426975518 426459014 425882339 425335914 424901515
2763.6 424901515 424514860 424041718 423479319 422947139 422466606 421972632 421439260 420856088 420262188 419711590
2784 419711590 419177145 418579996 417897940 417208582 416554630 415922076 415268034 414529026 413743198 412990808
2804.4 412990808 412267059 411513358 410694957 409852803 409055591 408289462 407467365 406576037 405690879 404856712
2824.8 404856712 404046476 403197467 402307421 401425809 400557101 399660051 398650229 397507101 396353751
2843.1 396353751 395304173 394318223 393301159 392279059 391295314 390315145 389329910 388316989 387180448
2861.5 387180448 385921448 384666532 383446753 382212341 380965412 379681975 378356516 377131641
2877.8 377131641 376080990 375114650 374228537 373482883 372834742 372220546 371637911 371084183 370546907
2896.2 370546907 370062262 369644552 369209051 368710011 368214160 367751837 367284358 366765916 366115987 365296304
2916.6 365296304 364416867 363646358 363053292 362618417 362324327 362123370 361990124 361983806 362132818 362385422
2937 362385422 362718374 363126993 363577813 364054620 364515305 364978582 365527183 366085500 366543651 366930664
2957.4 366930664 367304325 367709666 368113250 368390560 368482292 368484557 368596315 368897676 369362950 370053768
2977.8 370053768 370954394 371899188 372836441 373807251 374755472 375617057 376353323 376918823 377296507 377478629
2998.1 377478629 377497166 377445102 377379894 377259284 377059668 376846910 376596004 376188695 375644058 375024498
3018.5 375024498 374332428 373639882 372987539 372257769 371474802 370887935 370415419 369715303 368826747 368039280
3038.9 368039280 367386967 366683841 365841955 364964366 364188492 363437682 362623125 361841232 361076444 360226989
3059.3 360226989 359362245 358674943 358156234 357501775 356608093 355705172 354922980 354266196 353714228 353142262
3079.7 353142262 352457464 351683646 350877583 350078851 349257827 348398089 347648054 347043663 346413285 345752895
3100.1 345752895 345088989 344382823 343736291 343134314 342427373 341742098 341256350 340803206 340156704 339338005
3120.5 339338005 338498682 337733656 337081403 336462826 335814953 335258722 334759623 334195137 333555907 332837939
3140.9 332837939 332112193 331445009 330814183 330242604 329739898 329144835 328395873 327663809 327023178 326414704
3161.3 326414704 325814098 325229317 324631721 323986560 323358864 322786778 322209626 321636051 321017295 320327312
3181.7 320327312 319746345 319281340 318742216 318135023 317502052 316788137 316121250 315609008 315078199 314441174
3202.1 314441174 313794017 313155353 312555581 312000543 311437875 310887516 310323149 309787840 309293061 308694780
3222.5 308694780 308042198 307463080 306960166 306545556 306123555 305526972 304838777 304218292 303634286 303124577
3242.9 303124577 302780688 302385449 301767021 301149040 300728828 300384223 299935520 299425751 298925340 298417807
3263.3 298417807 297945678 297564089 297216773 296808183 296364427 295892149 295305520 294681937 294192612 293793201
3283.7 293793201 293299168 292728245 292312205 292059332 291677326 291051030 290357113 289781034 289384782 289026380
3304.1 289026380 288529307 287899971 287194192 286507457 285906434 285297632 284621388 283932149 283316940 282779098
3324.5 282779098 282178998 281474024 280719310 279963076 279364467 278903693 278315574 277569264 276784211 275986135
3344.9 275986135 275246114 274581939 273849219 272994965 272210270 271584541 270936161 270159662 269422829 268925935
3365.3 268925935 268502384 267816991 266876668 265975744 265274733 264675021 263990551 263229132 262605458 262106985
3385.7 262106985 261565715 261075228 260718763 260240883 259666532 259299517 258973986 258424997 257740021 257126659
3406.1 257126659 256689161 256342679 255958021 255491674 254939586 254500926 254346102 254188687 253852874 253585756
3426.5 253585756 253423303 253235400 253099442 253011882 252789021 252364576 251969278 251682252 251532823 251760691
3446.8 251760691 251952529 251752913 251552552 251495868 251502842 251581222 251744747 251967758 252223730 252467066
3467.2 252467066 252484798 252330929 252327323 252483219 252520472 252563238 252955884 253316849 253369421 253492206 253700197
3489.7 253700197 253781378 253947467 254297584 254373580 254227370 254771411 255657971 255672723 255541384 256149918
3510.1 256149918 256740957 256825894 256763399 256721228 256732047 257163882 257898569 258522898 259238273 259766072
3530.5 259766072 259772688 260008484 260711014 260963202 260552257 260480762 261719823 263383269 263625801 263508528
3550.9 263508528 264393657 264910370 264676660 264749587 264655054 263579786 264253706 268857092 272025526
3569.2 272025526 271055907 269908488 270215899 271006793 271769404 271678150 270400107 271062493 275815934
3587.6 275815934 278580844 277104706 276825786 278628886 279854357 280921429 281782329 280785412 280022323
3605.9 280022323 282399833 285350204 286813855 287328869 286868304 289540112 294789881 294875026 289866775
3624.3 289866775 287170619 295098037 304481089 304322094 302775711 303142697 303786397 304432184 303290904
3642.6 303290904 299979240 300489068 311280608 321547806 320031613 317811877 321893603 324436337
3659 324436337 323962718 323668689 321733028 319882721 324679524 329760343 329475373 336876154 345713824
3677.3 345713824 344820082 341865301 338483185 334718347 337381870 347813368 353639603 351978093
3693.6 351978093 349063575 347058237 347373486 351286620 352938443 348998070 345572799 349215358
3709.9 349215358 358330786 360873878 356234223 352487862 352099597 353418320 355261266 356681943
3726.3 356681943 354097098 349304914 349306285 356346428 364059538 362482727 352406740 348354548 357381165
3744.6 357381165 359465152 355434656 362544715 369355649 364876568 359680891 360815018 362260401
3760.9 362260401 359598428 357848346 358300537 360942215 364048272 362581939 358621687 357435822
3777.3 357435822 360304773 361964107 361044288 361260146 361462653 360466391 358571738 356384754 356006354
3795.6 356006354 354882926 355047524 361357987 362750471 361541301 365084499 363207787 355387121
3811.9 355387121 351861477 355816603 357115626 358948052 365449369 364543110 360277504 357816398
3828.2 357816398 355816126 354715347 353123546 354439944 360616803 363672405 362963706 361581594
3844.6 361581594 356703579 347463459 341078550 352606237 370792896 368454158 358144432 352532476
3860.9 352532476 353271037 355288297 353377938 354316115 359067708 360063612 357990086 353495419 351864010
3879.2 351864010 353764415 353526801 355575651 356131524 353207797 355070561 356193662 350763738 346259087
3897.6 346259087 347314030 351495594 356505990 358597726 355687916 351941496 349448353 347416371
3913.9 347416371 347624779 350081176 350784808 349349141 349032104 349041641 347283244 346682519 348713696
3932.3 348713696 349536687 347849876 345827669 345069259 346042335 346347511 345320672 345497906 346167237
3950.6 346167237 345720530 344950706 344465196 344027281 343886644 343982279 343579143 342934161 342585951 342389852
3971 342389852 342274219 342270136 342072994 341633976 341298729 341097027 340755731 340298712 340073317 340065986 340020627
3993.4 340020627 339876145 339531034
3997.5 339531034
##END=$$ End of the data block
