##TITLE=Sample description $$ Begin of the data block
##JCAMP-DX=5.00 $$ ACD/SpecManager v 10.08
##SPECTROMETER/DATA SYSTEM=Alpha
##DATE=03 Jun 2014 08:26:32
##DATA TYPE=INFRARED SPECTRUM
##DATA CLASS=XYDATA
##ORIGIN=
##OWNER=
##NPOINTS=1765
##FIRSTX=399.75695801
##LASTX=3997.56933594
##MAXX=3997.56933594
##MINX=399.75695801
##MAXY=0.64475375
##MINY=0.25324464
##XFACTOR=1.0000000000
##YFACTOR=1.000000000000000e-9
##FIRSTY=0.60041225
##DELTAX=2.03957629
##XUNITS=1/CM
##YUNITS=ARBITRARY UNITS
##XYDATA=(X++(Y..Y))
$$ plain form
399.8 600412250 600878119 600622356 599794149 599795461 600772679 601636529 601744115 601511717 601839244 602563739
420.2 602563739 602275670 601122320 600393355 600759506 601419330 600666106 598664105 597878218 599191666
438.5 599191666 600432336 599792659 598662496 599354923 601491153 602767408 601960003 600430191 600439012
456.9 600439012 601839602 601943791 599975824 597884536 597446978 597948790 597430348 595332026 593538105
475.2 593538105 593952179 595483482 595492959 593741059 592569768 593419731 594935715 594695807 592544377
493.6 592544377 591315567 592592835 594055355 592988312 590409100 589374006 590448916 591254115 589859426
511.9 589859426 587218285 585858285 586532712 586938024 585449994 583736479 584002852 585935414 587393463
530.3 587393463 587292790 586943388 588228703 590781450 592427671 592149317 591473043 592137754 593406796
$$ packed form
399.8F00412250M65869k55763q28207J312R77218Q63850J07586k32398L27527P24495
420.2F02563739k88069j153350p28965L66151O59824p53224k002001p85887J313448
438.5E99191666J240670o39677j130163O92427K136230J276255q07405j529812Q821
456.9F00439012J400590J04189j967967k091288m37558N01812n18442k098322j793921
475.2E93538105M14074J531303R477j751900j171291Q49963J515984k39908k151430
493.6E92544377j228810J277268J462520j067043k579212j035094J074910Q05199j394689
511.9E89859426k641141j360000O74427M05312j488030j713515K66373J932562J458049
530.3E87393463j00673l49402J285315K552747J646221k78354o76274O64711J269042
$$ plain form
548.6 593406796 593331099 591759384 590452135 590412974 590686798 589917541 587948143 586054802 585258663
567 585258663 584831715 583656430 582021475 581168473 581822932 583243072 584138215 584590375 585653722
585.4 585653722 587490797 589104891 589632511 589397013 589323103 589674354 589875221 589384139 588619173 588447630
605.8 588447630 588820279 588985860 588766932 588776529 589490175 590680540 591877162 592990398 594372153
624.1 594372153 596119761 597639740 598400712 598636866 598961115 599577606 600133717 600286484 600251257 600547731
644.5 600547731 601122200 601373851 601135373 600971937 601400077 602109432 602334917 602007926 601737320 601860285
664.9 601860285 602417290 602962732 602918208 603044271 603795290 604606390 604766369 604464412 604567587 605409682
685.3 605409682 606198847 606129944 605526626 605241120 605360985 605072975 603848457 602266550 601346731 601340234
$$ packed form
548.6E93406796p5697j571715j307249l9161K73824p69257j969398j893341p96139
567E85258663m26948j175285j634955q53002O54459J420140Q95143M52160J063347
585.4E85653722J837075J614094N27620k35498p3910L51251K00867m91082p64966j71543
605.8E88447630L72649J65581k18928R597P13646J190365J196622J113236J381755
624.1E94372153J747608J519979P60972K36154L24249O16491N56111J52767l5227K96474
644.5F00547731N74469K51651k38478j63436M28140P09355K25485l26991k70606J22965
664.9F01860285N57005N45442m4524J26063P51019Q11100J59979l01957J03175Q42095
685.3F05409682P89165o8903o03318k85506J19865k88010j224518j581907r19819o497
$$ plain form
705.7 601340234 601513863 601296902 601149499 601908863 603611827 605407834 606671453 607758582 609413862
724 609413862 611566424 613313377 614153981 614623249 615477860 616697609 617517531 617376804 616637230 615965128
744.4 615965128 615323126 614159226 612274647 610221922 608719051 607766211 606863916 605954766 605532885
762.8 605532885 606081963 607564509 609396219 611196041 613137782 615377069 617704630 619746149 621357083
781.2 621357083 622803569 624309242 625757933 627016246 628122270 629269361 630652666 632287383
797.5 632287383 634070516 635894895 637657046 639206409 640457928 641553402 642602742 643493950 644169986
815.8 644169986 644601524 644753754 644702375 644350588 643407762 641784132 639755368 637635410 635380983
834.2 635380983 632881105 630416751 628437102 627099931 626109838 625122011 624265194 623890221 623992741
$$ packed form
705.7F01340234J73629k16961j47403P59364J702964J796007J263619J087129J655280
724F09413862K152562J746953Q40604M69268Q54611J219749Q19922j40727p39574o72102
744.4F15965128o42002j163900j884579k052725j502871r52840r02295r09150m21881
762.8F05532885N49078J482546J831710J799822J941741K239287K327561K041519J610934
781.2F21357083J446486J505673J448691J258313J106024J147091J383305J634717
797.5F32287383J783133J824379J762151J549363J251519J095474J049340Q91208O76036
815.8F44169986M31538J52230n1379l51787r42826j623630k028764k119958k254427
834.2F35380983k499878k464354j979649j337171r90093r87827q56817l74973J02520
$$ plain form
852.5 623992741 624161541 624065399 623943746 624439538 625865877 627774715 629578292 631361365 633478105
870.9 633478105 635716915 637360454 637938082 637754798 637493551 637269616 636455417 634636283 632333398
889.3 632333398 630452275 629229486 628057361 626387835 624497175 623017073 621904016 620367229
905.6 620367229 617926896 615060687 612474978 610166848 607583940 604492187 601456106 599339008
921.9 599339008 598237157 597361743 596212029 595263243 595241308 596061051 596916139 597468674 598392487 600419164
942.3 600419164 603197575 605446696 606262743 605932593 605144143 603896260 601614177 598155141 594262421
960.6 594262421 590715528 587404251 583590806 578956723 574064970 569622695 565570712 561301470
977 561301470 556673884 552350461 549051225 546715140 544639170 542448223 540622771 539782286 539688051
$$ packed form
852.5F23992741J68800r6142j21653M95792J426339J908838J803577J783073K116740
870.9F33478105K238810J643539N77628j83284k61247k23935q14199j819134k302885
889.3F32333398j881123j222789j172125j669526j890660j480102j113057j536787
905.6F20367229k440333k866209k585709k308130k582908l091753l036081k117098
921.9E99339008j101851q75414j149714r48786k1935Q19743Q55088N52535R23813K026677
942.3F00419164K778411K249121Q16047l30150p88450j247883k282083l459036l892720
960.6E94262421l546893l311277l813445m634083m891753m442275m051983m269242
977E61301470m627586m323423l299236k336085k075970k190947j825452q40485r4235
$$ plain form
995.3 539688051 539473534 538799465 538182616 538052678 538054287 537496448 536218226 534794509 533837676 533286750
1015.7 533286750 532632649 531730771 531067312 531111062 531617939 531938672 531842470 531637967 531588674 531505048
1036.1 531505048 530974567 529932916 528897583 528433621 528551757 528888345 529320776 530148566 531650722
1054.5 531650722 533650875 535650194 537425458 539219260 541214943 543047011 543908060 543211699 541187286
1072.8 541187286 538753390 536688566 535151780 534082115 533583105 533762932 534491718 535479009 536497533
1091.2 536497533 537510991 538559377 539542139 540230036 540579855 540843070 541181684 541545689 541914582
1109.5 541914582 542303324 542709827 543192387 543767333 544283211 544631124 544921935 545311034 545887232 546702385
1129.9 546702385 547587693 548182964 548275471 547820508 546825826 545395374 543700337 541909635 540189445
$$ packed form
995.3E39688051k14517o74069o16849j29938J609n57839j278222j423717r56833n50926
1015.7E33286750o54101r01878o63459M3750N06877L20733r6202k04503m9293q3626
1036.1E31505048n30481j041651j035333m63962J18136L36588M32431Q27790J502156
1054.5E31650722K000153J999319J775264J793802J995683J832068Q61049o96361k024413
1072.8E41187286k433896k064824j536786j069665m99010J79827P28786R87291J018524
1091.2E36497533J013458J048386R82762O87897L49819K63215L38614L64005L68893
1109.5E41914582L88742M06503M82560N74946N15878L47913K90811L89099N76198Q15153
1129.9E46702385Q85308N95271R2507m54963r94682j430452j695037j790702j720190
$$ plain form
1148.3 540189445 538688540 537446499 536449790 535771787 535523593 535761893 536447763 537530482 539062381
1166.6 539062381 541121483 543720245 546774209 550085902 553448081 556770682 560001493 562982380
1182.9 562982380 565516770 567508161 568937957 569858372 570358515 570452690 570182085 569782138 569580078
1201.3 569580078 569706559 570069373 570613503 571409047 572471559 573661625 574752092 575507343 575849235
1219.7 575849235 575885952 575722516 575349689 574715972 573906243 573150933 572589457 572161913 571762204 571400821
1240.1 571400821 571225584 571309626 571500540 571647584 571790099 572022557 572334826 572598577 572722197 572798789
1260.4 572798789 572947919 573172629 573398173 573542476 573596597 573626161 573692739 573736846 573628604 573350191
1280.8 573350191 573000610 572656333 572302401 571818709 571136773 570385814 569714069 569145858 568636775 568169594
$$ packed form
1148.3E40189445j500905j242041r96709o78003k48194K38300O85870J082719J531899
1166.6E39062381K059102K598762L053964L311693L362179L322601L230811K980887
1182.9E62982380K534390J991391J429796R20415N00143R4175k70605l99947k02060
1201.3E69580078J26481L62814N44130P95544J062512J190066J090467P55251L41892
1219.7E75849235L6717j63436l72827o33717q09729p55310n61476m27544l99709l61383
1240.1E71400821j75237Q4042J90914J47044J42515K32458L12269K63751J23620P6592
1260.4E72798789J49130K24710K25544J44303N4121K9564O6578M4107j08242k78413
1280.8E73350191l49581l44277l53932m83692o81936p50959o71745n68211n09083m67181
$$ plain form
1301.2 568169594 567828894 567692876 567690372 567647398 567439973 567030549 566401362 565680563 564962208 564059079
1321.6 564059079 562928438 561763823 560661018 559597671 558547914 557499766 556543231 555989265 555953562
1340 555953562 555908680 555520654 555054665 554675162 554270983 553690255 552999020 552316725 551556885 550863683
1360.4 550863683 550523639 550119698 549357295 548713088 548212111 547885001 547970772 548030555 547934353 547852457
1380.8 547852457 547594547 547461629 548293769 549476206 549683690 549466670 549500763 549385846 549222946 548844934
1401.2 548844934 548067868 547449768 546810627 546131253 545764923 545244932 544115245 543502152 544411480
1419.5 544411480 544949293 544718325 544466853 544150531 544348061 544599712 544177234 544640779 546033204
1437.9 546033204 546211779 545870841 545570910 545183599 545063376 544778407 543645859 542100191 542439759
$$ packed form
1301.2E68169594l40700j36018k504m2974k07425m09424o29187p20799p18355r03129
1321.6E64059079j130641j164615j102805j063347j049757j048148r56535n53966l5703
1340E55953562m4882l88026m65989l79503m04179n80728o91235o82295p59840o93202
1360.4E50863683l40044m03941p62403o44207n00977l27110Q5771N9783r6202q1896
1380.8E47852457k57910j32918Q32140J182437K07484k17020L4093j14917j62900l78012
1401.2E48844934p77066o18100o39141o79374l66330n19991j129687o13093R09328
1419.5E44411480N37813k30968k51472l16322J97530K51651m22478M63545J392425
1437.9E46033204J78575l40938k99931l87311j20223k84969j132548j545668L39568
$$ plain form
1456.2 542439759 544854343 545192719 544586241 545696735 547556460 547948241 548553824 552074254 556665063
1474.6 556665063 559712172 561838686 564062059 566533923 568536341 570433974 573552430 577163935
1490.9 577163935 578863680 580030441 582896590 585720778 586403310 585380852 585860312 590811670 593914330
1509.3 593914330 593892694 593710005 594093800 594841778 595559120 597544670 599478364 600254476 600997448
1527.6 600997448 600686550 600359738 601601481 601311147 599508286 601205826 604848385 606012583 605924487
1546 605924487 605229378 604666650 604165614 603129387 601542413 603535593 608658552 608313084 606175184
1564.3 606175184 604935825 604801118 605505109 604304194 602850199 604145110 604550838 602890849 601411521
1582.7 601411521 600272477 598981977 597473979 595686436 593705535 591681302 589462996 586888492
$$ packed form
1456.2E42439759K414584L38376o06478J110494J859725L91781O05583L520430M590809
1474.6E56665063L047109K126514K223373K471864K002418J897633L118456L611505
1490.9E77163935J699745J166761K866149K824188O82532j022458M79460M951358L102660
1509.3E93914330k1636j82689L83795P47978P17342J985550J933694P76112P42972
1527.6F00997448l10898l26812J241743k90334j802861J697540L642559J164198q8096
1546F05924487o95109n62728n01036j036227j586974J993180N122959l45468k137900
1564.3F06175184j239359j34707P03991j200915j453995J294911M05728j659989j479328
1582.7F01411521j139044j290500j507998j787543j980901k024233k218306k574504
$$ plain form
1599 586888492 584105313 581216156 578101993 574843287 571564436 567852974 563412130 559728920 557560623
1617.4 557560623 554195404 550074935 547277868 544961154 542513013 540067673 536780894 534126163
1633.7 534126163 534776986 535698533 534385800 532552958 531102598 532026291 533801675 532261372 532976031
1652 532976031 539847076 541961610 540627539 540527999 542801142 545377672 545934439 547447741 551085532
1670.4 551085532 553342640 556001484 559807599 561242938 560878158 562846839 570139468 575004876
1686.7 575004876 576106310 577220500 577610791 579431295 582828820 586360157 591843307 594399035
1703 594399035 595534205 598198831 599749446 599903464 599785268 601018369 605734169 609871864 610242248
1721.4 610242248 610303044 611213207 611712456 611506402 611266792 614661932 618753254 618662357 618850470 620195448
$$ packed form
1599E86888492k783179k889157l114163l258706l278851l711462m440844l683210k168297
1617.4E57560623l365219m120469k797067k316714k448141k445340l286779k654731
1633.7E34126163O50823R21547j312733j832842j450360R23693J775384j540303P14659
1652E32976031O871045K114534j334071r9540K273143K576530N56767J513302L637791
1670.4E51085532K257108K658844L806115J435339l64780J968681P292629M865408
1686.7E75004876J101434J114190L90291J820504L397525L531337N483150K555728
1703E94399035J135170K664626J550615J54018j18196J233101M715800M137695L70384
1721.4F10242248O0796R10163M99249k06054k39610L395140M091322r0897J88113J344978
$$ plain form
1741.8 620195448 620669782 620734572 621191502 623171091 625362933 625400543 625240147 625751078 626058698 627220631
1762.2 627220631 627674222 626915157 626494706 626788974 628985405 630916059 630466044 629809916 630048096
1780.5 630048096 630346119 630696058 630814791 629795849 629612267 631716311 632719278 631875932 631608665
1798.9 631608665 632505417 633188844 632971942 632546127 632622778 633228302 633455873 633178949 633195281 633258462
1819.3 633258462 632657707 632162333 632345796 632237494 632774293 633717775 633162379 632313430 632064819 631161213
1839.7 631161213 629768372 630316794 631778300 631487668 630640268 630036354 629512608 629088223 628812075
1858 628812075 628622293 628185034 627141833 626123428 626777947 628125131 627896369 626986980 626555622
1876.4 626555622 626378000 626182258 625896692 625445426 624817371 624767661 625174344 624849439 624344409 624142349
$$ packed form
1741.8F20195448M74334O4790M56930J979589K191842L7610j60396N10931L07620J161933
1762.2F27220631M53591p59065m20451K94268K196431J930654m50015o56128K38180
1780.5F30048096K98023L49939J18733j018942j83582K104044J002967q43346k67267
1798.9F31608665Q96752O83427k16902m25815P6651O05524K27571k76924J6332O3181
1819.3F33258462o00755m95374J83463j08302N36799R43482n55396q48949k48611r03606
1839.7F31161213j392841N48422J461506k90632q47400o03914n23746m24385k76148
1858F28812075j89782m37259j043201j018405O54519J347184k28762r09389m31358
1876.4F26555622j77622j95742k85566m51266o28055m9710M06683l24905n05030k02060
$$ plain form
1896.8 624142349 623800695 623359323 622876525 622264147 621726751 621565819 621462941 620724797 619609773
1915.1 619609773 619422615 619763196 619410455 619096160 618872166 618360400 617971659 617668390 617321551 616994917
1935.5 616994917 616552055 615914941 615765214 616111696 616023123 615646422 615364492 615102947 614826083 614567876
1955.9 614567876 614424467 614374816 614116907 613585174 613304794 613373697 613247871 612863421 612443626 612045050
1976.3 612045050 611725688 611429989 611053169 610556304 610022306 609519601 609246910 609243095 608874977 608082652
1996.7 608082652 607417107 606945753 606418252 605699778 604897797 604150414 603408337 602513850 601530135 600693703
2017.1 600693703 599895656 598955631 597971857 596969962 595943451 594965219 594060183 593191147 592272341
2035.5 592272341 591293514 590434909 589802325 589182675 588456273 587769330 587229073 586804628 586396933 585925341
$$ packed form
1896.8F24142349l41654m41372m82798o12378n37396j60932j02878p38144j115024
1915.1F19609773j87158L40581l52741l14295k23994n11766l88741l03269l46839l26634
1935.5F16994917m42862o37114j49727L46482q8573l76701k81930k61545k76864k58207
1955.9F14567876j43409m9651k57909n31733k80380O8903j25826l84450m19795l98576
1976.3F12045050l19362k95699l76820m96865n33998n02705k72691l815l68118p92325
1996.7F08082652o65545m71354n27501p18474q01981p47383p42077q94487r83715q36432
2017.1F00693703p98047r40025r83774j001895j026511r78232r05036q69036r18806
2035.5E92272341r78827q58605o32584o19650p26402o86943n40257m24445m07695m71592
$$ plain form
2055.9 585925341 585432112 585035384 584721684 584473789 584238887 583890498 583520591 583248556 582998574 582706094
2076.3 582706094 582401037 582099855 581787050 581454158 581120193 580824435 580572486 580329537 580057263 579721749
2096.7 579721749 579354405 579046369 578811824 578571737 578283012 577979743 577687085 577385485 577041626 576650381
2117.1 576650381 576256335 575890005 575536549 575187266 574834704 574460864 574074745 573709965 573371887 573001564
2137.5 573001564 572565079 572159827 571866751 571585894 571237504 570908308 570664108 570469379 570298910 570162952
2157.9 570162952 570085645 570092797 570136607 570158064 570200741 570318222 570494235 570689380 570861816 570976377 571070731
2180.3 571070731 571227133 571436644 571605861 571721196 571855307 572031498 572222471 572388351 572512627 572642207
2200.7 572642207 572803795 572979808 573175609 573394954 573607922 573802650 573956788 574026465 574072897 574163795
$$ packed form
2055.9E85925341m93229l96728l13700k47895k34902l48389l69907k72035k49982k92480
2076.3E82706094l05057l01182l12805l32892l33965k95758k51949k42949k72274l35514
2096.7E79721749l67344l08036k34545k40087k88725l03269k92658l01600l43859l91245
2117.1E76650381l94046l66330l53456l49283l52562l73840l86119l64780l38078l70323
2137.5E73001564m36485m05252k93076k80857l48390l29196k44200j94729j70469j35958
2157.9E70162952p7307P152M3810K1457M2677J17481J76013J95145J72436J14561R4354
2180.3E71070731J56402K09511J69217J15335J34111J76191J90973J65880J24276J29580
2200.7E72642207J61588J76013J95801K19345K12968J94728J54138O9677M6432R0898
$$ plain form
2221.1 574163795 574234426 574248910 574251950 574251771 574240029 574212551 574149549 574030459 573875487 573738158 573631704
2243.5 573631704 573546529 573448718 573309660 573168039 573064744 572976232 572869539 572767138 572696686 572673440
2263.9 572673440 572689950 572718501 572718978 572693646 572695196 572718620 572710812 572606623 572367728 572045445 571781874
2286.3 571781874 571610928 571419716 571165979 570884049 570601404 570306659 569941938 569437504 568849266 568292141
2306.7 568292141 567814589 567449868 567126989 566566706 565715432 565089107 565043151 565206289 564923704 564246953
2327.1 564246953 564009666 564304233 564146340 563428640 562963068 563084543 563785017 565647483 567489982
2345.5 567489982 564812005 558301568 553426802 552858233 554268539 555706143 557094693 558341086
2361.8 558341086 559341848 560121655 560743272 561184883 561282039 561003625 560444355 559585631 558403254
$$ packed form
2221.1E74163795P0631J4484L040j79j1742k7478o3002j19090j54972j37329j06454
2243.5E73631704q5175r7811j39058j41621j03295q8512j06693j02401p0452k3246
2263.9E72673440J6510K8551M77k5332J550K3424p808j04189k38895l22283k63571
2286.3E71781874j70946j91212k53737k81930k82645k94745l64721n04434n88238n57125
2306.7E68292141m77552l64721l22879n60283q51274o26325m5956J63138k82585o76751
2327.1E64246953k37287K94567j57893p17700m65572J21475P00474J862466J842499
2345.5E67489982k677977o510437m874766n68569J410306J437604J388550J246393
2361.8E58341086J000762P79807O21617M41611R7156k78414n59270q58724j182377
$$ plain form
2380.2 558403254 556997240 555568695 554324865 553407133 552762508 552185118 551541507 550875127 550275266
2398.5 550275266 549758077 549219310 548547208 547812581 547138214 546513557 545863032 545138836 544354618 543596685
2418.9 543596685 542892039 542178452 541381657 540506482 539652586 538876116 538145125 537343502 536432385 535556257
2439.3 535556257 534794867 534030080 533162355 532242298 531381547 530627549 529898047 529097021 528256953 527477741
2459.7 527477741 526792347 526148796 525435328 524620175 523831487 523168147 522584617 521957159 521212578 520457625
2480.1 520457625 519836009 519295931 518713534 518072903 517454803 516941428 516510129 516054928 515516818 514959812
2500.5 514959812 514491141 514091313 513622820 513039112 512471557 512024879 511603594 511093378 510478735 509821117
2520.9 509821117 509251356 508758426 508204699 507550895 506842613 506176591 505582452 504949033 504214525 503452957
$$ packed form
2380.2E58403254j406014j428545j243830r17732o44625n77390o43611o66380n99861
2398.5E50275266n17189n38767o72102p34627o74367o24657o50525p24196p84218p57933
2418.9E43596685p04646p13587p96795q75175q53896p76470p30991q01623r11117q76128
2439.3E35556257p61390p64787q67725r20057q60751p53998p29502q01026q40068p79212
2459.7E27477741o85394o43551p13468q15153p88688o63340n83530o27458p44581p54953
2480.1E20457625o21616n40078n82397o40631o18100n13375m31299m55201n38110n57006
2500.5E14959812m68671l99828m68493n83708n67555m46678m21285n10216o14643o57618
2520.9E09821117n69761m92930n53727o53804p08282o66022n94139o33419p34508p61568
$$ plain form
2541.3 503452957 502765298 502152801 501541018 500870109 500172794 499537826 498971999 498419940 497794718 497099608
2561.7 497099608 496461779 495920002 495393217 494807601 494175613 493571281 493045419 492560863 492027789 491424888
2582.1 491424888 490848660 490358382 489889055 489387631 488843590 488265693 487736404 487277269 486751258 486106694
2602.5 486106694 485446125 484844714 484272927 483617932 482830703 481998056 481194258 480402112 479569584 478661716
2622.9 478661716 477732748 476831645 475922883 475020856 474123329 473163605 472180843 471260101 470354587 469388694
2643.3 469388694 468410492 467498988 466635108 465769678 464883178 463957787 463065475 462295145 461565912 460767865
2663.7 460767865 459930420 459128857 458388358 457694679 457013845 456319481 455622256 454959720 454341501 453720868
2684.1 453720868 453052729 452355564 451697409 451097697 450506270 449885994 449227601 448563933 447927445 447283596
$$ packed form
2541.3E03452957o87659o12497o11783o70909o97315o34968n65827n52059o25222o95110
2561.7D97099608o37829n41777n26785n85616o31988o04332n25862m84556n33074o02901
2582.1D91424888n76228m90278m69327n01424n44041n77897n29289m59135n26011o44564
2602.5D86106694o60569o01411n71787o54995p87229q32647q03798p92146q32528r07868
2622.9D78661716r28968r01103r08762r02027q97527r59724r82762r20742r05514r65893
2643.3D69388694r78202r11504q63880q65430q86500r25391q92312p70330p29233p98047
2663.7D60767865q37445q01563p40499o93679o80834o94364o97225o62536o18219o20633
2684.1D53720868o68139o97165o58155n99712n91427o20276o58393o63668o36488o43849
$$ plain form
2704.5 447283596 446587682 445860803 445189685 444592476 443968922 443273604 442582220 441967666 441409886 440814018
2724.8 440814018 440135151 439461052 438880026 438334018 437728256 437089384 436458468 435853660 435319811 434821993
2745.2 434821993 434280187 433686703 433098465 432556808 432055950 431576937 431088477 430580974 430095702 429634243
2765.6 429634243 429125279 428552806 428011358 427558690 427098811 426556706 425968081 425382018 424837291 424317867
2786 424317867 423744589 423072129 422382444 421770394 421192259 420532405 419736654 418898880 418155938 417489260
2806.4 417489260 416768312 415922463 415009677 414166182 413416952 412646055 411787182 410894394 410053462 409253359
2826.8 409253359 408426315 407553643 406638741 405715942 404799491 403807044 402716875 401604384 400521100
2845.2 400521100 399491876 398484856 397454619 396424025 395430088 394466281 393460214 392319828 391062498
$$ packed form
2704.5D47283596o95914p26879o71118n97209o23554o95318o91384o14554n57780n95868
2724.8D40814018o78867o74099n81026n46008o05762o38872o30916o04808n33849m97818
2745.2D34821993n41806n93484n88238n41657n00858m79013m88460n07503m85272m61459
2765.6D29634243n08964n72473n41448m52668m59879n42105n88625n86063n44727n19424
2786D24317867n73278o72460o89685o12050n78135o59854p95751q37774p42942o66678
2806.4D17489260p20948q45849r12786q43495p49230p70897q58873q92788q40932q00103
2826.8D09253359q27044q72672r14902r22799r16451r92447j090169j112491j083284
2845.2D00521100j029224j007020j030237j030594r93937r63807j006067j140386j257330
$$ plain form
2863.5 391062498 389782369 388516575 387270898 386035711 384758770 383470833 382271290 381181866
2879.9 381181866 380215257 379363179 378578067 377894759 377325445 376784682 376237839 375708699 375211924 374772191
2900.2 374772191 374365598 373918116 373416036 372921228 372446537 371878594 371137917 370283812 369453698 368750900
2920.6 368750900 368172169 367717385 367433757 367287427 367189944 367163420 367267072 367470920 367790699 368274808
2941 368274808 368830204 369343311 369810075 370296657 370867610 371459186 371947706 372318715 372667789 373083174
2961.4 373083174 373484910 373722255 373805642 373861700 374017000 374309897 374732733 375418574 376402020 377459556
2981.8 377459556 378440738 379355699 380249351 381113470 381863236 382454544 382881552 383113176 383164555 383118629
3002.2 383118629 383055687 382962853 382811069 382638127 382394612 381966710 381371230 380711526 380030572 379344225
$$ packed form
2863.5C91062498j280129j265794j245677j235187j276941j287937j199543j089424
2879.9C81181866r66609q52078p85112o83308n69314n40763n46843n29140m96775m39733
2900.2C74772191m06593m47482n02080m94808m74691n67943p40677q54105q30114p02798
2920.6C68750900n78731m54784k83628j46330r7483k6524J03652K03848L19779M84109
2941C68274808N55396N13107M66764M86582N70953N91576M88520L71009L49074M15385
2961.4C73083174M01736K37345Q3387N6058J55300K92897M22836O85841R83446J057536
2981.8C77459556R81182R14961Q93652Q64119P49766N91308M27008K31624N1379m5926
3002.2C83118629o2942r2834j51784j72942k43515m27902n95480o59704o80954o86347
$$ plain form
3022.6 379344225 378665566 377926141 377183110 376631409 376133800 375414640 374581128 373865515 373239011 372496486
3043 372496486 371562600 370619982 369851857 369136214 368316889 367504776 366745681 365925401 365084618 364404768
3063.4 364404768 363862067 363190383 362304717 361406982 360636413 359972209 359361380 358728468 358017445 357223094
3083.8 357223094 356396019 355623841 354869276 354051530 353298157 352678388 352025568 351310343 350594401 349866897
3104.2 349866897 349198312 348578066 347879440 347205013 346716315 346273988 345655590 344843358 343987107 343212605
3124.6 343212605 342530757 341842920 341154337 340592206 340066731 339494646 338896900 338196933 337449819 336767375
3145 336767375 336152852 335630208 335128963 334475160 333685070 332938612 332282394 331615418 330935121 330327034
3165.4 330327034 329770952 329164922 328500330 327824920 327184826 326669991 326137066 325403661 324679911 324126869
$$ packed form
3022.6C79344225o78659p39425p43031n51701m97609p19160q33512p15613o26504p42525
3043C72496486r33886r42618p68125p15643q19325q12113p59095q20280q40783o79850
3063.4C64404768n42701o71684q85666q97735p70569o64204o10829o32912p11023p94351
3083.8C57223094q27075p72178p54565q17746p53373o19769o52820p15225p15942p27504
3104.2C49866897o68585o20246o98626o74427m88698m42327o18398q12232q56251p74502
3124.6C43212605o81848o87837o88583n62131n25475n72085n97746o99967p47114o82444
3145C36767375o14523n22644n01245o53803p90090p46458o56218o66976o80297o08087
3165.4C30327034n56082o06030o64592o75410o40094n14835n32925p33405p23750n53042
$$ plain form
3185.8 324126869 323584259 322948337 322251707 321549237 320942968 320420027 319849640 319209903 318543375 317865133
3206.2 317865133 317244321 316691935 316143841 315597177 315001369 314403236 313861817 313240528 312557787 311965764
3226.6 311965764 311494619 311110705 310670823 310035706 309309870 308637768 308020920 307500452 307119191 306683034
3247 306683034 306050599 305404663 304924816 304537475 304085582 303598672 303143799 302685440 302216679 301766634
3267.4 301766634 301339358 300904185 300469548 299994767 299401313 298756868 298183411 297686636 297192752 296722114
3287.8 296722114 296349853 296027839 295570552 294937819 294302762 293714821 293218225 292843938 292402983 291768163
3308.2 291768163 290987879 290201068 289513141 288877666 288192451 287450403 286793828 286267847 285688400 284962237
3328.6 284962237 284151167 283364564 282761037 282264650 281587064 280773193 279995501 279183596 278389007 277677983
$$ packed form
3185.8C24126869n42610o35922o96630p02470o06269n22941n70387o39737o66528o78242
3206.2C17865133o20812n52386n48094n46664n95808n98133n41419o21289o82741n92023
3226.6C11965764m71145l83914m39882o35117p25836o72102o16848n20468l81261m36157
3247C06683034o32435o45936m79847l87341m51893m86910m54873m58359m68761m50045
3267.4C01766634m27276m35173m34637m74781n93454o44445n73457m96775m93884m70638
3287.8B96722114l72261l22014m57287o32733o35057n87941m96596l74287m40955o34820
3308.2B91768163p80284p86811o87927o35475o85215p42048o56575n25981n79447p26163
3328.6B84962237q11070p86603o03527m96387o77586q13871p77692q11905p94589p11024
$$ plain form
3348.9 277677983 276903361 276024014 275187522 274437904 273697227 272932410 272194564 271620661 271119982 270401031
3369.3 270401031 269464314 268576801 267824203 267105520 266370803 265627593 264996767 264513344 263993204 263457656
3389.7 263457656 263029456 262497991 261892706 261505872 261164904 260556132 259786934 259174526 258727729 258289486
3410.1 258289486 257852107 257360399 256739020 256269097 256192684 256130576 255787343 255428225 255222052 255086929
3430.5 255086929 254993826 254881620 254620731 254170358 253743291 253412634 253244638 253550261 253836989 253629059
3450.9 253629059 253415078 253406912 253454894 253538281 253681809 253885478 254176199 254528642 254612684 254403621
3471.3 254403621 254320681 254426092 254465818 254596651 255068958 255442441 255525976 255727977 256006718 256131619
3491.7 256131619 256317914 256720215 256926388 256848574 257310748 258101523 258118182 258080006 258798927 259447098
$$ packed form
3348.9B77677983p74622q79347q36492p49618p40677p64817p37846n73903n00679p18951
3369.3B70401031r36717q87513p52598p18683p34717p43210o30826m83423n20140n35548
3389.7B63457656m28200n31465o05285l86834l40968o08772p69198o12408m46797m38243
3410.1B58289486m37379m91708o21379m69923p6413o2108l43233l59118k06173j35123
3430.5B55086929r3103j12206k60889m50373m27067l30657j67996L05623K86728k07930
3450.9B53629059k13981q166M7982Q3387J43528K03669K90721L52443Q4042k09063
3471.3B54403621q2940J05411L9726J30833M72307L73483Q3535K02001K78741J24901
3491.7B56131619J86295M02301K06173p7814M62174P90775J6659l8176P18921O48171
$$ plain form
3512.1 259447098 259562731 259547859 259556592 259639680 260186374 261015087 261719674 262530684 263111532 263106883 263295472
3534.5 263295472 264024436 264408052 264071584 263998628 265278876 266993850 267262369 267228127 268251121
3552.9 268251121 268887430 268746495 268871367 268757582 267652720 268434614 273304760 276638716 275640130
3571.3 275640130 274447829 274802685 275703222 276535809 276428968 275081903 275716543 280617565 283593148
3589.6 283593148 282248765 282155126 284179330 285480082 286571443 287494630 286490530 285740614 288260818
3608 288260818 291356266 292927355 293496192 293039411 295874953 301352620 301419824 296195894 293365538
3626.3 293365538 301629812 311510205 311459601 309880942 310221493 310837179 311477691 310283482 306887269
3644.7 306887269 307508558 318742961 329319835 327706039 325460404 329729229 332328171 331779033
$$ packed form
3512.1B59447098J15633j4872Q733Q3088N46694Q28713P04587Q11010N80848m649J88589
3534.5B63295472P28964L83616l36468p2956J280248J714974K68519l4242J022994
3552.9B68251121O36309j40935J24872j13785j104862P81894M870146L333956r98586
3571.3B75640130j192301L54856R00537Q32587j06841j347065O34640M901022K975583
3589.6B83593148j344383r3639K024204J300752J091361R23187j004100p49916K520204
3608B88260818L095448J571089N68837m56781K835542N477667O7204n223930k830356
3626.3B93365538Q264274R880393n0604j578659L40551O15686O40512j194209l396213
3644.7C06887269O21289J1234403J0576874j613796k245635M268825K598942n49138
$$ plain form
3661 331779033 331366867 329230577 327298492 332408249 337795764 337499321 345151365 354360640 353466541
3679.4 353466541 350358844 346766979 342799187 345542133 356344372 362358212 360642433 357673645
3695.7 357673645 355627269 355925232 359947890 361693889 357643187 354021311 357743919 367307454
3712 367307454 370092809 365328282 361358732 360840201 362236142 364249170 365716159 362988412 358027577
3730.3 358027577 358043700 365336508 373275012 371474773 360910803 356790990 366265804 368449956
3746.7 368449956 364421576 371953279 378925383 374200284 368913263 370215982 371703058 368832350
3763 368832350 366940677 367442012 370270997 373523951 371941298 367789596 366643399 369750112 371540308
3781.3 371540308 370584995 370781034 371008664 369986027 367933422 365569830 365183085 364095956 364419371
$$ packed form
3661C31779033m12166k136290j932085N109757N387515k96443P652044R209275q94099
3679.4C53466541l107697l591865l967792K742946J0802239O013840j715779k968788
3695.7C57673645k046376K97963M022658J745999m050702l621876L722608R563535
3712C67307454K785355m764527l969550n18531J395941K013028J466989k727747m960835
3730.3C58027577J6123P292808P938504j800239j0563970m119813R474814K184152
3746.7C68449956m028380P531703O972104m725099n287021J302719J487076k870708
3763C68832350j891673N01335K828985L252954j582653m151702j146197L106713J790196
3781.3C71540308r55313J96039K27630j022637k052605k363592l86745j087129L23415
$$ plain form
3799.7 364419371 371040881 372346044 371018559 374770403 372861803 364735574 361085683 365193605
3816 365193605 366546988 368505001 375267476 374310553 369918972 367370665 365270108 364146352 362496257
3834.4 362496257 363857210 370330602 373588800 372931510 371539891 366458178 356826037 350170076
3850.7 350170076 362136215 381088465 378737777 368045181 362210691 362977624 365033448 362986445
3867 362986445 364000976 369076699 370156556 367912292 363147348 361453205 363492340 363323212 365505487
3885.4 365505487 366074741 363048255 365010142 366166592 360525340 355861664 356970638 361376554
3901.7 361376554 366697013 368907094 365882546 362061411 359532177 357389599 357533991 360014230
3918 360014230 360697120 359254926 359027535 359071910 357263327 356668144 358728915 359542340 357862800
$$ packed form
3799.7C64419371O621510J305163j327485L751844j908600q126229l649891M107922
3816C65193605J353383J958013O762475r56923m391581k548307k100557j123756j650095
3834.4C62496257J360953O473392L258198o57290j391619n081713r632141o655961
3850.7C50170076J1966139J8952250k350688j0692596n834490P66933K055824k047003
3867C62986445J014531N075723J079857k244264m764944j694143K039135j69128K182275
3885.4C65505487N69254l026486J961887J156450n641252m663676J108974M405916
3901.7C61376554N320459K210081l024548l821135k529234k142578J44392K480239
3918C60014230O82890j442194k27391M4375j808583n95183K060771Q13425j679540
$$ plain form
3936.3 357862800 355819970 355000257 356010169 356401294 355406046 355643421 356367022 355857551 354964793
3954.7 354964793 354409248 354010671 353982836 354178429 353778929 353043169 352655053 352481812 352367997 352384508
3975.1 352384508 352225929 351818889 351549536 351429045 351105839 350603104 350286901 350141287 349986821 349876970
3995.5 349876970 349684060
3997.5 349684060
$$ packed form
3936.3C57862800k042830q19713J009912L91125r95248K37375P23601n09471q92758
3954.7C54964793n55545l98577k7835J95593l99500p35760l88116j73241j13815J6511
3975.1C52384508j58579m07040k69353j20491l23206n02735l16203j45614j54466j09851
3995.5C49876970j92910
3997.5C49684060
##END=$$ End of the data block
