##TITLE=Sample description $$ Begin of the data block
##JCAMP-DX=5.00 $$ ACD/SpecManager v 10.08
##SPECTROMETER/DATA SYSTEM=Alpha
##DATE=03 Jun 2014 08:26:22
##DATA TYPE=INFRARED SPECTRUM
##DATA CLASS=XYDATA
##ORIGIN=
##OWNER=
##NPOINTS=1765
##FIRSTX=399.75695801
##LASTX=3997.56933594
##MAXX=3997.56933594
##MINX=399.75695801
##MAXY=0.64407301
##MINY=0.25638628
##XFACTOR=1.0000000000
##YFACTOR=1.000000000000000e-9
##FIRSTY=0.59785157
##DELTAX=2.03957629
##XUNITS=1/CM
##YUNITS=ARBITRARY UNITS
##XYDATA=(X++(Y..Y))
399.8E97851574P79272m15028q96215K03729J605034J577615J06931q98957m2379J056552
420.2F00928128l24488j700103r77397K95937L10480q35895j747429p48694J265347
438.5E96465886J507640n3645q76903L70502J765132J001477j154303j722038J73390
456.9E97477138J626849P1645k274930k316714j44541J102328m07994k543270j952410
475.2E90638101N98848J673520L5941j868188j123429J221359J698017n08725k460063
493.6E89905381j168549J424551J280844j318037k563715p97749J296044P91192j547098
511.9E87302864k642394j174211P39515L06070j612246j918257J87099K092779J528680
530.3E84809899o9022j77204J425802K568305J512229n01156q48591O08563J403571
$$ plain form
399.8 597851574 598630846 598215818 597319603 597523332 599128366 600705981 600812912 599913955 599871576 600928128
420.2 600928128 600603640 598903537 597926140 598222077 598532557 597696662 595949233 595200539 596465886
438.5 596465886 597973526 597919881 597042978 597413480 599178612 600180089 599025786 597303748 597477138
456.9 597477138 599103987 599175632 596900702 594583988 594439447 595541775 595133781 592590511 590638101
475.2 590638101 591236949 592910469 592946410 591078222 589954793 591176152 592874169 592365444 589905381
493.6 589905381 588736832 590161383 591442227 590124190 587560475 586762726 588058770 588849962 587302864
511.9 587302864 584660470 583486259 584225774 584531844 582919598 581001341 581188440 583281219 584809899
530.3 584809899 584740877 584563673 585989475 588557780 590070009 589568853 588720262 589328825 590732396
548.6E90732396J11162j587093j464665o5088L85404p44999k021968j941204r38356
567E82465589n45204j026868j359880o75917O48320J316964Q70466L78132R96828J899302
587.4E84967732J475275K51293k16007K96414P17103K09868o19113q02040k93196K50638
607.8E86237967J50263k22265P7903Q94785J311183J091957R09865J312732J851798
626.1E93616188J622259Q06987L65198M78149O37412L81469j23798j29760M51505P81298
646.5E98886907L88444k07305j86861L72469N93067J44958l33309k13265K35259O02722
666.9F00283086M66764q3744J68621Q82447R38356Q7321m66168O0916P87079O89805
687.3F03814483k9922n45263l59297Q1301j40131r80079j381934q68201o8962K02715
$$ plain form
548.6 590732396 590843558 589256465 587791800 587726712 588112116 587367117 585345149 583403945 582465589
567 582465589 581920385 580893517 579533637 578857720 579506040 580823004 581693470 582071602 583068430 584967732
587.4 584967732 586443007 586694300 586478293 586774707 587491810 587701678 587082565 586280525 585987329 586237967
607.8 586237967 586388230 586165965 586243868 587138653 588449836 589541793 590451658 591764390 593616188
626.1 593616188 595238447 596045434 596410632 596888781 597526193 597907662 597783864 597654104 598105609 598886907
646.5 598886907 599275351 599068046 598881185 599253654 599846721 599991679 599658370 599445105 599680364 600283086
666.9 600283086 600749850 600666106 600834727 601717174 602655530 602742851 602276683 602337599 603124678 603814483
687.3 603814483 603784561 603239298 602880001 602961302 602821171 601841092 600459158 599590957 599521995 599724710
707.7E99724710j74344k10881P84993J799286J762986J151800J048684J653373K154887
726.1F09695494J819611R46462N50985Q86798J118183N97775k58147o66261m81904
744.4F14208996l92794j075566k032876k199471j538158r71675q99136p80761k13384
762.8F04105175P05659J546860J824081J727581J866281K258420K397716K081692J626313
781.2F20139778J454115J563787J495719J164496J013815J230240J536906J663029
797.5F31261885J728654J869977J848280J589835J339793J171887J037657Q94964O99341
815.8F43442273M60804J69932j12295m30047j022399j676440j943171j979589k223909
834.2F34685159k567530k508163j955867j318634r80258r23633p86782l56793J11461
$$ plain form
707.7 599724710 599550366 599339485 600124478 601923764 603686750 604838550 605887234 607540607 609695494
726.1 609695494 611515105 612461567 613012552 613899350 615017533 615615308 615357161 614690900 614208996
744.4 614208996 613816202 612740636 610707760 608508289 606970131 605998456 605099320 604318559 604105175
762.8 604105175 604810834 606357694 608181775 609909356 611775637 614034057 616431773 618513465 620139778
781.2 620139778 621593893 623157680 624653399 625817895 626831710 628061950 629598856 631261885
797.5 631261885 632990539 634860516 636708796 638298631 639638424 640810311 641847968 642742932 643442273
815.8 643442273 643903077 644073009 643960714 643530667 642508268 640831828 638888657 636909068 634685159
834.2 634685159 632117629 629609466 627653599 626334965 625354707 624431074 623644292 623287499 623398960
852.5F23398960J99854q4460j66118M47273J440287J957655J826286J779080K108812
870.9F32907629K230585J605868N35428j27613j57714j93357q00431j754403k277315
889.3F31968677j962542j328886j213014j643062j851201j443028j039982j453400
905.6F20033562k414584k914131k643346k311469k586960l132880l037214k064228
921.9E98928750j039863q09968j112878r44555O020Q61526Q51214N21660R16779K035498
942.3F00214183K778054K246022Q29875l12984p99179j287460k310336l450572l859043
960.6E94048560l511966l327012l889203m696965m869640m344940l958464m242360
977E61208010m653752m324079l263235k318442k074659k147495j738906q32319j69933
$$ plain form
852.5 623398960 623598814 623514354 623348236 623795509 625235796 627193451 629019737 630798817 632907629
870.9 632907629 635138214 636744082 637279510 637151897 636994183 636800826 636000395 634245992 631968677
889.3 631968677 630006135 628677249 627464235 625821173 623969972 622526944 621486962 620033562
905.6 620033562 617618978 614704847 612061501 609750032 607163072 604030192 600992978 598928750
921.9 598928750 597888887 597078919 595966041 595021486 595027506 595889032 596740246 597261906 598178685 600214183
942.3 600214183 602992237 605238259 606068134 605755150 604955971 603668511 601358175 597907603 594048560
960.6 594048560 590536594 587209582 583320379 578623414 573753774 569408834 565450370 561208010
977 561208010 556554258 552230179 548966944 546648502 544573843 542426348 540687442 539855123 539685190
995.3E39685190k25961o32525o39975j89424j4841n40376j222253j336038r12487n37753
1015.7E33433557o18935q86500p01964k6882M42923L12924n7340j75714m5717j10209
1036.1E31566143n86450j097620j085043n06162J10328L65615M85778R04500J569510
1054.5E31726599K030909K014339J780987J760363J941323J847506R38535o48499k010286
1072.8E41381776k425074k098322j620293j104295m47214K41399P29680R35972R75191
1091.2E36568820J015246J104713J033544O82176L30030K42770L47674M43757M15325
1109.5E42184055L40044L91126N36025N66244M45425L48270L75867M51267N69463P77006
1129.9E46984792Q29339N50329R4057m32074r55523j381754j665593j761973j703262
$$ plain form
995.3 539685190 539459229 538826704 538186729 537997305 537982464 537442088 536219835 534883797 533971310 533433557
1015.7 533433557 532814622 531928122 531226158 531199276 531642199 531955123 531897783 531722069 531676352 531566143
1036.1 531566143 530979693 529882073 528797030 528290868 528401196 528766811 529252589 530157089 531726599
1054.5 531726599 533757508 535771847 537552834 539313197 541254520 543102026 544040561 543392062 541381776
1072.8 541381776 538956702 536858380 535238087 534133792 533686578 533927977 534657657 535593629 536568820
1091.2 536568820 537584066 538688779 539722323 540404499 540734529 540977299 541324973 541768730 542184055
1109.5 542184055 542524099 542915225 543451250 544017494 544462919 544811189 545187056 545638323 546207786 546984792
1129.9 546984792 547814131 548364460 548458517 548026443 547070920 545689166 544023573 542261600 540558338
1148.3E40558338j518786j231789r49860o54876k70069J85430O72519J123548J529097
1166.6E39443552J991451K564073L102243L389180L376603L259539L193617L029645
1182.9E63349903K606034K007306J389682Q65459M63128R4414k46763l80695j96576
1201.3E69951892J32918L88384N73456Q01504J070619J216650J094341P30872L19719
1219.7E76280355L9757j37389l52502o42478q37982p53939n00739l64363l94523l79562
1240.1E71956635j87517P9930K20478J73449J09911J79708L09408L16381J73509O6162
1260.4E73398054J09970K26677K57790J50621K8073M828O4075P6414o2228k66194l66569
1282.9E73621511l43263l29792m71771o76334p20799o30557n69880n54383m84944l39448
$$ plain form
1148.3 540558338 539039552 537807763 536857903 536203027 535932958 536118388 536790907 537914455 539443552
1166.6 539443552 541435003 543999076 547101319 550490499 553867102 557126641 560320258 563349903
1182.9 563349903 565955937 567963243 569352925 570218384 570681512 570775926 570529163 570148468 569951892
1201.3 569951892 570084810 570473194 571046650 571848154 572918773 574135423 575229764 575960636 576280355
1219.7 576280355 576320112 576182723 575830221 575187743 574349761 573595822 573095083 572730720 572336197 571956635
1240.1 571956635 571769118 571849048 572069526 572242975 572352886 572532594 572842002 573158383 573331892 573398054
1260.4 573398054 573508024 573734701 573992491 574143112 574171185 574176013 574240088 574316502 574254274 573988080 573621511
1282.9 573621511 573278248 572948456 572476685 571800351 571079552 570448995 569879115 569324732 568839788 568500340
1303.3E68500340j51873R835j7583k30134m36783n94258o57320o92487r19461j150548
1323.7E63659728j168848j100838j064658j069367j071691r41098m87030K5630m5895
1342E56735933m11809m83632l95059m01557n66780o80864o76930p83026p42436l36289
1362.4E51257551l37541p14481o20902m90606l45230O7294Q5175n2750p1407k79784
1382.8E48497319j65462Q18193J203596K10345k34961M1067r2208j55449l91722p84695
1403.2E48946023n78523n84304o82235m06742n46515j147270o13332R38356N53489
1421.6E45878947k08378k22445l43740J47105K18749m54545M89652J511037K56002
1439.9E47272384l36528l24070m38869j57058k61367j084923j538158L29912K495110
$$ plain form
1303.3 568500340 568348467 568358302 568340719 568110585 567673802 567079544 566422224 565729737 564810276 563659728
1323.7 563659728 562490880 561390042 560325384 559256017 558184326 557243228 556756198 556781828 556735933
1342 556735933 556324124 555840492 555445433 555043876 554477096 553796232 553119302 552336276 551593840 551257551
1362.4 551257551 550920010 550205529 549584627 549094021 548748791 548816085 548901260 548848510 548777103 548497319
1382.8 548497319 548331857 549150050 550353646 550563991 550329030 550370097 550277889 550122440 549730718 548946023
1403.2 548946023 548367500 547783196 547100961 546694219 546147704 545000434 544387102 545325458 545878947
1421.6 545878947 545670569 545448124 545104384 545251489 545470238 545015693 545505345 547016382 547272384
1439.9 547272384 546935856 546611786 546172917 546015859 545754492 544669569 543131411 543461323 545956433
1458.3E45956433L86774o61909J060605J872480M07934O06656L525972M594267L058672
1476.6E60807884K163410K262413K491057K000034J855552L069878L638864J726389
1493E80015481J137137K878308K897442P12573j072705M09842N004644L221453K0027
1511.3E95224202k31386K95997O88017O63101J970053K015829Q81255Q10206l07680
1529.7F02009594l48866J241506l28005j890659J670241L694952J190126o8784o52075
1548F06518030n22911n14210j099765j655042K062261N318761l26634k235531j362145
1566.4F06182814j87993P61449j194239j498401J347184M91143j656652j528501j215220
1584.7F01501584j391411j574993j777351j974284k105892k356708k710223k885580
$$ plain form
1458.3 545956433 546343207 545681298 546741903 548614383 549022317 549628973 553154945 557749212 560807884
1476.6 560807884 562971294 565233707 567724764 569724798 571580350 574650228 578289092 580015481
1493 580015481 581152618 584030926 586928368 587640941 586568236 586978078 591982722 595204175 595224202
1511.3 595224202 594992816 595288813 595976830 596639931 598609984 600625813 601507068 602317274 602009594
1529.7 602009594 601660728 602902234 602574229 600683570 602353811 606048763 607238889 607170105 606518030
1548 606518030 605995119 605480909 604381144 602726102 604788363 610107124 609780490 607544959 606182814
1566.4 606182814 605994821 606756270 605562031 604063630 605410814 605901957 604245305 602716804 601501584
1584.7 601501584 600110173 598535180 596757829 594783545 592677653 590320945 587610722 584725142
1601.1E84725142k965272l207385l365219l354669l789782m592479l844738k215743
1617.4E57389855l364503m172504k893090k440810k562762k500057l316343k687871
1633.7E33451915P05004J054108j234770j806379j442134R73106J856982j550436P36714
1652E32744110P121324K286852j289845m3452K385915K706885O21319J571893L760815
1670.4E51865816K340496K757966L978610J526118l74198J984834P446468N005539
1686.7E76531649J150131J130104L67939J821638L431141L574729N598724K636671
1703E96242726J199007K759933J594603J32800j48356J269340M818201M201770L74794
1721.4F12444818P1824R29653M70817k94864l05235L517329M256428r0778J83344J386821
$$ plain form
1601.1 584725142 581759870 578552485 575187266 571832597 568042815 563450336 559605598 557389855
1617.4 557389855 554025352 549852848 546959758 544518948 541956186 539456129 536139786 533451915
1633.7 533451915 534156919 535211027 533976257 532169878 530727744 531700850 533557832 532007396 532744110
1652 532744110 539865434 542152286 540862441 540818989 543204904 545911789 546533108 548105001 551865816
1670.4 551865816 554206312 556964278 560942888 562469006 562094808 564079642 571526110 576531649
1686.7 576531649 577681780 578811884 579179823 581001461 584432602 588007331 593606055 596242726
1703 596242726 597441733 600201666 601796269 601929069 601780713 603050053 607868254 612070024 612444818
1721.4 612444818 612516642 613446295 613917112 613622248 613317013 616834342 621090770 620999992 621183336 622570157
1741.8F22570157M75347L3259M38154J995266K234459P2121j11460N55694L14355J204788
1762.2F29782140M90308p93815m72486K55406K218783J990617m34280o56187K54392
1780.5F32634878L40104M01140J26004j071573k11238K172648J046956q86500k85744
1798.9F34266675R48190P10964k40445m62472O0439O73473L46184k23816k1100O855
1819.3F36064947o18458m76718K28763m5836O06119R70960n87344q81255k68221r42469
1839.7F34050488j434147N76913J543403k52306q50261n96046m95553m18484l03447
1858F31820560k20418m37737j003981r77754P00295J400709k52426r87053m47988j49846
1878.4F29444361j95205k90037m11093n65290l3558L57032l87073m97639j38163l19898
$$ plain form
1741.8 622570157 623045504 623078763 623516917 625512183 627746642 627818763 627707303 628262997 628577352 629782140
1762.2 629782140 630272448 629478633 629006147 629261553 631480336 633470953 633036673 632380486 632634878
1780.5 632634878 632974982 633376122 633502126 632430553 632219315 634391963 635438919 634552419 634266675
1798.9 634266675 635214865 635925829 635685384 635222912 635283351 635956824 636303008 636079192 636058092 636064947
1819.3 636064947 635446489 634969771 635198534 635152698 635758817 636729777 636142433 635261178 634992957 634050488
1839.7 634050488 632616341 633193254 634736657 634484351 633634090 633038044 632542491 632124007 631820560
1858 631820560 631600142 631162405 630158424 629180670 629880965 631281674 631029248 630042195 629594207 629444361
1878.4 629444361 629249156 628959119 628548026 627982736 627949178 628306210 627919137 627421498 627283335 626963437
1898.8F26963437m59612m61280n47767m94957j78337j47343p51793j120508k03073
1917.2F22598767L36767l49343k80738j75178n04554m11570k92003k98500l06070m56869
1937.6F19860709o37353j27315L48389j08123l65257k55048k81394l12507k44796j03951
1958F17773354j8775k44618n35071k63393J11223j04845l91901m31060m17590l35098
1978.4F15142226k65598l17693m65929n40018n26250k93732m172l57151p63774o22391
1998.8F10985518m72665n62847p27236p84636p21693p32362r22263j006663q03589
2017.1F04251564p43986r17434r92000j006604r93788r36210r04083r08494r66311
2035.5E95882654r98735q49068o17743n98550o84738o39677n29051m39286m08053m54307
$$ plain form
1898.8 626963437 626503825 626042545 625494778 624999821 624821484 624674141 623922348 622801840 622598767
1917.2 622598767 622935534 622586191 622305453 622130275 621625721 621214151 620922148 620623648 620317578 619860709
1937.6 619860709 619223356 619096041 619444430 619336307 618971050 618716002 618434608 618122101 617877305 617773354
1958 617773354 617754579 617509961 616974890 616711497 616822720 616717875 616325974 615894914 615477324 615142226
1978.4 615142226 614876628 614558935 614093006 613552988 613026738 612733006 612728834 612371683 611607909 610985518
1998.8 610985518 610512853 609950006 609222770 608438134 607716441 606984079 606061816 605055153 604251564
2017.1 604251564 603507578 602590144 601598144 600591540 599597752 598661542 597757459 596848965 595882654
2035.5 595882654 594883919 594034851 593417108 592818558 592133820 591494143 590965092 590525806 590117753 589663446
2055.9E89663446m59671l78966l18110k26558k00510l36468l82423k96831k59221l04163
2076.3E86500525l33070k83599k46704l03089l71337l17991k09928k16245k82407l15190
2096.7E83620965l04102k37883j86383k24471k98918l15427l10600l21388l20852l51131
2117.1E80749810l83377l60489l41833l55363l66270l48628l27289l34799l46542l72767
2137.5E77212453m15564l91423l12746k94089l21687l17692k60830j67608j03236r6738
2157.9E74530840p5400q881L0577L6955P9036J55210K05219J86861J30772J13487J59681
2180.3E75544357K04504J92225J55210J36257J52468J80006J91450J95146J84417J82152
2200.7E77318192J84476J76847J83284J87278K00331K20180J75237R7752P7546R0539
$$ plain form
2055.9 589663446 589203775 588824809 588506699 588280141 588079631 587743163 587360740 587063909 586804688 586500525
2076.3 586500525 586167455 585883856 585637152 585334063 584962726 584644735 584434807 584218562 583936155 583620965
2096.7 583620965 583316863 583078980 582892597 582668126 582369208 582053781 581743181 581421793 581100941 580749810
2117.1 580749810 580366433 580005944 579664111 579308748 578942478 578593850 578266561 577931762 577585220 577212453
2137.5 577212453 576796889 576405466 576092720 575798631 575476944 575159252 574898422 574730814 574627578 574530840
2157.9 574530840 574455440 574446559 574477136 574514091 574593127 574748337 574953556 575140417 575271189 575384676 575544357
2180.3 575544357 575748861 575941086 576096296 576232553 576385021 576565027 576756477 576951623 577136040 577318192
2200.7 577318192 577502668 577679515 577862799 578050077 578250408 578470588 578645825 578743577 578821123 578911662
2221.1E78911662Q6486N4956J3351m947P15j7225o2168p7844j01566j31071j04367
2243.5E78567982p9513j06573j30415j22547r7036o1870m0352m3631n2214j8418N186
2265.9E77820599l8385n3108J3709O5446L2663k3424q4460j81854k63095k35259j87576
2288.4E76865256k31087k64705k31921k15829k94089m18365n12004n52714n26607m30107
2308.8E73187828l12328k96951n72204q87871o73056q4459K05516j95860o56605k67208
2329.2E69446802L16143n5671o37590m43042J43111O98507J843095J855969k702117
2347.5E70465207o580651m933774o26147J419902J639485J661241J351953R59992P66754
2365.9E66123962O31750M09484P3194k60949n79655r19580j233995j470030j482427
$$ plain form
2221.1 578911662 578998148 579053104 579066455 579061508 579062223 579044998 578982830 578904986 578803420 578672349 578567982
2243.5 578567982 578488469 578381896 578251481 578128934 578031898 577970028 577929676 577886045 577833831 577815413 577820599
2265.9 577820599 577782214 577729106 577742815 577808261 577840924 577817500 577733040 577551186 577288091 577052832 576865256
2288.4 576865256 576634169 576369464 576137543 575921714 575627625 575209260 574697256 574144542 573617935 573187828
2308.8 573187828 572875500 572578549 572006345 571118474 570445418 570360959 570566475 570370615 569714010 569446802
2329.2 569446802 569762945 569707274 569069684 568626642 568769753 569468260 571311355 573167324 570465207
2347.5 570465207 563884556 558950782 558324635 559744537 561384022 563045263 564397216 565357208 566123962
2365.9 566123962 566755712 567165196 567238390 566977441 566397786 565478206 564244211 562774181 561291754
2384.2E61291754j223802q62956o27518n80072o43611o70553o03497n26249n42224
2402.6E55011272o30378o67155o51419o41048o57797p13825p90417p75934o77109o63697
2423E48142493p77185q72374q18610p12752p35343q60333r24588q77738p80642p43389
2443.4E40039539q27610r23336q69870p41482p07924p61390q29160q10325p03097o35027
2463.8E32230318o89984p99298p95722o79433o10233o38485o80327o67393n99265n55456
2484.2E25514722n79238o23405o15597n19514m37140m59850n29647n44012m68492l96729
2504.6E20341098m35352n30481n48065m75824m34637m95851n99921o25968n38468m87149
2525E15169382n75066o83605o90222o02365n57482o51717p57694p48396o54101n78762
$$ plain form
2384.2 561291754 560067952 559204996 558577478 557997406 557353795 556683242 556079745 555553496 555011272
2402.6 555011272 554380894 553713739 553062320 552421272 551763475 551049650 550259233 549483299 548806190 548142493
2423 548142493 547365308 546492934 545674324 544961572 544226229 543365896 542441308 541563570 540782928 540039539
2443.4 540039539 539211929 538288593 537418723 536677241 535969317 535207927 534378767 533568442 532865345 532230318
2463.8 532230318 531540334 530741036 529945314 529265881 528655648 528017163 527336836 526669443 526070178 525514722
2484.2 525514722 524935484 524312079 523696482 523176968 522739828 522279978 521750331 521206319 520737827 520341098
2504.6 520341098 519905746 519375265 518827200 518351376 517916739 517420888 516820967 516194999 515656531 515169382
2525 515169382 514594316 513910711 513220489 512618124 512060642 511408925 510651231 509902835 509248734 508669972
2545.4E08669972o07132o83249o85393o14167n42521n40555o28471o86049o12259n15521
2565.8E02554655n31673n98133o33597o18399n28186m76480n48243o20067n69374m60088
2586.2D96970415m38303m97013n33611n34087m95255m41462m76092o08802o91801o39498
2606.6D91614491o00577o78956p79241q03143p71702p80791q29786q75145r14216r14633
2626.9D83666301q74371q71926r50575j000464r22203q37475q83192r90599j026571
2645.3D75308925r53585q41558q04007q66056r22173q90076p95156p39574p69049q17090
2665.7D66910601q11518p26640o57350p05182p73758p12514n77301n51968o39975o96064
2686.1D60058331o70373o02215n73099o18309o66201o76334o42478n97924o15806o67572
$$ plain form
2545.4 508669972 508062840 507379591 506694198 506080031 505537510 504996955 504368484 503682435 503070176 502554655
2565.8 502554655 502022982 501424849 500791252 500172853 499644667 499168187 498619944 497999877 497430503 496970415
2586.2 496970415 496532112 496035099 495501488 494967401 494472146 494030684 493554592 492945790 492253989 491614491
2606.6 491614491 491013914 490334958 489555717 488752574 487980872 487200081 486370295 485495150 484580934 483666301
2626.9 483666301 482791930 481920004 480969429 479968965 479046762 478209287 477326095 476335496 475308925
2645.3 475308925 474355340 473513782 472709775 471843719 470921546 470031470 469236314 468496740 467727691 466910601
2665.7 466910601 466099083 465372443 464715093 464009911 463236153 462523639 461946338 461394370 460754395 460058331
2686.1 460058331 459387958 458785743 458212644 457594335 456928134 456251800 455609322 455011398 454395592 453728020
2706.5D53728020o88523o82086o50495o10888o14554o42508o29753n90414o05613o76065
2726.9D47337121o85185n98759n34534n56290o19680o52462n95063n05895m91619n59330
2747.3D41538304o18756n94407n09113m37528m53889n18501n22495m64946m46736n11587
2767.7D36460346n46545m71204m13686m82887n70149n97298o12139n94825n18531n10811
2788.1D31142271o10888o77050o61760o07371o26833p40200p87407p51108p26760p44879
2808.5D24208015p88480q32379q50945q30204q09490q33273q65490q40902p95573q07732
2828.9D15953547q77172r40621r35167r02474r64254j080364j106203j067936j059026
2847.2D07020330j064211j032352j008153j010686r75490j000285j169622j316667
$$ plain form
2706.5 453728020 453039497 452357411 451706916 451096028 450481474 449838966 449209213 448618799 448013186 447337121
2726.9 447337121 446651936 446053177 445518643 444962353 444342673 443690211 443095148 442589253 442097634 441538304
2747.3 441538304 440919548 440325141 439816028 439378500 438924611 438406110 437883615 437418669 436971933 436460346
2767.7 436460346 435913801 435442597 435028911 434546024 433975875 433378577 432766438 432171613 431653082 431142271
2788.1 431142271 430531383 429854333 429192573 428585202 427958369 427218169 426430762 425679654 424952894 424208015
2808.5 424208015 423419535 422587156 421736211 420906007 420096517 419263244 418397754 417556852 416761279 415953547
2828.9 415953547 415076375 414135754 413200587 412298113 411333859 410253495 409147292 408079356 407020330
2847.2 407020330 405956119 404923767 403915614 402904928 401929438 400929153 399759531 398442864
2863.5C98442864j307815j234561j206696j229853j302093j324028j202136j046002
2879.9C88589680r39250q37654p46935p04795o46502n59896n24283n34743n40107m85391
2900.2C82070124m13745m21048m54485m55976m67062n41448p05421q61019q70317p64907
2920.6C76114696o10292m21166k43217j48088j27792k9534J74701L27170M10050N02557
2941C75949085N59032N44399M93347M86970N67884N69135M44412L76761M24474M62353
2961.4C80877852L74139K57462J80900J01030J26869K78651M59463P10576R70930J059950
2981.8C85397822J023560J008124R90659R07152P54446N84781M34161K42680P1853
3000.2C91415238J9193l1859j63376k04116r8854j34796l92914o03259o79820o97881
$$ plain form
2863.5 398442864 397135049 395900488 394693792 393463939 392161846 390837818 389635682 388589680
2879.9 388589680 387650430 386812776 386065841 385361046 384714544 384154648 383630365 383095622 382555515 382070124
2900.2 382070124 381656379 381235331 380780846 380324870 379857808 379316360 378610939 377749920 376879603 376114696
2920.6 376114696 375504404 375083238 374840021 374691933 374564141 374534607 374709308 375036478 375446528 375949085
2941 375949085 376508117 377052516 377545863 378032833 378600717 379169852 379614264 379991025 380415499 380877852
2961.4 380877852 381251991 381509453 381690353 381791383 381918252 382196903 382656366 383366942 384337872 385397822
2981.8 385397822 386421382 387429506 388420165 389327317 390081763 390666544 391100705 391343385 391415238
3000.2 391415238 391434431 391402572 391239196 391035080 390936226 390801430 390408516 389805257 389125437 388427556
3020.6C88427556o56754o33300p37249p86961o04450n10097o94662q40038p79212o74456
3041C81510377p16388q70169q83460p46130p86216r04351q01414p28637q13753q35955
3061.4C73423904p27027o00875o69390q68678r05424p89702o61642n70446o00606p35164
3081.8C66294950q47131q41051p74652p96467q46058p39217o34402p22617p14421o14882
3102.2C58764052o57647o59436o59287p68871p48664n68300m82023o20603q06839q19236
3122.6C51973146p48694p11888p30693p20591n83559n50300o23583o66023p68333p83414
3143C45086068o43134n47022n11467n25326o79254p99537p41899o97762p14630o57201
3163.4C38568836n87403o14673o68347o84261o87898o42717n30391n63592p17312p08282
$$ plain form
3020.6 388427556 387770802 387137502 386400253 385613292 385008842 384498745 383804083 382964045 382184833 381510377
3041 381510377 380793989 379923820 379040360 378294230 377508014 376603663 375802249 375073612 374259859 373423904
3061.4 373423904 372696877 372096002 371426612 370557934 369652510 368862808 368201166 367630720 367030114 366294950
3081.8 366294950 365447819 364606768 363832116 363035649 362189591 361450374 360815972 360093355 359378934 358764052
3102.2 358764052 358106405 357446969 356787682 356018811 355270147 354701847 354219824 353599221 352792382 351973146
3122.6 351973146 351224452 350512564 349781871 349061280 348477721 347927421 347303838 346637815 345869482 345086068
3143 345086068 344442934 343895912 343384445 342859119 342179865 341380328 340638429 339940667 339226037 338568836
3163.4 338568836 337981433 337366760 336698413 336014152 335326254 334683537 334153146 333589554 332872242 332163960
3183.7C32163960o27756o32108o70939p27386p33703o12140n32895o18726p00921p18653
3204.1C25588733o97017n97208n83202o54310o32316o29008o10679n34028n97119p16478
3224.5C19337368o97523n68271m29750m63098o71565p43777o49393o02841n23597l89248
3244.9C13598305m61251o49154o56128m96924m13775n12004n54323m82917m46439m60237
3265.3C08465153m74751m74662n02050m88638m57526n42521o10531n46872n13762n72771
3285.7C03281069n65618m41432l34263m06385o27965p62820p11679n30690m20690n17249
3306.1B97962278o38842p13587p30098o82413p29025q42124q45819o98895n72681o38932
3326.5B90869862p80225q36819p75934o11901n46068p39783r25720r35644r29594q60840
$$ plain form
3183.7 332163960 331536204 330904096 330233157 329505771 328772068 328159928 327627033 327008307 326307386 325588733
3204.1 325588733 324891716 324294508 323711306 323056996 322424680 321795672 321184993 320650965 320053846 319337368
3224.5 319337368 318639845 318071574 317641824 317178726 316507161 315763384 315113991 314511150 313987553 313598305
3244.9 313598305 313137054 312487900 311831772 311334848 310921073 310409069 309854746 309371829 308925390 308465153
3265.3 308465153 307990402 307515740 307013690 306525052 306067526 305525005 304914474 304367602 303853840 303281069
3285.7 303281069 302715451 302274019 301939756 301533371 300905406 300142586 299430907 298900217 298479527 297962278
3306.1 297962278 297323436 296609849 295879751 295197338 294468313 293626189 292780370 292081475 291508794 290869862
3326.5 290869862 290089637 289252818 288476884 287864983 287318915 286579132 285653412 284717768 283788174 282927334
3346.9B82927334p43150q19326r75102r05365p89106q22127q48591p65443n80132n24938
3367.3B75154054p39127r77487r84519q47668p65472p63774q00878p42316o04332n29826
3387.7B67398655m69565m58956o25521o22809l47703l78102p13885q07077o02484m36335
3408.1B61936218m02183m46290n84334o91592m92633j33365j28627l56257l32564j72794
3428.5B58195579j32769j37508j55688k52127m02719l86864k75224o6400L44217K06381
3448.9B56936878k88516k23458L2365P3284M9234R3162J91152L35902M29004J48535
3469.3B57777542j56164k3395J49131N8919J70201N18978M14669J45465K52992K88725
3489.7B59597063J26869K62767N22464K28554r1910N91188J004845J33962M887P67440
$$ plain form
3346.9 282927334 282184184 281364858 280389756 279484391 278695285 277873158 277024567 276259124 275678992 275154054
3367.3 275154054 274414927 273437440 272452921 271605253 270839781 270076007 269275129 268532813 267928481 267398655
3387.7 267398655 266929090 266470134 265844613 265221804 264874101 264495999 263782114 262975037 262372553 261936218
3408.1 261936218 261534035 261087745 260503411 259811819 259319186 259185821 259057194 258700937 258368373 258195579
3428.5 258195579 258062810 257925302 257769614 257517487 257114768 256727904 256452680 256386280 256730497 256936878
3448.9 256936878 256648362 256424904 256457269 256530553 256579787 256672949 256864101 257200003 257629007 257777542
3469.3 257777542 257621378 257597983 257747114 257806033 257976234 258495212 258909881 259055346 259308338 259597063
3489.7 259597063 259723932 259986699 260509163 260737717 260645807 261236995 262241840 262375802 262380689 263148129
3510.1B63148129O68257J39714P3313R0927R5368N66453R24676Q21084Q99732O46740
3530.5B68074393P5639L20881Q80838M66227l30359l3378J396030J854271L60727Q434
3550.9B73073703J100093P43807n8502J84536r0570j147866Q06093N150289L651589
3569.2B83413172q90613j160949M12792R74655R37730l0249j319618Q18879N267113
3587.6B88422912L148765j378954r8914K063543J413435J360565J180530j014948q13127
3605.9B94283807K764881L411591J654655N30123m71115L052414N834788J30087n469918
3624.3C05721313k931386Q793652J0435998o7800j645118M19706P19875P22378j200437
3642.6C20968181l535122O05047J1789888J1189044j677841k375990M502177K755910
$$ plain form
3510.1 263148129 263816386 263956100 264029413 264120340 264215708 264782161 265706837 266527921 267427653 268074393
3530.5 268074393 268150032 268470913 269351751 269817978 269487619 269454241 270850271 272704542 273065269 273073703
3550.9 273073703 274173796 274917603 274859101 275043637 274953067 273805201 274611294 279761583 283413172
3569.2 283413172 282522559 281361610 281774402 282749057 283686787 283656538 282336920 283155799 288422912
3587.6 288422912 291571677 290192723 290093809 292157352 293570787 294931352 296111882 295096934 294283807
3605.9 294283807 297048688 300460279 302114934 302645057 302173942 305226356 311061144 311191231 305721313
3624.3 305721313 302789927 311583579 322019577 321951777 320306659 320726365 321446240 322168618 320968181
3642.6 320968181 317433059 318038106 329827994 341017038 339339197 336963207 341465384 344221294
3659C44221294n75185m63337k290010k066821N319983N603492l03537Q105368R660601
3677.3C67211848j025795l312171l796399m191458K900601J1419147O368488j807630
3693.6C73766631l157586k191395L45558M307568J800776m331738l810972L900528
3709.9C70629370J0027111K944976m971355m117221m82619J480729K129048J563459
3726.3C79203498k939194n289167N3316P774621Q496404j772374j1135191m443675
3742.6C69948238R906262K230197m334986P986695P552206m905343n689680J248836
3758.9C83942425J566321k942294j900107N61417K965927L463208j566499m342824
3775.2C81747574j278073L240079J875698j006812K78533L21656j032322k131373k447605
$$ plain form
3659 344221294 343646109 343182772 340892762 338825941 344145924 349749416 349445879 357551247 367211848
3677.3 367211848 366186053 362873882 359077483 354886025 357786626 369205773 375574261 373766631
3693.6 373766631 370609045 368417650 368763208 373070776 374871552 370539814 366728842 370629370
3709.9 370629370 380656481 383601457 378630102 374512881 374030262 375510991 377640039 379203498
3726.3 379203498 376264304 370975137 371028453 378803074 387299478 385527104 374391913 369948238
3742.6 369948238 379854500 382084697 377749711 385736406 393288612 388383269 382693589 383942425
3758.9 383942425 385508746 382566452 380666345 381227762 384193689 387656897 386090398 381747574
3775.2 381747574 380469501 383709580 385585278 384578466 384856999 385178655 384146333 382014960 379567355
3793.6C79567355l75599j158952L09973O990940J429230j372844L923386j997649q499116
3811.9C78816724l863186M254401J436949K193689P236481j021147m673839k688318
3828.2C81691754k187252j206994j729459J569301O929100L426581o65784j413077
3844.6C86414170n439162j0322928p049770J2873769K0227492k567142j1418343o151289
3860.9C76566797R35853K296627k117932J063674N330801J139373k318740m989922
3877.2C77906531j783788K111882k36869K305001O55830l163576K109617J271426n963742
3895.5C75212312m903049J261265M735708N731880K416313l262400m185081k753377
3911.9C74253571k154916L91542K769560O95854j621872k49833J41055j845241n82516
$$ plain form
3793.6 379567355 379191756 378032804 378342777 385333717 386762947 385390103 389313489 387315840 378816724
3811.9 378816724 374953538 379207939 380644888 382838577 390075058 389053911 384380072 381691754
3828.2 381691754 379504502 378297508 376568049 378137350 385066450 388493031 387827247 386414170
3844.6 386414170 380975008 370652080 363602310 376476079 396703571 394136429 382718086 376566797
3860.9 376566797 377502650 379799277 377681345 378745019 384075820 385215193 382896453 377906531
3877.2 377906531 376122743 378234625 377997756 380302757 380958587 377795011 379904628 381176054 375212312
3895.5 375212312 370309263 371570528 376306236 382038116 384454429 381192029 377006948 374253571
3911.9 374253571 372098655 372490197 375259757 375955611 374333739 374083906 374224961 372379720 371797204
3930.2C71797204K256691Q83818j844019k234935r06349J064778M54068r92328L53187
3948.6C70832115Q90404n36143j050979o01024l25024J2905J68711m19409o85632l05772
3969C67980152j15603p2658L7551j90169m62055l08126j52469l40938m70281k39789
3989.4C65665615q2076j18613j18912k49356
3997.5C65096658
$$ plain form
3930.2 371797204 374053895 374937713 373093694 370858759 369952410 371017188 371471256 370478928 370832115
3948.6 370832115 371722519 371186376 370135397 369534373 369209349 369222254 369390965 368971556 368285924 367980152
3969 367980152 367864549 367791891 367829442 367639273 367177218 366869092 366716623 366375685 365905404 365665615
3989.4 365665615 365583539 365464926 365346014 365096658
3997.5 365096658
##END=$$ End of the data block
