##TITLE=$$ Begin of the data block
##JCAMP-DX=5.00 $$ ACD/SpecManager v 10.08
##SPECTROMETER/DATA SYSTEM=Varian
##DATE=04 Dec 2012 14:52:26
##DATA TYPE=INFRARED SPECTRUM
##DATA CLASS=XYDATA
##ORIGIN=
##OWNER=
##NPOINTS=3735
##FIRSTX=399.26403809
##LASTX=4000.35498047
##MAXX=4000.35498047
##MINX=399.26403809
##MAXY=70.20511627
##MINY=32.25078201
##XFACTOR=1.0000000000
##YFACTOR=0.000000100000000
##FIRSTY=69.84249115
##DELTAX=0.96440572
##XUNITS=1/CM
##YUNITS=TRANSMITTANCE
##XYDATA=(X++(Y..Y))
399.3 698424911 698294296 674547501 686254349 667042236 661162643 649280090 644303741 656057205
407 656057205 660491409 677456665 669284058 672750854 671255646 669787674 668665848 662877731 665864639
415.7 665864639 653350449 654124908 639132576 653338394 662347031 661515503 668180771 659743805
423.4 659743805 672877197 676617508 676174698 665422592 661890945 666875229 659997482 665949783
431.1 665949783 662084045 665340424 660304184 656394424 660136337 656056595 662739487 660994720
438.8 660994720 666833725 666046371 666699829 664900360 660687332 668863907 665728378 674270554 674760971
447.5 674760971 677646179 676905975 669727707 670031281 663850021 670699463 670331345 674939041 674093704
456.2 674093704 666869049 671593323 666308746 662409286 657348785 667722549 664996796 664368134
463.9 664368134 665909348 659240417 664715424 664056549 673735199 671547241 665398560 656628952 642947311
472.6 642947311 651970291 654159470 662422409 665693588 670499191 665190430 658834915 662896652
480.3 662896652 659705963 663465118 659686661 660910873 658809052 657037048 659371872 658158264
488 658158264 665365601 664950562 669472504 669026871 666176605 664097519 663055878 665574036 657972412
496.7 657972412 660368347 659512329 662067337 665271530 664200516 665928574 659594345 662803726 661169510
505.3 661169510 659720230 658526611 659863892 662838058 660748825 665222244 662532196 662430191 659750366
514 659750366 657383957 657528152 654536819 657466202 654321747 659393158 662570190 662606964 660568848
522.7 660568848 655676727 658045349 656838989 656110077 654126282 655430756 654869843 653202057 657338181
531.4 657338181 660427551 663121185 659693527 659295502 659112091 657849579 656311798 655857620 658082657
540.1 658082657 656416473 663544464 665835037 665192490 666641541 663093643 662755356 660009613 659564514
548.7 659564514 658082123 660066833 660893631 658656693 661587067 661974182 662314301 659988403 661154556
557.4 661154556 660019913 657460937 658308105 655141678 654324036 651800308 652405319 653843155 655911331
566.1 655911331 658469849 657527390 658168030 654886780 653978500 652424088 651710815 650509949 649239883
574.8 649239883 652371979 652799377 656124878 656465530 656284103 655717697 654517975 654552994 650617752
583.5 650617752 651724091 654192581 655965652 655332794 656923828 659781418 658827744 660444794 658897552
592.1 658897552 658769226 657602386 657182999 657595978 656493149 659051666 659780121 661098709 659839478
600.8 659839478 660762405 661171722 658778992 658462753 655773087 656174622 655692215 656341400 657334213
609.5 657334213 657803345 658396530 657886963 659805984 657276840 657183228 657482910 657474823 657874146 656995773
619.2 656995773 659949493 660265579 662599030 663262558 663983994 665433044 663367844 663631744 662252045
627.8 662252045 663279266 663030243 663602524 665622787 666223831 668627701 668296661 669810715 670735626
636.5 670735626 670779419 669583740 668514328 668264389 666039886 667175827 668883972 670642166 668178329
645.2 668178329 668169479 671426544 670985260 671538391 669800262 670129776 669110947 668466263 670002441
653.9 670002441 670298615 671169434 669984512 671497726 671392136 671394653 671045074 669249039 669696274 669561768
663.5 669561768 670512161 670063324 672342072 673437653 672882309 676448975 673149872 673242798 673927078
672.2 673927078 674074478 672798233 672510986 673490524 673074493 673904037 673652802 675014572 673956146
680.9 673956146 673215866 674047623 674400024 675123901 673336334 673931046 674528809 675248795 674677353 674707947
690.5 674707947 676031113 675055618 675008926 673658066 674296875 673190308 672021713 673590012 673486404
699.2 673486404 672663574 670463486 671528549 671248856 670628510 670629654 668620605 667659149 666530304
707.9 666530304 667931900 667618179 667845001 669335327 669440308 669743958 669507751 670289688 669747849
716.6 669747849 671314087 672819595 674748764 676210709 674707260 674728622 672913818 674396133 675448151
725.2 675448151 675820694 678015442 678709946 680064316 679105453 680240326 680801544 680205002 679948883
733.9 679948883 679047852 679472961 679302902 680685425 680266266 680730667 681616211 681670990 681641693 680270920
743.6 680270920 681214523 680217819 679745026 678090515 676844025 677430267 676923904 678121948 676001434
752.2 676001434 674767761 673522797 672896805 673549347 672371445 672698364 671089325 671047745 670921478
760.9 670921478 669888687 669969177 671152039 672634583 671413422 672220154 673017654 674518509 674896164
769.6 674896164 674024811 674741745 674911575 676988068 676945419 677104187 678464355 680020065 681212769
778.3 681212769 680917282 681935120 681525726 681856613 681699142 682664413 684473190 685077057 686061401
787 686061401 685126495 686183167 687108231 688024139 688219223 687867813 689137573 689094162 689757538 690014801
796.6 690014801 691413574 691967621 692484665 693277512 693556366 694918289 693862076 695140457 695631485
805.3 695631485 695669708 696148911 695895157 697864990 698157196 698865967 698834000 699471817 699314041 698581619
814.9 698581619 698734207 698087387 700129013 699237900 698366776 698920517 700674210 702051163 700335236
823.6 700335236 699472885 697360229 698086624 697175369 695618286 695641174 694708252 695678177 694344330
832.3 694344330 694337845 693211823 691319809 689799194 687960968 687963409 686275177 685208359 683205795
841 683205795 684278793 685927963 685533752 685940475 684872589 685486603 684743042 684467773 683512421 682297974
850.6 682297974 682880020 683204041 684356079 683505783 684490051 685065765 685913239 686648788 685018082
859.3 685018082 684804153 683647156 684070892 683645248 684092789 686105728 687464447 688933258 688948517
868 688948517 690297699 690441437 691359406 691998215 692401199 693348236 693349228 695307312 695858231 697820435
877.6 697820435 698413086 698190689 698997879 697444458 695681381 692764587 692040405 690930099 690186081
886.3 690186081 690139008 689451675 690041504 689585876 689369354 687034073 686012802 685434189 683797531
895 683797531 682848816 680813675 680514221 680600052 682291870 682768860 682964020 683666763 681634140 679885406
904.6 679885406 677421494 676387939 675092392 674509659 674687958 673987045 674709930 674051132 673471909
913.3 673471909 672304153 671365433 670112915 668125534 666849823 664892426 663804398 663141251 664307175
922 664307175 664727783 664840775 665171738 664078598 663807297 662521667 661742172 660326385 659600067 660238647
931.6 660238647 660935593 662264709 662719040 664587021 665207672 664861908 663973999 663054886 663427811
940.3 663427811 662947769 663478470 664054718 666263962 668535385 670169220 671943207 671789246 671322479
949 671322479 669906387 669199295 667809219 666772461 666367111 665719452 666583328 666351776 666393661 665607910
958.6 665607910 664294281 661811142 658723679 657016373 654436569 652469864 650365143 650301819 650986938
967.3 650986938 650630569 649491959 647064133 645580597 643239212 640988541 637914352 635537109 634193230
976 634193230 632671776 632167816 630544777 629923210 629109917 628095169 626492767 624362907 622800179
984.7 622800179 620790787 620254555 619332886 619412689 618802643 618963737 620974655 620455666 620232582 619023247
994.3 619023247 617847862 616647377 615404892 614839401 614021263 614908447 615733910 617632027 618768463
1003 618768463 618828163 618217392 616280022 614953270 613092613 612307587 611301079 611030502 611511269
1011.7 611511269 612433662 613647652 612814331 613282051 612434387 610183449 608901787 608209801 607885170
1020.3 607885170 607452507 607810326 608383064 610146217 611140976 611853790 612055092 610698776 609150047
1029 609150047 607834549 608536987 608447838 608819466 609281845 610094872 611979065 612286873 613071404 612718735
1038.7 612718735 612321053 611029930 609766808 609547272 609047203 609735603 609053879 610427666 611958885
1047.4 611958885 612071609 612229004 611946487 612314720 611048279 610907745 610663719 610851936 611527138
1056 611527138 612244797 614095573 614277878 615560570 615924530 616378822 616767273 616122818 616659088 616192627
1065.7 616192627 616509323 616900787 617858658 618457565 619129295 619237175 617746696 617498283 615803986
1074.4 615803986 614395790 612370987 610706482 610197411 610429382 612588425 613143921 613774757 613521843
1083 613521843 612973137 612242355 611427956 611979027 611717110 611713600 611472893 612742310 614103203 615436172
1092.7 615436172 616329002 615064888 614282341 613459816 614136391 613948898 614346466 614940109 613971710
1101.4 613971710 614893875 615431747 616437073 616359138 615631638 615118828 614267235 613925438 613582039 614518890
1111 614518890 614477158 615469742 616066742 616076851 616852303 615939560 616294823 616322975 616299820 616008186 615715828
1121.6 615715828 616260796 616269913 617144737 617374763 617835464 618324699 619036331 619239082 619198265 620065689
1131.2 620065689 619416542 619434776 619588470 620078163 620412292 620219879 620513268 620296288 620557518 619728355
1140.9 619728355 618948669 617796059 616761246 616474648 615903740 616018219 615281830 614839363 613848839
1149.6 613848839 613409348 613554611 612749138 612082520 611551895 612426643 612017479 611547089 611928940 611607056
1159.2 611607056 611243820 611343842 612483597 612442665 612879257 613488655 613865280 614463539 614653206 615877533
1168.9 615877533 617187500 619220619 620537796 621347694 621988449 622705727 624582977 625276680 626562500
1177.5 626562500 628095207 630035820 631633606 632252083 633702354 634558945 635402946 635179901 635580673
1186.2 635580673 636804199 637600098 638219910 638131828 639385643 639863777 639788055 639551811 639052620 638794098
1195.9 638794098 638482323 639232178 638764076 638256912 638258743 638421097 638945122 639367142 639751968 639581223
1205.5 639581223 639929047 639419289 639299240 639620209 639652061 640083084 640404129 641512985 642071991 642939377
1215.1 642939377 643193817 643126373 643390121 643033295 643464050 642934799 643072357 643411255 643209381 643549423
1224.8 643549423 643474503 643076935 642206421 642138901 641656570 641568604 641511078 640800171 640650024 640383072
1234.4 640383072 640783234 640401688 640286026 640117493 639838715 640104599 639790077 639900398 639505424 640129089
1244.1 640129089 640183334 639540062 639731598 639771652 640486069 640502472 640667114 640251160 640024796 640253906
1253.7 640253906 639937553 640489883 640559235 640971375 641118393 641553192 641950912 641819000 642268066 641779404
1263.4 641779404 641821899 641605225 641504669 641483994 641451111 642239609 642368011 642922668 642829132 642358704
1273 642358704 642062759 642244644 642552719 642000732 642148056 642338257 642656326 642655182 642953262 643191910
1282.7 643191910 642597427 642176971 641758881 641993713 641461563 641034088 640657730 640298233 640431061 640095749
1292.3 640095749 640536652 640346298 639939041 639324226 638862762 638642197 637932625 637847748 637331657 637403908
1301.9 637403908 637337036 637452126 637669601 637260933 637401123 636996460 636749535 636127357 635797195 635740967
1311.6 635740967 636311035 636835060 635853691 636248245 635952034 635299759 634841805 634030151 633576431 632730484
1321.2 632730484 632633286 632334366 632344398 631966743 631422043 631034355 630472412 630596771 630040741 629883995
1330.9 629883995 629205704 628588104 628315201 627952423 628371468 627981949 627985039 628130989 628257637 627397995
1340.5 627397995 626600380 626821098 626421356 626289864 625917282 625871849 625691833 625917091 626327972 625921860
1350.2 625921860 626068382 625378075 624886322 624644432 624813194 624754677 624083672 623739204 623071136 623814697
1359.8 623814697 623968964 623932381 623923836 621946754 621945267 622039757 621487160 621286812 621436577 620663452
1369.4 620663452 620396271 620673065 621244164 622130280 620618477 620102959 620314445 620663605 620768318
1378.1 620768318 620309563 620512161 620084763 620309868 620119057 620297737 620779305 621527824 622799034
1386.8 622799034 620755844 620851822 621799774 621845207 621592941 621809425 623342590 623128014 621974106
1395.5 621974106 621907997 622549553 623118591 621749115 620443916 620349998 620438499 620195045 620793114 619998283
1405.1 619998283 619410782 620055161 619966049 619898300 619181442 619090881 618803444 618498268 618658295 618354836
1414.8 618354836 618849449 618536835 618805733 620493431 617242737 615683937 617339325 618556061 618873024
1423.4 618873024 617015381 616267586 617454834 617575912 618275528 618911209 617743111 617401733 617652855
1432.1 617652855 617954636 617635269 619327507 621684036 617421150 616125183 617848740 618658676 618840446
1440.8 618840446 619148903 618714714 618455009 618122826 617864723 618903580 619292297 618032875 617784157
1449.5 617784157 618874245 619129028 618093872 617760124 618996696 620843201 620801620 617586899 614111481
1458.2 614111481 615226784 615775604 616819344 617724266 618526688 621373138 620121841 618698158 620154190
1466.8 620154190 620920143 621339531 621657333 624353790 626667519 627015038 625347176 626742630 630538445
1475.5 630538445 629843903 629592361 631167717 632285423 634067688 635080261 635110893 636358910 637969322
1484.2 637969322 639285355 642069168 642719955 642329483 645171432 645545349 642779312 643571548 645835114
1492.9 645835114 646877213 649233017 651739120 647715378 650206299 652019806 650127258 652034683
1500.6 652034683 653129349 652549973 653549347 657097168 661466522 657945862 650681381 653725586 656058273
1509.3 656058273 656785889 659009094 659574585 657228241 658754120 660322495 661394653 661998062 656816101
1518 656816101 660401917 664995499 663195724 660012436 658515701 661422729 663933029 661651459 661471176
1526.6 661471176 662928238 662022476 661587906 663491592 664542084 666070099 666188049 660483856 662272110
1535.3 662272110 663731384 665851517 670169067 667906723 657557526 662502594 664304199 661675873
1543 661675873 665355606 666287689 662170029 663708115 665316086 667219772 666788940 662942429 663842163
1551.7 663842163 666353531 668791733 665509186 664185944 669038544 673459244 662633820 659952087
1559.4 659952087 659564972 662359009 664682388 665698242 667411652 665526199 664567566 665655594 667064056
1568.1 667064056 668702774 661786652 662080383 663843002 663763962 664413376 666677170 667858810 658997116
1576.8 658997116 661183624 662934189 662335892 661953583 661257172 660994873 660411911 660528793 659936371
1585.5 659936371 659509354 659421921 658860779 658455887 657392654 657328110 656213303 655461044 654951935 653796997
1595.1 653796997 653542328 652655945 652340317 651350098 650715790 649833221 648884659 648315659 646145782
1603.8 646145782 644961014 644127884 643480606 641665802 641065598 640314102 638089600 637620964 636174889
1612.5 636174889 635519714 634404488 635687408 636887474 626081848 626536522 626962776 626874275 626174469
1621.1 626174469 627010117 627188187 620696373 620102119 620269737 621059914 618530273 615603027 616257439
1629.8 616257439 615760345 615235405 614855537 616603508 619373550 613269157 610429726 612291489 611917725
1638.5 611917725 612469101 612512817 611813431 612647629 612235985 614132195 616603241 614756317 613908882
1647.2 613908882 611769981 611803741 613679619 617529297 622446747 620730438 608299408 612347069
1654.9 612347069 616085548 618049965 618563614 618510933 619181747 619782791 621761780 622075348 618869438
1663.6 618869438 621311874 623623695 624594231 626475716 629547882 627376595 626086960 628988495
1671.3 628988495 628185692 630033455 634082146 634288864 629886703 632274551 635298271 637147026 638694801
1680 638694801 637332420 639880066 645366058 645969009 634502487 636740189 641976547 644567947 644627838
1688.6 644627838 645723419 646701126 647960587 649008942 649797974 653212814 656448822 648162918 650246811
1697.3 650246811 654784775 660272522 659812317 645825424 652608948 657173843 659219208 658801422
1705 658801422 659062729 657413177 656980896 659996567 661056137 660349045 660758896 662261200 664352036
1713.7 664352036 663607788 662448807 665659103 668823013 660204315 660665588 663556442 664649811 665858765
1722.4 665858765 666246948 665692902 665800247 666483536 666686554 667323761 669335022 667823944 666170502
1731.1 666170502 669700089 673757477 670463333 662348175 666295471 669450760 670085297 672369308
1738.8 672369308 671410904 666624451 669846954 672773666 671252747 669529953 671206360 673189163
1746.5 673189163 673425751 672729416 670984573 673891830 672798538 668546753 671312103 671876221 672741547
1755.2 672741547 674868469 672416382 671675339 672561035 673813629 676179657 673166122 670427704 672381744
1763.9 672381744 672794418 672517929 674016876 675148697 671575165 672501984 676716232 677140656 672953110
1772.5 672953110 669677887 673044052 675201950 672690811 673563614 674271011 675398331 675962067 673209991
1781.2 673209991 673117142 673996277 674797745 673703613 672863770 673828354 673729935 673919067 675164871 675906143
1790.9 675906143 676063843 672860870 670545731 673474884 675115433 673691711 674085770 675953674 675994568
1799.5 675994568 673490067 674754028 674675369 673195572 673894653 673699951 674029083 673988800 673378601
1808.2 673378601 674343185 675552139 674009857 672968903 673551941 673031616 673436813 673670502 673839493
1816.9 673839493 673048401 672273331 673419800 673171844 673397369 672898788 673777084 676158295 672371750
1825.6 672371750 670998535 672761993 674913864 675256119 670108032 670372620 672339020 672628632 672464066
1834.3 672464066 672433472 672897034 672643051 671156769 670931702 670975494 670988464 671562347 673387451 674101791
1843.9 674101791 667838593 668459015 670935059 670488510 669549103 669281235 669700089 669288788 669079666
1852.6 669079666 669009857 668777542 668852768 668741608 669215088 668953247 668477097 668038559 667896042 667715378
1862.2 667715378 667458115 667917328 668090134 668683472 668357391 668854675 668303375 665294037 665853729
1870.9 665853729 666371307 666550140 666239395 665943985 666216888 666280060 666408386 666084824 666150665 665760040
1880.6 665760040 665738297 665675812 665547791 665558319 664508286 664601288 664987869 666460571 666810760 663816986
1890.2 663816986 663812866 664294968 664001007 664601059 664814758 663248672 662910080 663119202 663117981 663720245
1899.8 663720245 663370132 663433456 663404922 663167953 662735901 662095032 662321777 661837158 661663742 661931229
1909.5 661931229 661671677 661340790 661676941 661677246 661323624 661234360 661098785 662284241 660096130 658217392
1919.1 658217392 659772949 660346222 661541138 660522308 658888931 659497299 659559021 659067383 658469391
1927.8 658469391 658338165 657957153 657712173 657600555 657717743 657787857 657964325 658545609 658462982 658188248
1937.5 658188248 657357788 656876678 656594696 657520294 657918167 655051651 655688782 656946335 656655731
1946.1 656655731 656307602 656262817 656470947 655718155 655345383 655148468 655159760 655213547 655170364 655375366
1955.8 655375366 655354919 655576477 655488586 655377350 654699020 653986740 653750381 653489990 653477249 653734055
1965.4 653734055 654667358 654345856 653859711 654121857 654033508 653788834 653100204 652740860 652388611 652318268
1975.1 652318268 652133942 651988525 652355118 652341690 652356567 652202301 652190170 651946487 651772461 651369934
1984.7 651369934 650622864 650648193 650420761 649998398 649652481 650619736 651513367 650403290 649926300 649723053
1994.3 649723053 649380493 649086533 648656921 648103790 648144913 648642502 648721695 648686905 648374710 648340454
2004 648340454 647771835 647052917 646777039 646133728 645633621 645386581 645801086 645814743 645534973 645424271
2013.6 645424271 645123520 645215149 644667740 643595428 643116302 642770615 642001038 641668320 641804581 641865845
2023.3 641865845 641730118 641440582 641488113 640865860 640568085 640302429 639552536 639209900 638393593 638115349
2032.9 638115349 638076897 637986221 637908974 637883606 637877579 637099686 636863785 636510468 635722084 635440788 635638657
2043.5 635638657 635451927 634847107 634687500 634622803 635107193 634937134 634641037 634655800 634136429 633890839
2053.2 633890839 633413544 633129768 632843323 632875633 632847328 632673225 633092041 633064880 632820969 632095718
2062.8 632095718 632153015 632217369 631362038 631147194 631112251 631538963 631669655 631622200 631636162 631727791 631585655
2073.4 631585655 630882034 630477676 629947433 629909286 629773712 629922104 630321388 630203285 630230064 629868813
2083.1 629868813 629875908 629343605 628690491 628492584 628255997 628656197 628735085 628746109 628842583 629037094
2092.7 629037094 628765678 628584290 628670654 628253098 628270187 627889824 627661858 627493248 627334290 627375107
2102.4 627375107 627186165 627534370 627446289 627302666 626836243 626383820 626517448 626303062 625925217 625554085
2112 625554085 625712128 625739288 625872879 625764732 625485878 625568962 625190811 625038948 624792061 624560776
2121.6 624560776 624091835 623756981 623776360 623658295 624008141 624069519 624155045 623902206 623461876 622950935
2131.3 622950935 622629471 622806931 622334633 622186623 621936417 621950188 622053871 621860008 621867714 621311111
2140.9 621311111 621285286 621061096 620724678 620707283 620700836 620506668 620095634 620406189 620274429 620206947
2150.6 620206947 619940300 619551620 619658585 619439049 619379730 619150963 619281044 619368591 619430313 619355507
2160.2 619355507 619009552 619202423 619146652 619343872 619274788 619065666 618846550 618630409 618838768 618602600
2169.9 618602600 618653374 618866081 619157295 619253273 619144325 618849487 618421288 618632851 618762360 618937569
2179.5 618937569 618690529 618744888 619125786 619041710 619197922 619204330 619046745 618311691 618271103 618635063
2189.1 618635063 618328896 618306770 618406410 618420525 618163719 618272858 618461876 618954582 618917961 618414078
2198.8 618414078 618862152 618779297 618745880 618657570 618682899 618672752 618299522 618479996 618684998 619141998
2208.4 619141998 618811646 618710251 618742752 618573608 618738251 618081436 618064384 618042412 618260574 618668251
2218.1 618668251 618668442 618814735 618524818 618533249 618300400 618304024 618190117 617930641 617924271 617777977 617962112
2228.7 617962112 617817802 618231506 618288116 618109131 618051567 617618408 617527428 617006760 616997147 617038002 617063522
2239.3 617063522 617007561 616914291 617340775 617094688 616903419 616664505 616705055 616447983 616069145 616211319
2248.9 616211319 615843658 615796242 615880394 616254387 616255798 616038780 616089325 616148453 616312561 615794868 615602036
2259.5 615602036 615297089 615034561 614767303 614814301 615565147 615458717 615463142 615368919 615365562 615338707 615245895
2270.2 615245895 614917870 614116325 614471092 614838295 614918594 614557991 614604607 615035515 614817734 614632454
2279.8 614632454 614020576 613822212 613557053 613418236 613064003 613050385 613824539 613649559 613877754 613817215
2289.4 613817215 613934708 613935051 613648834 613478661 612678680 612912025 612671280 613065529 613548851 613358040
2299.1 613358040 613886604 613837090 613839417 613431740 613587570 613560448 613775444 614066162 613295097 613854446
2308.7 613854446 614033318 614485817 614980240 615487709 615226860 614017830 614701118 615088425 615234947
2317.4 615234947 614187164 614825897 616276894 616044350 616884995 616093826 616023254 615872917 616203728
2326.1 616203728 616300278 616066475 617102242 615714874 615841980 615320206 615091286 615239754 614907303
2334.8 614907303 615782852 615042534 615349998 614987297 615478172 615814629 615592384 615900002 615049248 615131760
2344.4 615131760 613136368 612244186 610793877 609274406 611018715 613120232 613405685 612854042 613622780
2353.1 613622780 613805122 614183388 613811073 613950539 615516129 616269646 616665535 613355751 613717461
2361.8 613717461 614314308 613326340 613173332 611462021 611811104 610685463 610052567 608855247 607056656
2370.4 607056656 606739883 606205482 605106163 603113518 602420311 601764450 601186371 600591240 600070305
2379.1 600070305 600110779 599437943 598472443 597106934 596449318 595871468 595368690 595198174 594896469 595190773
2388.8 595190773 594847183 594685287 594731102 594546089 593998985 593422203 593375549 592587852 592391510 592484741
2398.4 592484741 592335510 592063141 591948624 592424583 592366791 592023087 591403656 591218719 590640182 589892540
2408.1 589892540 589906120 589844017 589823074 589543152 589743919 589426804 588908730 588543739 587899361 587666550
2417.7 587666550 586962738 586608849 586208649 586102676 586051331 585720825 585813560 585443878 585372543 585088577
2427.3 585088577 584990730 584432755 583766136 583946152 583469086 583130989 582739754 582835655 582489090 581927719
2437 581927719 582035904 581398735 580999527 580464821 580121613 579833870 579579811 579499512 579353790 579520645
2446.6 579520645 579108276 579052544 578609924 577958603 577525101 576978188 576889305 576455536 576283379 575864792
2456.3 575864792 575697746 576013565 576021042 575498810 574528923 574273300 573901062 573613892 573410759 573258514
2465.9 573258514 572841682 572173958 572242393 572124519 572274055 572113075 571851463 571518784 570793457 570476913
2475.6 570476913 570070496 569948006 569604530 569698181 569841652 569864235 570202675 569717484 569026184 568153343
2485.2 568153343 567810211 567451096 567295609 567509880 567276421 567348137 566949272 566891823 566773911 566472664
2494.8 566472664 566238022 565639839 565206375 564560699 564578133 564446983 564364891 564489899 564468536 564471092
2504.5 564471092 563657570 563228493 562890587 562735519 562782516 562945786 563068085 562561493 562373543 562031097
2514.1 562031097 561860504 561388397 561040001 561056480 560788231 560733795 560088348 559892464 559980583 559888229
2523.8 559888229 559817352 559803467 559537659 558874397 559024467 558717384 558295479 557718163 556979370 556860847
2533.4 556860847 556611977 556526642 556414757 556638565 556180763 555851364 555862312 555327644 555407791 555078659
2543.1 555078659 554889755 554456100 553733749 553349915 553280869 553479195 553243828 553407173 552849274 552381096
2552.7 552381096 552252846 551894989 551708908 551276932 551319656 550741501 550489197 550194016 549912720 550365639
2562.4 550365639 550104446 550085640 549385681 548723946 548561554 548366547 548274651 547878075 547928848 547663727
2572 547663727 547344284 547021103 547024498 547006493 546631813 546534271 546175385 546149178 545620384 545222244 544996185
2582.6 544996185 544739609 544882698 544311943 544076080 543925171 543691368 543263969 542939758 542761726 542337227
2592.2 542337227 542423973 542285690 542312469 541990891 541916962 542094154 541468620 541097298 540992622 541134872
2601.9 541134872 540498276 539992180 539848480 539474297 539282799 539036484 539193573 538723183 538282585 537789955
2611.5 537789955 537487297 537529678 536907120 536801491 536564789 536065674 535188103 534954185 535176926 534672470
2621.2 534672470 534406471 533883286 533622208 533026085 532547951 532540665 532388535 532165222 531588554 531481781
2630.8 531481781 530918922 530665092 530349388 529810143 529566574 528935776 529137611 528884697 528562698 527872086
2640.5 527872086 526942902 526891518 526633682 526696663 526346016 526247826 526004829 525186119 524726791 524456520
2650.1 524456520 524454651 524001808 523637161 523045731 522626686 522138252 521651573 521769333 521310005 521306572
2659.8 521306572 520987358 520358658 519926453 519596329 519665070 519362831 519023018 518413391 518138771 517814636
2669.4 517814636 517553329 517499733 517102737 516966934 516394310 516115265 516180344 516183281 515536003 514843140
2679 514843140 515067291 514847107 514503441 514338760 514431496 513848419 513331261 513376770 513081322 512959328
2688.7 512959328 512336998 512141457 511673698 511201515 511083755 510876083 511309586 510608940 510054741 509808998
2698.3 509808998 509419136 509205437 509021988 509284592 508804588 508450203 508093414 507891693 507697830 507571564
2708 507571564 507960548 507516060 506989174 506198730 505864983 505587883 505124969 505170555 504855499 504764481
2717.6 504764481 504379807 504270782 504024124 503639565 503576164 503164635 503003807 502547989 502102127 501460419
2727.3 501460419 501391182 501611443 501274948 501152382 500653343 500308838 500048599 499979439 499575424 499308014
2736.9 499308014 499247856 498618050 498554344 498103065 498022041 498068771 497711525 497574768 497514572 497345695
2746.5 497345695 496461792 496540985 496665268 496438637 495891075 495130196 495136299 494651642 494592361 494273911
2756.2 494273911 494090004 494336739 494046631 493694954 493232689 493405838 492899513 492448502 492293663 491860619
2765.8 491860619 491935692 491867332 491558952 490601616 490379829 490741920 490825539 490401993 489721107 489502678
2775.5 489502678 489071884 489213524 488964005 488741150 488646049 488311272 488244209 487400589 487271156 487262115
2785.1 487262115 487068825 486843185 486405220 486248207 485873489 485802917 485431213 485401573 485403214 485247765
2794.8 485247765 484812965 483714409 483375282 483327675 483556557 482879524 482095146 481980705 481600418 481628113
2804.4 481628113 481206436 480562782 480024986 480098763 479946938 479517250 479305000 478683167 478588142 478054848
2814 478054848 477683792 477248344 476892586 476872635 476049881 475657654 475114784 475073090 475046806 474548416
2823.7 474548416 474208794 473715324 473596573 473141212 472932472 472501373 471788826 471349068 471070137 470721855
2833.3 470721855 470177231 470051041 469346237 469044647 468633003 468010864 467569122 466779099 466509209 465711937
2843 465711937 465575485 465279694 464728737 464608383 463818398 463149681 462191887 462054100 461592293 460590782
2852.6 460590782 459786758 459171333 458961182 458178291 458332329 458260689 458028412 457462578 456906090 457063942
2862.3 457063942 456149025 455897903 455510750 454997215 454291267 453372688 453094215 452332954 452004166 451233368
2871.9 451233368 450704765 450438194 449877853 449292030 448417473 448113327 447475815 446938286 446555138 446416893
2881.6 446416893 445997047 445390968 445254745 444834023 444773445 444059906 443683434 443477402 443018608 442962990
2891.2 442962990 442807922 442950401 442287445 441993904 441550827 441243057 440980759 439755020 439625473
2899.9 439625473 439695511 439971390 439570045 439258385 439410667 439171944 438818970 437683907 437889900 437687950
2909.5 437687950 437217369 436848564 436001854 436002274 435410805 435008965 434102745 433737183 433535957 432821655
2919.2 432821655 432665100 431831131 431711273 431465149 431255913 430777512 430410843 430366096 429909782 430542450
2928.8 430542450 430375061 430390358 430596237 430648804 430827560 430644684 430579338 430205498 431087265 431716194
2938.5 431716194 431803436 431882668 432290039 432945175 432443924 432679787 432877083 433191833 433456116 433409081
2948.1 433409081 433383102 433248100 434098282 434158363 434528656 434789200 434662704 434752846 434177589 434400253
2957.7 434400253 434669609 435267181 435997009 436499939 436223717 436004906 436834793 437105331 437667427 437700119
2967.4 437700119 437779274 437996216 437986221 438460846 438889694 439524536 439119072 438979454 439226189 439437675
2977 439437675 439976006 440472145 441053925 440648193 440863113 441378860 441636963 441811600 442150078 442846642
2986.7 442846642 442535744 442810249 443035507 443229256 443824005 444111328 444272156 444047623 444255295 444030914
2996.3 444030914 444008255 444248238 444355469 444313850 443877869 444105301 444191170 444343224 444285583 444089813
3006 444089813 443764801 443470230 443775368 443619423 443399010 443013191 442758064 442243195 442419548 442649307
3015.6 442649307 441713524 441658859 441230850 441025772 440946922 440657654 440256386 439581757 439911766 439552956
3025.2 439552956 439270058 439031601 438837280 438728867 438199120 438120766 437187614 436730156 436822624 436781425
3034.9 436781425 435998688 434959908 435118256 435416527 435470505 434843979 434604874 433982277 433552322 433428001
3044.5 433428001 432326012 432134209 431957893 431988144 431478844 430815392 430695686 430212326 430148582 429739723
3054.2 429739723 429845734 429170418 427775192 426982574 426755219 427076683 426780815 426658936 426070366
3062.9 426070366 426051064 425757675 425025482 425142593 424420433 423987427 423522758 423260040 422853928 422639236
3072.5 422639236 422753944 422349052 422298431 421703644 421649094 420998573 420285378 419945908 419163170 419129677
3082.1 419129677 418493347 418317070 417951050 417983017 417991447 417328491 417493286 416762733 416114426 415237846
3091.8 415237846 414965439 414986992 414742470 414965248 414213791 414005508 413441925 413180656 413056183 412352600
3101.4 412352600 412089882 411625862 411727219 411309395 411159821 411074448 410549545 410236969 409876747 409695435
3111.1 409695435 409229126 409002953 408390198 408548317 408399200 407602196 407404404 406506042 406476364 406430206
3120.7 406430206 406339493 405688057 404820824 405068932 405083961 404979477 404207115 404388733 404341660 403436928
3130.4 403436928 402836609 402422295 402430344 401622047 401498451 401287537 401452370 401732445 401112747 400787659
3140 400787659 399991798 400295868 400216751 399621468 399031487 398480721 398603096 397863731 397656593 397226295
3149.6 397226295 397094460 397322464 396985741 396516190 395787392 395385666 394766541 395321655 395346336 394832382
3159.3 394832382 394794121 394457626 394490547 393668823 393649406 393324127 392537270 392494659 392566338 392804260
3168.9 392804260 391881409 391473541 391293411 391290932 391028214 390040855 389891777 390012817 390065460 388965797
3178.6 388965797 388400650 388194847 388130226 388445663 387748413 387531548 387005157 386800728 387172585 387206345
3188.2 387206345 386721268 386040192 385705376 384978523 384994850 384889488 384639282 384112663 383698006 384016685
3197.9 384016685 383800507 383953552 383207283 382721443 382729645 382191887 381758537 381336555 381570320 381112938
3207.5 381112938 381034698 381071434 380582428 380113029 379647141 380220337 380207481 379757690 378956184 378571739
3217.2 378571739 379148178 379083672 378629494 378348503 378196793 377422867 377411499 377394257 376603661 376271210
3226.8 376271210 376290092 376630249 376552467 376288490 375484085 375152588 374798470 374222260 374310608 373643799
3236.4 373643799 373459663 373170891 373129120 373209572 372812538 372668800 372428780 372752800 371956825 371473122
3246.1 371473122 371552391 371376801 371291199 370724869 370909233 370630379 370519257 369870872 369083557 369501076
3255.7 369501076 369453735 369466896 369282570 369502144 368988953 368051338 367715607 367530327 367664642 366988297
3265.4 366988297 366594505 366396446 366689644 366708565 366450386 366530495 366127052 366489487 365863152 365503998
3275 365503998 365349274 364235916 364103012 364328537 364509392 363910446 363806534 363928795 363717270 363452682
3284.7 363452682 362816849 362336082 362099686 362852974 362569466 362115402 362005463 361267776 361091652 361080360
3294.3 361080360 361537132 361262589 360778313 360096550 359747314 359934692 359127731 359062958 358761406 358569374
3303.9 358569374 358660622 358101730 357594261 357553864 358038521 357783012 357337990 356515846 356178017 356140251
3313.6 356140251 356008682 356044807 355525246 355687523 355351181 355110092 354897499 354730606 354718361 353599014
3323.2 353599014 353281670 353227234 353661270 353562737 352806664 352472496 352153053 352091789 351026306 350934906
3332.9 350934906 351128845 350800247 350582008 350019455 349774399 349455910 349693222 349187126 349043808 349134979
3342.5 349134979 348731651 348615952 347527733 347344818 347345085 346969337 346240005 345555954 345474510 344938316
3352.2 344938316 344825516 344604874 344913559 344705048 344260483 344369659 344072533 344131966 343701363 343442993
3361.8 343442993 342558174 342114754 342566338 342410507 342277412 341437874 340945244 340594902 340656357 340790443
3371.4 340790443 340448036 339934006 339205818 339475899 339305038 339132156 338673134 338024216 338016815 337595749
3381.1 337595749 337128716 336905823 337669792 337277374 336216011 335952682 335885201 335978699 335495529 335585327
3390.7 335585327 335492249 334772072 333651962 333452606 333928185 334032898 334189301 333194733 333137436 333015633
3400.4 333015633 332642708 332703323 332410126 332188911 331165009 331414299 331597595 331727180 331208229 330030594
3410 330030594 330540199 330251694 330529633 330117416 329432449 329856987 329780197 329631882 328937531 328913155
3419.7 328913155 328169708 327849045 328323822 328378792 328510361 327924614 327937698 327646675 327224655 326664238
3429.3 326664238 326797333 327065887 326280746 326614304 326695786 326771812 326289711 325962296 326190491 326089287
3439 326089287 326131058 325800018 326372871 325516815 325135345 325853004 326035881 326227989 324265633 323722420
3448.6 323722420 324069443 324644928 325147820 324395294 324138222 324313240 324851837 324380798 324504471 325119286
3458.2 325119286 325146523 325069275 324513054 324390526 323627739 323644104 324241142 324263687 323830986 323562737
3467.9 323562737 323938522 323687325 323994484 324057961 323950958 324020500 323968582 323848724 323582573 323652611
3477.5 323652611 322986908 323579559 324148750 324035721 324046593 323086662 323159828 323283234 323843040 324328995
3487.2 324328995 324198494 323880272 323240471 322837868 322507820 323311157 323485527 323791084 324409714 323721085
3496.8 323721085 323170776 323405571 324373894 324145927 324261665 324588966 323944473 323641129 323724403 324209900
3506.5 324209900 323851357 324012032 323459320 322896652 323662758 324095383 324740944 324596405 324676056 324588127
3516.1 324588127 324853210 325081635 324170265 323955231 323988075 324962349 325355377 324675446 324467964 324767990
3525.7 324767990 324958878 324692078 324772072 324028435 324369888 324449730 324700432 325567017 325461884 326467743
3535.4 326467743 325965538 324977722 325256691 325487518 325311241 325189857 326626892 326798210 326946373
3544.1 326946373 327031174 326592674 326738815 325938072 326585999 326506577 327175789 328330307 326714249 326658897
3553.7 326658897 327001114 327558823 327959747 327189827 327996292 328632965 327575417 327329445 328797798
3562.4 328797798 328820724 328436241 330945587 330287514 327806664 327580223 326890411 328802414 329593887
3571.1 329593887 330179367 331361847 331270905 331159172 331074028 331073380 330283508 331621895 332563820 331587906
3580.7 331587906 332338486 333199921 333547821 332886772 335622749 337118835 334331245 334722176 331644325
3589.4 331644325 333096008 335349197 336851921 336633186 335779114 338382034 335588684 336842575 338862915
3598.1 338862915 337973900 339771309 338707199 338163033 338024330 338584518 339511490 341315002 342623901
3606.8 342623901 339720993 341518288 338933525 338471794 344689713 344860916 342884140 344357910 342328682
3615.4 342328682 344750977 348144836 345924911 345289955 343610611 344203720 346667175 347486191 348713951
3624.1 348713951 349282341 349678230 350790367 356068840 355030251 343177910 346831017 349986115
3631.8 349986115 353787842 353570747 351103363 352772751 354588089 355502243 354068718 354646606 355909996
3640.5 355909996 357243118 357344742 356667557 358255119 360670853 365178299 362950325 360821877 364330025
3649.2 364330025 362321968 359085236 356864128 361265373 363714447 366798859 370478821 363005981
3656.9 363005981 363757477 366710396 367901955 369130630 369436264 370318604 370203667 371028290 371729507
3665.6 371729507 372294006 376358986 378953400 378068314 377049065 368377533 370286140 378636093 386164589
3674.3 386164589 383928261 365249710 369358482 376966400 380699806 377988663 377583580 379944267
3682 379944267 380300522 381361427 381055832 380980797 385365677 390403671 381539268 378976936 386144447
3690.6 386144447 379131470 379365616 383707733 383610191 385007668 384230232 383901596 384228630 384509354
3699.3 384509354 387363243 389946747 384806442 381943855 386135406 386687775 386343422 386196175 388901024
3708 388901024 392750702 385179749 388580589 391175041 379819565 382586441 385885849 386697350 387132225
3716.7 387132225 388732414 389297943 386338844 387196579 393193665 389970131 384742279 389020500 389752045
3725.4 389752045 389723892 385980911 385630112 388429794 389651146 394866905 389077911 384059944 393543434
3734 393543434 393677025 383280182 383633080 385920715 385531464 388304863 390774422 387590904 390290947
3742.7 390290947 400499725 388940239 374523544 384101486 388468819 394326477 389263878 380623817
3750.4 380623817 390545349 383112335 377570877 383180351 387892838 389892540 385413170 387892570
3758.2 387892570 392381859 384942513 382275047 385656738 385779457 386338654 389619827 387018242 383354759
3766.8 383354759 386180153 390718269 390018883 382266617 383272095 385003662 384480591 385133057 385367317
3775.5 385367317 385766296 385893517 387900391 387131195 380167847 383216286 385504608 385731316 387417488
3784.2 387417488 383983765 382830811 383414383 384130363 384874115 384613991 385269699 384675560 384549866
3792.9 384549866 384115562 386337166 389760323 384742584 380756683 382733116 387586670 392746696
3800.6 392746696 385807266 376158142 378833580 381424026 385963020 390950584 380529022 377493324
3808.3 377493324 381948814 383208656 383102760 383189316 383587112 384561615 389823341 386876793 374545135
3817 374545135 379461670 384107056 388604774 387816315 371159706 374071083 380064049 382074699 384318352
3825.7 384318352 384187775 379921570 379849739 380616074 384237289 385077362 376924858 380904655 387002945
3834.3 387002945 380751495 379895706 387003593 378160782 376368866 383935814 377134743 376892815 382342606
3843 382342606 379641418 375544395 378183365 379510689 379121971 380579033 379866714 383098907 387212677
3851.7 387212677 382724762 380884628 362864914 368473129 378113022 377306747 375124245 377199974
3859.4 377199974 379451447 380660400 375687866 376710701 383791924 377047997 371425705 374938774
3867.1 374938774 380111427 385874329 376853104 368134880 371710968 378258820 380688019 371741524
3874.8 371741524 371866074 374631920 375158691 376865387 380538902 374871712 369072609 374070435 374421005
3883.5 374421005 376327286 379761391 368333969 368939171 372692833 373924522 378297539 377294006
3891.2 377294006 369441872 371413345 372892303 370978966 372024498 373156929 375965614 376832733
3898.9 376832733 368371315 371936722 372041435 367605743 372781982 368868790 366634445 367464600 368207169
3907.6 368207169 370526352 369682922 369581566 369431419 369790382 369917488 368740196 370360794 372140617
3916.3 372140617 368386574 365438919 370059776 369343109 365245705 367889748 369515724 370405846 367169075
3925 367169075 364776039 366481781 367292595 368084984 366544724 366974678 368482056 365812950 364245949
3933.7 364245949 364672508 364550514 364820290 365491562 365386848 365366554 364841576 366273232 367040253 363297997
3943.3 363297997 362850418 363473511 364403381 365080414 363187103 363364372 363262024 361833038 363007240
3952 363007240 363155022 361836815 361981659 362314529 362740936 362139778 361679840 361869926 362076759 362241325
3961.6 362241325 360330467 360389481 360847092 360697441 361496887 361150208 361391220 360409966 359579735 359961014
3971.3 359961014 359604988 359619179 359689522 359884872 359110870 358587646 358639336 358870621 359074707 358718071
3980.9 358718071 358630104 358161507 358328094 358198586 358251114 358561630 358000183 357417870 356399727 356511574
3990.6 356511574 357097092 357284088 356995392 356810112 356884422 356246834 355792961 355205345 355641937 355663719
4000.2 355663719
##END=$$ End of the data block
