##TITLE=$$ Begin of the data block
##JCAMP-DX=5.00 $$ ACD/SpecManager v 10.08
##SPECTROMETER/DATA SYSTEM=Varian
##DATE=04 Dec 2012 14:52:22
##DATA TYPE=INFRARED SPECTRUM
##DATA CLASS=XYDATA
##ORIGIN=
##OWNER=
##NPOINTS=3735
##FIRSTX=399.26403809
##LASTX=4000.35498047
##MAXX=4000.35498047
##MINX=399.26403809
##MAXY=69.99002838
##MINY=32.24402618
##XFACTOR=1.0000000000
##YFACTOR=0.000000100000000
##FIRSTY=65.73435974
##DELTAX=0.96440572
##XUNITS=1/CM
##YUNITS=TRANSMITTANCE
##XYDATA=(X++(Y..Y))
399.3F57343597L0590897j2821121O128082j5628281n868377q019104l033371N068054
407F53760376K795410J7506790n244674L459472l001632J736526M12140j1692276k703857
415.7F57028275j1196824K286988p752152J0290604j337814M84390J2674789j82953
423.4F62295303M647599p667847M630508k550506l306351K085342p999649O911622
431.1F59046021j140061N251236J365891j606141j209106j285934R678192m896241
438.8F65203857m35257o020202J56250M519043Q46863L105316q095932P143936n97839
447.5F65826035K581024j93253o100845J988983n609970L904343o60859K920456K52457
456.2F64908371K986755L617020p272415L051224o171952M770127k927704k078400
$$ y = [657343597, 687934494, 675113373, 681241455, 665613174, 659744797, 651725693, 648692322, 653760376, 656555786, 674062576, 668817902, 672277374, 669275742, 671012268, 671424408, 659732132, 657028275, 645831451, 648118439, 640366287, 650656891, 649319077, 649803467, 662478256, 662295303, 666942902, 659275055, 663905563, 661355057, 658048706, 660134048, 652134399, 659046021, 657905960, 663157196, 664523087, 662916946, 661707840, 660421906, 670100098, 665203857, 664768600, 658748398, 658904648, 663423691, 664270554, 667375870, 659279938, 666423874, 665826035, 668407059, 668213806, 662112961, 664101944, 658491974, 662396317, 661735458, 664655914, 664908371, 667895126, 671512146, 664239731, 667290955, 661119003, 665889130, 662961426, 660883026]
463.9F60883026P53937k999191N898513l220977P024841m604187l584213k296753q542481
472.6F49312515O284027N48249P334060l259201N213471O77108j0601196j705322L80173
481.2F54183884J1135101m867706n518647p17010N82199N003586k431107j301956j882172
489.9F54186172R005204J291198k586517k830353l589935M135971m955902J490173
497.6F56146011J270600L030472J479415l132934N08575j456299K017594n945969J523972
506.3F55441437L156967J063614K372436k899475K705384j306382L117752k526931
514F61124802n095978j570358m563752L176117o89544K712860P24792J233368L96042
522.7F57448349k361603J209412l934403n64651j835861K25067J593323J199646K457504
$$ y = [660883026, 661636963, 658637772, 664536285, 661315308, 668340149, 663735962, 660151749, 657854996, 649312515, 655596542, 656144791, 663478851, 660219650, 665433121, 666110229, 655509033, 653803711, 654183884, 665318985, 660451279, 654932632, 654215622, 654797821, 659801407, 657370300, 656068344, 654186172, 663191376, 664482574, 661896057, 659065704, 655475769, 659611740, 654655838, 656146011, 657416611, 660447083, 661926498, 658793564, 659302139, 657845840, 659863434, 653917465, 655441437, 658598404, 659662018, 662034454, 659134979, 661840363, 660533981, 663651733, 661124802, 656028824, 654458466, 649894714, 653070831, 652381287, 655094147, 655818939, 657052307, 657448349, 655086746, 656296158, 652361755, 651797104, 649961243, 650186310, 651779633, 652979279, 655436783]
531.4F55436783O98395M110794l08533o14929j836701r47799k35367o88706l0441j974487
541F53609009P813034J379852j750946K482147j259613R2316l034363m41513j699829
549.7F57190094R8495l37371j724472K657165M83017J061630o33316J330872j945038
558.4F58181076j292038J648331k848892o70701k258605M52270k79617N01404K196579
567.1F55629807Q60290K269974l932266j919022k312546k058182p34176m90113J819153
575.8F49132919J701889L824387p51419J90582j376266j048584K366256k095413j55334
584.4F51789017m23661J685410O35757J107636K153091R03016K787628k890625q55866
593.1F56891403j018600l86963o44379j698074K858200p15256L29666J209870K812347
$$ y = [655436783, 656135178, 660245972, 659937439, 659322510, 657485809, 656538010, 656302643, 655613937, 655583496, 653609009, 661422043, 662801895, 661050949, 663533096, 662273483, 662365799, 659331436, 658889923, 657190094, 657288589, 656951218, 655226746, 657883911, 658366928, 659428558, 658795242, 660126114, 658181076, 656889038, 658537369, 655688477, 655017776, 652759171, 653211441, 652931824, 653433228, 655629807, 656490097, 658760071, 654827805, 652908783, 650596237, 648538055, 647803879, 647313766, 649132919, 650834808, 654659195, 653907776, 654098358, 652722092, 651673508, 654039764, 651944351, 651789017, 651365356, 653050766, 653686523, 654794159, 656947250, 657850266, 660637894, 657747269, 656891403, 655872803, 655485840, 654841461, 653143387, 656001587, 655286331, 655615997, 656825867, 659638214]
601.8F59638214P58438k118606j103669k749023P25327q29621P74002K27433m49067
610.5F54873428J089325o20956J579208j042404N04150l63235k2659J64566n79148
619.2F55582275L307953k51465J621018Q35419J333236J271820j887817P69424j198120
627.8F61383743R67255j63269J159363J843719o44150J374436n6305J928482Q72192
636.5F68665466O93741p51877j582946l82081j236190J103973j52512J936188K3041
645.2F68316803l9597J466752r35059R28802j324615m32358r31015Q64639J042557
653.9F68956909o88629J628723p69653K75421n29938K38419o89087j192398O13708
662.5F67843475k12936J279831p60880K277069J962891r13544K892533j465836K03552
$$ y = [659638214, 660396652, 658278046, 657174377, 654425354, 655150681, 654321060, 655095062, 655322495, 654873428, 655962753, 655341797, 656921005, 655878601, 656382751, 656019516, 655996857, 656161423, 655582275, 658890228, 658638763, 660259781, 661095200, 662428436, 663700256, 661812439, 662581863, 661383743, 662350998, 662187729, 663347092, 665190811, 664546661, 665921097, 665864792, 667793274, 668665466, 669359207, 668607330, 667024384, 666642303, 665406113, 666510086, 666357574, 668293762, 668316803, 668277206, 669743958, 668808899, 669737701, 668413086, 667980728, 667049713, 667914352, 668956909, 668268280, 669897003, 669127350, 669402771, 668872833, 669111252, 668422165, 667229767, 667843475, 667630539, 668910370, 668149490, 670426559, 672389450, 671475906, 674368439, 672902603, 673106155]
671.2F73106155j310730N24750o44684j130447J86157j332474J617890J362076J609420
679.9F73988113j204986j270600K72141K51541R31015r58404J173935J90963n13382
688.6F72860336q50372R41544J369628j045532N21088j146393j94702j525269o17981
697.3F70312347J240464L16848N95932k563705n7220n38712j015549n05523j302720
705.9F66482162N38025n64880L62320l86734J287231Q33817k33994J437073K23770
714.6F69978790M03595j552047L72695Q91419K563248K903595j288605k36283j484603
723.3F72551804J032104O25610N31388J926193O83060J232986j568680Q03604J067200
732F78885269L22800J79748L51563J768570j137848L18756J92719n8213n56030O89697
$$ y = [673106155, 671795425, 672320175, 671675491, 670545044, 670731201, 669398727, 671016617, 672378693, 673988113, 672783127, 671512527, 671784668, 672036209, 672967224, 672008820, 673182755, 673373718, 672860336, 672009964, 672951508, 674321136, 673275604, 673796692, 672650299, 672455597, 670930328, 670312347, 671552811, 671869659, 672465591, 669901886, 669844666, 669305954, 668290405, 667784882, 666482162, 667020187, 666455307, 666817627, 666430893, 667718124, 668551941, 668317947, 669755020, 669978790, 670382385, 668830338, 669203033, 670094452, 672657700, 675561295, 674272690, 674036407, 672551804, 673583908, 674209518, 674740906, 676667099, 677350159, 678583145, 677014465, 677818069, 678885269, 679208069, 679387817, 679739380, 681507950, 680370102, 680688858, 680881577, 680823364, 680267334, 680957031]
741.6F80957031Q23288j998367O87k003785k29797r8038j252823o06536p31049J689377
751.3F76549988j284409j144027j099625N56259P41501k282868q95462j126175J433945
760F71449127n92880j241379M04511j3428J055679k66647P31354L9215J141281N43213
769.6F73250046K21481J392365m99878J507339J213761J205902O87255J426774K92587
778.3F80697632j702805R98764R0409J347351J51596M29001J680526Q49076O87790
787F85229340j156006J679382J052399R25216j89819j26343J901551j009598O73141
795.6F88979263M29612Q49227Q06885Q77533J482315P51496J289596j293640Q61282
804.3F95033569M2267j14746L89633j135177R31320J026916K696839j05973j88064
$$ y = [680957031, 681780319, 679781952, 679782639, 677778854, 677549057, 677451019, 676198196, 675591660, 674860611, 676549988, 675265579, 674121552, 673021927, 673578186, 674319687, 672036819, 671141357, 670015182, 671449127, 670856247, 669614868, 670019379, 670005951, 671061630, 670794983, 671526337, 671565552, 672706833, 673250046, 673471527, 674863892, 674364014, 675871353, 677085114, 678291016, 678978271, 680405045, 680697632, 678994827, 679993591, 680084000, 681431351, 681582947, 682011948, 683692474, 684541550, 685229340, 684073334, 685752716, 686805115, 687730331, 687540512, 687414169, 689315720, 688306122, 688979263, 689408875, 690258102, 691064987, 691942520, 693424835, 694176331, 695465927, 694172287, 695033569, 695075836, 694961090, 695350723, 694215546, 695146866, 696173782, 698870621, 698764648, 698576584]
813F98576584O19812L51257J88980k229919J459656q6060o2561N04608j60370O16303
822.6F99778290m64096N86090j961060j12991j113663j818313J45797j016922K62223
831.3F94285355j319733K02484j083221j396027o32935j608047J28708j943817j383515
840F85249252j222000K86637j93177k42386J841965r37271n44510o94427K42080j415252
849.6F82370911j591645Q38089M60053J256332n16815Q92029K64206P82165J245499
858.3F86000824j319275m03824q96301N66788n65338L26995J837616J504593J810150
867F88862228L59879J950455K89077L61939j9760l78037Q84781l5553J836243R43985
876.7F95055237J438446J009140P74155K55355j708755q91037k260971j475372j601487
$$ y = [698576584, 699196396, 699547653, 699736633, 697506714, 698966370, 698880310, 698817749, 699322357, 699161987, 699778290, 699314194, 699900284, 697939224, 697826233, 696712570, 694894257, 695040054, 694023132, 694285355, 692965622, 693168106, 692084885, 690688858, 690055923, 688447876, 688576584, 686632767, 685249252, 684027252, 684313889, 684120712, 683878326, 685720291, 684783020, 684238510, 683544083, 683786163, 682370911, 680779266, 681617355, 682077408, 683333740, 682816925, 683708954, 683973160, 684755325, 686000824, 684681549, 684277725, 683381424, 683948212, 683382874, 683709869, 685547485, 687052078, 688862228, 689222107, 691172562, 691461639, 691823578, 691803818, 691425781, 692310562, 692275009, 694111252, 695055237, 696493683, 697502823, 698276978, 698532333, 696823578, 695932541, 693671570, 692196198, 690594711]
885.3F90594711q7585J04294o96259K30942p97806J5259j725464o50864j608886k073746
895F83304596j65711j747360m33807m07410J071320J75552J67618O69250j851959q77151
904.6F79904938j694260j428757j723785m10538k73285q16574J253128k40860j42059
913.3F74427948j323624j450882j626587j924438j975098k287445O05393p44629J79062
922F63879700P37838K78702J26038j729584k98462j595077j335831j169510p04422
930.7F58189392P78122R78241J946487Q66852J463852K77176j95160n43060p41959
939.3F63019943Q25043n40848K82211O49109K351761K860108J533889R80683q36029
948F71125870n4322r11636j378555k045822j271057O98776L18222N51834o20194m83245
$$ y = [690594711, 690507126, 690611420, 689915161, 690146103, 689348297, 689363556, 687638092, 686987228, 685378342, 683304596, 683138885, 681391525, 680957718, 680550308, 681621628, 681797180, 681964798, 682634048, 680782089, 679904938, 678210678, 676781921, 675058136, 674647598, 674374313, 673557739, 674810867, 674570007, 674427948, 673104324, 671653442, 670026855, 668102417, 666127319, 663839874, 664445267, 663700638, 663879700, 664617538, 664896240, 665022278, 663292694, 662994232, 661399155, 660063324, 658893814, 658189392, 658967514, 659945755, 661892242, 662759094, 664222946, 664500122, 664304962, 663761902, 663019943, 663844986, 663304138, 663586349, 664235458, 666587219, 669447327, 670981216, 671961899, 671125870, 671071548, 670159912, 668781357, 666735535, 665464478, 666163254, 666481476, 667033310, 666413116, 665929871]
957.7F65929871r62754r72061k036743l437271k012940k299194j608429j488495l31955
966.3F50780029P0267p86056p21283j370240j690902l351670l072662l200455k492447
975F34164581p45735j004867j396332r57947N53360j130066j453438j459198j617508
983.7F24952850j240501k667542j807556j294212K85644L22381R61647K094612j01700
992.4F21505623j001129k281838r64241o85920j078415k08588k86026O27403O43273
1001.1F16270142J603584N46493k61230k95830r46045j124687k025642j004906j158295
1009.7F11603584j06964M14849P04345P99294j063996M5548l51448j021118j423798
1018.4F09600296r63325n86739o87180N91050K46086J180648O81839Q42324Q12683
$$ y = [665929871, 664967117, 663995056, 661958313, 658521042, 656508102, 654208908, 652600479, 651111984, 650780029, 650850296, 650064240, 649342957, 647972717, 646281815, 642930145, 639857483, 636657028, 634164581, 633418846, 632413979, 631017647, 630059700, 630613060, 629482994, 628029556, 626570358, 624952850, 623712349, 621044807, 619237251, 617943039, 618228683, 618551064, 619512711, 621607323, 621505623, 620504494, 618222656, 617258415, 616572495, 615494080, 615285492, 614999466, 615626869, 616270142, 617873726, 618420219, 618158989, 617863159, 616917114, 615792427, 613766785, 612761879, 611603584, 611496620, 611911469, 612615814, 613415108, 612351112, 612396660, 612045212, 611024094, 609600296, 608636971, 608050232, 607363052, 607954102, 608200188, 609380836, 610062675, 610904999, 611717682]
1027.1F11717682k05078m41666j900024n58434l50456J36185M51240J454697K105713
1035.8F12409859j74027O09131O8665p00379j422577j101303p78351o27212J052246
1044.5F09336052l1395J508408J287002K11563j54991n25856O08864q91304m00009
1053.1F10948334o47965K40212J178093Q63342Q90083M97284J670990L03154J366005
1061.8F17309532j81045k009201k8000j33171J044464M91485P15981P44591J202011
1070.5F19156647K06909j128616j074524l397713p16896j175385j689949J02921O57158
1079.2F10940552J666946l87726K49443k73895p36046j14822P41577P43179j371765
1087.9F11457443k88238o790J407508J232987R48562Q60558r50279m68941o45714Q92411
$$ y = [611717682, 611512604, 611070938, 609170914, 608612480, 608262024, 608398209, 608849449, 610304146, 612409859, 612235832, 612844963, 612913628, 612213249, 610790672, 609689369, 608911018, 608283806, 609336052, 609304657, 610813065, 612100067, 612311630, 612156639, 611630783, 612239647, 611348343, 610948334, 610300369, 610540581, 611718674, 612582016, 613472099, 613969383, 615640373, 615943527, 617309532, 617128487, 615119286, 615091286, 614958115, 616002579, 616494064, 617210045, 617954636, 619156647, 619363556, 618234940, 617160416, 613762703, 613045807, 611870422, 610180473, 610283394, 610940552, 612607498, 612219772, 612469215, 612195320, 611459274, 611344452, 612086029, 612829208, 611457443, 611169205, 611162415, 612569923, 613802910, 614751472, 615612030, 614661751, 614192810, 613547096, 614439507]
1097.5F14439507J30920k7161K03858k34490Q94814m8676R69773o52123q63609K05383
1107.1F15018196l40385q8921p25326O08482K73704P03774l7727k5521J272469m99459
1116.8F16159286k40211R7542J020164l98483l09486J038284k38228N69420J52054
1125.5F17850342K54707K30675O56662J94549l07426N06821l78151Q19130K41584K3461
1135.1F20092354P9651j94741O09169K13013K86598j416588j063423q08372r62906
1143.8F16834755k40631m43497k70996j046905K0675j73759l89595o90956j252938
1152.5F12346153m95529p54471M56581j03569n6419K13356k19078N00603N51223N72319
1162.1F13011169o18362J45683O57044O30455P57370O12755J113243P43065J805801
$$ y = [614439507, 614570427, 614543266, 614747124, 614512634, 615407448, 615358772, 616328545, 615676422, 614812813, 615018196, 614677811, 614588890, 613863564, 614472046, 614745750, 615449524, 615411797, 615386276, 616658745, 616159286, 615919075, 616016617, 617036781, 616638298, 616328812, 617367096, 617128868, 617698288, 617850342, 618105049, 618335724, 618992386, 619186935, 618879509, 619386330, 619008179, 619827309, 620068893, 620092354, 620172005, 619977264, 620586433, 620799446, 621086044, 619669456, 618606033, 617797661, 616834755, 616594124, 616150627, 615879631, 614832726, 614853401, 614679642, 614290047, 613599091, 612346153, 611850624, 611096153, 611552734, 611449165, 611392746, 611606102, 611387024, 611887627, 612438850, 613011169, 612392807, 612538490, 613195534, 613825989, 614583359, 615196114, 616309357, 617052422, 618858223]
1170.8F18858223J220322J209640J069069L39241J419869J111450J761780J287574
1178.5F28277168J553498J456070R70497J678390P05872P01141j89247P62520R52568
1187.2F36868477L37944J059189M25491R62792j0338J08108m8141k82669J030o77376
1196.8F38744507K39868n12009q5601J74102L36113O10199k3536L24516p6332K09083
1206.5F39940910m95529K55432M21181l14102L26691K92892J436157N15442M18701
1215.1F42797775M61655J36719N74569m74243j12076j54571M57382k1133n49622J88446
1224.8F43304901J40000m6158r32923k32544n46112j44043j10855r23843j8997j14365
1234.4F40375061M36020P4539M6921k82898l16086J76087l76587m1504q47931K60353
$$ y = [618858223, 620078545, 621288185, 622357254, 622696495, 624116364, 625227814, 626989594, 628277168, 629830666, 631286736, 632257233, 633935623, 634641495, 635342636, 635153389, 635915909, 636868477, 637206421, 638265610, 638691101, 639653893, 639643555, 639751663, 639703522, 639420853, 639421883, 638744507, 638984375, 638472366, 638386765, 638560867, 638896980, 639507179, 639483643, 639808159, 639731827, 639940910, 639445381, 639700813, 640121994, 639807892, 640134583, 640427475, 641863632, 642379074, 642797775, 643259430, 643396149, 643970718, 643496475, 643384399, 643229828, 643687210, 643666077, 643116455, 643304901, 643444901, 643398743, 642465820, 642233276, 641687164, 641543121, 641432266, 640508423, 640489426, 640375061, 640811081, 640885620, 640932541, 640649643, 640333557, 640509644, 640133057, 640091553, 639243622, 639503975]
1244.1F39503975M23202r536L82728k80304N59769N9967L4409k03705k48337N8517
1253.7F40280685K1058P39059Q5220M83246J66626Q3161l7613j67237M70581m10080
1263.4F41714706J06202J9073J83182K8076Q3771P29904Q0490N35965j27945m86221
1273F42867203q48389j62277M37469k86941M39300N2872L82996J72577R9334m0512
1282.7F43113632o56357j12838n24750l3951k31628j15280o99387o67114M60815l59726
1292.3F40173416K06375q2092J77002q8654j073417o39115n83267J36414l55721j64299
1301.9F37706642J3542j52282k8992o7711J60637k61955j34316p87468j73378J05896
1311.6F36380615Q78P9803o94504M37661m20037o86798k05002n09186n86738r05037
$$ y = [639503975, 639927177, 639917641, 640300369, 640020065, 640579834, 640639801, 640674210, 640470505, 640222168, 640280685, 640301743, 641040802, 641126022, 641609268, 641775894, 641859055, 641821442, 641654205, 642124786, 641714706, 641820908, 641839981, 642023163, 642051239, 642135010, 642864914, 642945404, 643481369, 643353424, 642867203, 642018814, 641856537, 642294006, 642007065, 642446365, 642499237, 642882233, 643054810, 643154144, 643113632, 642457275, 642344437, 641819687, 641785736, 641554108, 641438828, 640739441, 640072327, 640533142, 640173416, 640379791, 640297699, 640474701, 640386047, 639312630, 638673515, 638090248, 638226662, 637870941, 637706642, 637720184, 637567902, 637538910, 637471199, 637631836, 637369881, 637235565, 636448097, 636274719, 636380615, 636381493, 636461296, 635766792, 636204453, 635784416, 635097618, 634892616, 634383430, 633796692, 632891655]
1321.2F32891655l21312n89867L9177l73954m46625r5597l87229J61476n37110j48544
1330.9F30192070p56149o74553q7166l92647J57547l28522P8850l72314l37601j83449
1340.5F27296066l67660J79634m59137k90375n7793Q1711k62375M51088J94550p43790
1350.2F26021919L58620k01683m89884q39843m48036j98174k30865N3329o41899N76362
1359.8F23959846K8496l8070j82076k033577L6621K68746q1597k33955R7923k45933
1369.4F21576424k62528O4392M66538P79915j350022p05108J0871L89863j2207p53518
1379.1F20204620Q6136l25393K25753m3945L18527N21202N57633Q83674j216507N44777
1388.7F21756477O48995q3885l41530K57759J552200k09579j194725j43662P65686
$$ y = [632891655, 632570343, 631980476, 632019653, 631645699, 631199074, 631103477, 630716248, 630877724, 630340614, 630192070, 629435921, 628761368, 628674202, 628281555, 628439102, 628110580, 628189430, 627817116, 627479515, 627296066, 626928406, 627108040, 626648903, 626358528, 626300735, 626382446, 626120071, 626571159, 626765709, 626021919, 626380539, 626178856, 625688972, 624849129, 624401093, 624202919, 623972054, 624025383, 623383484, 623959846, 623988342, 623950272, 623768196, 621734619, 621771240, 622039986, 621958389, 621724434, 621822357, 621576424, 621313896, 621378288, 621844826, 622624741, 621274719, 620569611, 620580482, 620970345, 620958138, 620204620, 620290756, 619965363, 620191116, 620147171, 620465698, 620986900, 621544533, 622428207, 621211700, 621756477, 622405472, 622321587, 621980057, 622237816, 623790016, 623580437, 622385712, 622242050, 623007736]
1397.4F23007736M52538j853676j194763M89502M00581k55966N84297j309814r31359
1406.1F19389076O81610q7318L88756l78838n49583o68221k79121L64647j68381K50206
1415.7F18942833k10495O61507J220626l974037j108017J928482J141739K87285j443558
1424.4F17446365p16362J232033K66533O34308P26623j297569k94418L97415j53160
1433.1F18241768n39169J608886J716881m448280m00772K166977J040458L42369K92511
1441.8F20021629o23436j99356j69716n99136O32858M91524j693611p21169J184273
1450.5F18323860N06478l36648Q5373J234627K180252j35574l457146k379188L71704
1459.1F16393738j71204J495896J182327J18408K158546r40933j054115J146851R36241
$$ y = [623007736, 623460274, 621606598, 620411835, 620901337, 621301918, 621045952, 621630249, 620320435, 619389076, 620070686, 619983368, 620372124, 619993286, 619443703, 618775482, 618496361, 618861008, 618692627, 618942833, 618732338, 619393845, 620614471, 616640434, 615532417, 617460899, 618602638, 618889923, 617446365, 616730003, 617962036, 618228569, 618862877, 619589500, 618291931, 617997513, 618394928, 618241768, 617702599, 619311485, 621028366, 616580086, 616179314, 618346291, 619386749, 619729118, 620021629, 619398193, 619198837, 619029121, 618429985, 619062843, 619554367, 617860756, 617139587, 618323860, 618830338, 618493690, 618579063, 619813690, 621993942, 621858368, 618401222, 616022034, 616393738, 616222534, 617718430, 618900757, 619019165, 621177711, 620236778, 619182663, 620329514, 621265755]
1467.8F21265755P13653M18587K927322J869660o65016j039849J806336L928261p71714
1476.5F30452995l13034J861687J157913J458512O51206j18446J207543J440315J486702
1485.2F39285393L121452P38983l23639K354584M53644k029419L21350K409439J366806
1493.8F47698593K270508K533951l884125K437592J804733j843720J633988P19909
1501.6F53371429n46035J138076L518906M206696l645783p394256L595428K371368
1509.3F56615829O77186K505798L30276k623672J831283J975861J084900j1597n096893
1518F57288971L842773M660416j684952k491531k273102K430267L105393k313843l67279
1526.6F62197113J641235j118469j74026K043304Q68912J079635j78985n370026J606064
$$ y = [621265755, 621979408, 622397995, 625325317, 627194977, 626529961, 625490112, 627296448, 631224709, 630452995, 630139961, 632001648, 633159561, 634618073, 635269279, 635150833, 636358376, 637798691, 639285393, 642406845, 643145828, 642822189, 645176773, 645630417, 643600998, 643922348, 646331787, 647698593, 649969101, 652503052, 648618927, 651056519, 652861252, 651017532, 652651520, 653371429, 652825394, 653963470, 657482376, 661689072, 658043289, 650649033, 654244461, 656615829, 657293015, 659798813, 660129089, 657505417, 659336700, 661312561, 662397461, 662385864, 657288971, 661131744, 665792160, 664107208, 661615677, 659342575, 661772842, 664878235, 662564392, 662197113, 663838348, 662719879, 662545853, 664589157, 665458069, 666537704, 666358719, 660988693, 662594757]
1535.3F62594757J339340K013855M302292j686249j0689468M492340K437897j306381
1543F63498383L639907M76761m396744J042786J061936K067184j03683m093552J106872
1551.7F64299850K751694K650147l481293j784668N004730N065613q985672l662415
1559.4F61857986k013015L032760K664719J169739J863556j875306j475830J007538
1567.1F66232147J476975J689224o952972k8992J945953K17133O77032K144470J289368
1575.8F68690338r468231J823120K190170l09829m39453q42896l19901o91070J34277
1584.5F60766525j01242m35333m32739n07050j37482j100692p84912j515122m09241
1593.2F55342712k75726j209640j80664o07148k26135j310959p07474n57632r48257
$$ y = [662594757, 663934097, 665947952, 670250244, 668563995, 657874527, 662366867, 664804764, 663498383, 667138290, 667615051, 663218307, 664261093, 665323029, 667390213, 667286530, 663192978, 664299850, 667051544, 669701691, 666220398, 664435730, 669440460, 674506073, 665520401, 661857986, 659844971, 662877731, 665542450, 666712189, 668575745, 666700439, 665224609, 666232147, 667709122, 669398346, 662445374, 662416382, 664362335, 664579468, 665256500, 667400970, 668690338, 659222107, 661045227, 663235397, 662925568, 662486115, 661643219, 661323318, 660632248, 660766525, 660665283, 660229950, 659797211, 659290161, 659152679, 658051987, 657267075, 655751953, 655342712, 655066986, 653857346, 653676682, 653069534, 652843399, 651532440, 650824966, 650267334, 649319077]
1601.9F49319077n98603k366485j405716n23682m96750j897201p08542r23615k189827
1610.5F38208656l56064j349754q13484j514778Q01735N58738j0187454R55277M88891
1619.2F26791763j57013r87815P70111J00784o529503k02408L66745J101341k337112
1627.9F18916893l333244L03459p02591q1139q0299J700897K891579p499199k407913
1636.6F09708443K495193q10966N61103K26021q10127J219482J030J616173K337685
1645.3F16544037j908493j186791j725616J97868J553574L262138M018326n759125
1653F14995918j0360946O971778M654007K045022P29179L63769L14827K56577K253799
1661.6F22223930O52695l329925K009010K346153J112785K026597L290748k986526
$$ y = [649319077, 648720474, 646353989, 644948273, 644424591, 643927841, 642030640, 641322098, 640398483, 638208656, 637852592, 636502838, 635689354, 634174576, 634976311, 635535049, 625347595, 626302872, 626791763, 626634750, 625646935, 626417046, 626517830, 619988327, 619785919, 620152664, 621254005, 618916893, 615583649, 615887108, 615184517, 615103378, 615023079, 616723976, 619615555, 612116356, 609708443, 612203636, 611392670, 611953773, 612179794, 611369667, 612589149, 612590179, 614206352, 616544037, 614635544, 613448753, 611723137, 611921005, 613474579, 616736717, 620755043, 614995918, 604634972, 611606750, 616260757, 618305779, 619034958, 619398727, 619713554, 619970131, 622223930, 622876625, 619546700, 621555710, 623901863, 625014648, 627041245, 630331993, 627345467]
1669.4F27345467j362992K839203j090011K154083M121666Q3618m220963K462197L304825
1678F35637093K198143J293907j844025K542839N599594K105789j1161232N81131N520287
1686.7F42473526L263626K71454N95169K02560J291657J632996J076660L373794L061142
1695.4F57242584q344574J573258M439926N548553k544555j1603394P434387M232483
1703.1F57978668J891861o99615M41208j374665l99627L118743P90101r14917O51321
1711.8F61483078J898499K602539n68390j913300K485123K341308q262939J011429
1719.5F61077347K890091J311798J518173K91748p22046J80359O95572P4158M44717
1728.2F67761917K132340q06809j582947L450470M414444k964935q828659L331375
$$ y = [627345467, 625982475, 628821678, 627731667, 629885750, 634007416, 634091034, 629870071, 632332268, 635637093, 637835236, 639129143, 637285118, 639827957, 645427551, 647533340, 636372108, 636953239, 642473526, 645737152, 646008606, 646603775, 646806335, 648097992, 649730988, 650807648, 654181442, 657242584, 648898010, 650471268, 654911194, 660459747, 657915192, 646311798, 653746185, 657978668, 659870529, 659170914, 659612122, 658237457, 657837830, 660956573, 661746674, 660831757, 661483078, 663381577, 665984116, 665415726, 663502426, 665987549, 668328857, 660065918, 661077347, 663967438, 665279236, 666797409, 667089157, 666367111, 666547470, 667243042, 667317200, 667761917, 669894257, 669087448, 667504501, 670954971, 675369415, 672404480, 663575821, 666907196]
1735.9F66907196L157425Q67462K321549q32901m862214L018418K787857j493530j582795
1744.6F70288467J601181J820984M70734n22461k144241K862091r00116m294205K736282
1753.3F71918716R28650J134034J648864k833633k49252J333007Q80585J471024l082352
1761.9F73149643k293549K148590P27997j45416J521530J387253l264465O48269M092865
1770.6F77972717N75638m004669k935562L163757J596985k697296J128845O48422P82852
1779.3F76231689L41721k483749j26038N26047J212768p64694j328430R06296J69906
1788F74685516L85743J258468J002350L28751l542786k360611K727737J470261j335068
1796.7F74620361K47650J350556l04566j998138J359100j77230j126481Q58307j05590
$$ y = [666907196, 670064621, 670932083, 673253632, 672420731, 667558517, 670576935, 673364792, 671871262, 670288467, 671889648, 673710632, 674181366, 673658905, 671514664, 674376755, 673476639, 669182434, 671918716, 672847366, 673981400, 675630264, 672796631, 672547379, 673880386, 674760971, 676231995, 673149643, 670856094, 673004684, 673732681, 673587265, 675108795, 676496048, 673231583, 673879852, 677972717, 678548355, 674543686, 671608124, 674771881, 676368866, 673671570, 674800415, 675448837, 676231689, 676573410, 674089661, 673963623, 674489670, 675702438, 674937744, 673609314, 674515610, 674685516, 675071259, 676329727, 677332077, 677660828, 674118042, 671757431, 674485168, 675955429, 674620361, 674868011, 676218567, 675914001, 673915863, 675274963, 675097733, 673971252, 674829559, 674723969]
1805.3F74723969P32650J88065j066208M72794J050643j265716q76312M72946l91083
1814F74041748M50058P4158K00577m76304p12814Q77533m31595J69907k79923Q21534
1823.7F74734879J966552l524170j167068J655578K324982R07517n098343m34647J676483
1832.3F73041763L33939j96762O7444O45599l13644j297074r1781k01798q3542K93122
1842F72197266J602783J205826n843888O28662K457962o86340q97217k67105L5172
1850.7F70433121m60053J43357K00424j07041j05972n23605K87094k16294l16162j18713
1860.3F69216156j78604m04205j24283L07693q6365R56879K40021N73959p08923l313141
1869.9F66479187K92816P02515M02450k20260l34931Q6441M8676j9074l89251J79290
$$ y = [674723969, 675456619, 675644684, 674578476, 675051270, 676101913, 674836197, 673959885, 674432831, 674041748, 674491806, 674565964, 674766541, 674290237, 673577423, 674454956, 674023361, 674193268, 673913345, 674734879, 676701431, 673177261, 672010193, 673665771, 675990753, 676898270, 671799927, 671365280, 673041763, 673375702, 673178940, 673246384, 673891983, 673578339, 672281265, 672189484, 671987686, 671904144, 672197266, 673800049, 675005875, 669161987, 669790649, 672248611, 671562271, 670665054, 670397949, 670433121, 669973068, 670116425, 670316849, 670209808, 670103836, 669580231, 669867325, 669651031, 669334869, 669216156, 669037552, 668633347, 668509064, 668816757, 668730392, 669687271, 669927292, 670501251, 669792328, 666479187, 666772003, 667474518, 667876968, 667656708, 667321777, 667408218, 667456894, 667437820, 667048569, 667227859]
1879.6F67227859k71072J35880j56174k30332j03378j013412P9498N5466J446533Q4686
1889.2F67255554l285599M84238R99069p2937L49884j94244j764145j40991O11420
1897.9F64242249j5336O01426j23520p935r8801k39028m71573o24543K03400l09524
1907.6F63156815l9673J13983l32565k05384N17807k17514q54721l51257j77994J361389
1917.2F62970886j818008j948395J328659N71518J259003p73697j679917L20435L42331
1925.9F60572815k00653q54263m53034j77612J98898K5635K38571%l26462L6927l663
1936.5F59057159J69220p09762m54178l80096R09500L23944l101807O46439J117477
1945.2F57577896l7765l3799j97601L02582m26560l35540m36783k3194P5303j76926
$$ y = [667227859, 666956787, 667092667, 666936493, 666706161, 666602783, 665589371, 665668869, 665724335, 667170868, 667255554, 663969955, 664454193, 665453262, 665380325, 665730209, 665535965, 663771820, 663630829, 664242249, 664226913, 664828339, 664704819, 664696884, 664598083, 664359055, 663887482, 663262939, 663466339, 663156815, 663117142, 663231125, 662898560, 662693176, 663210983, 662993469, 662138748, 661787491, 661609497, 662970886, 661152878, 659204483, 660533142, 661104660, 662363663, 661589966, 659910049, 660230484, 660572815, 660372162, 659517899, 659064865, 658887253, 659086151, 659111786, 659350357, 659350357, 659023895, 659060822, 659057159, 659226379, 658516617, 658062439, 657682343, 658591843, 658915787, 655813980, 656460419, 657577896, 657540131, 657506332, 657308731, 657611313, 657184753, 656849213, 656412430, 656389236, 656464539, 656287613]
1954.8F56287613O0882j45645J86844N8823J59378o63529o69860j83869l15094j3885
1964.5F54761658o0959R35135r842n48706K50931j34583l84674o86798k62146m40750
1974.1F53419266j95389r7427k2049M09622L7536J07270r7733K56272l06244o36521
1983.7F52874603l34701p55234k39258O6757N0278m23813Q83255J053162j475220q40759
1993.4F50859070J26877j30539r06830o75202R1629J42136J78681J11084j9913o43006
2003F49133987l31497k51617k47650l18222r63211n13230j69830J79977K9450n4169
2012.7F46493988k91824m74549K36435k56424q98819n52444n1346n42145m93393K6932
2022.3F43196411k36359j29394j94473n5771m65927l33939k44446p66525l58200m62837
$$ y = [656287613, 656348495, 656202850, 656389694, 656448517, 656607895, 655944366, 655274506, 655090637, 654775543, 654761658, 654700699, 655635834, 655625992, 655077286, 655328217, 655193634, 654808960, 654122162, 653860016, 653419266, 653223877, 653126450, 653104401, 653514023, 653551559, 653658829, 653561096, 653817368, 653511124, 652874603, 652539902, 651784668, 651545410, 651612167, 651662445, 651238632, 652121887, 653175049, 651699829, 650859070, 650985947, 650855408, 649948578, 649273376, 649365005, 649507141, 649685822, 649796906, 649776993, 649133987, 648802490, 648550873, 648303223, 647985001, 647021790, 646508560, 646338730, 646518707, 646548157, 646493988, 646202164, 645727615, 645964050, 645707626, 644808807, 644256363, 644205017, 643662872, 643169479, 643196411, 642960052, 642830658, 642636185, 642580414, 642114487, 641780548, 641536102, 640769577, 640411377, 639948540]
2032F39948540l87116k42882N4627j20735j02158N4703p84912l58010l13377o58874
2041.6F37089806o03028j29585P6485k14577K9831k34985J40762j82266l33023j98365
2051.2F35441055l49922Q7395o47965l55301j9683N8555J97602J83486M27590l12691
2060.9F34710121l99818n42794j62048l62358p19070L3989j00480K26670L0594P0343
2070.5F32785149J25618q4382m41741r06067j07003N2071R0103l30772j34697J68876
2080.2F31217155k4261M78249k00615l25394m21486l75786k32925n1651L46489n43328
2089.8F29866447k61993K67601L98064L6277k06642j04522m35067m5394m07029n59730
2099.5F28548012k29721L07350J4839k55279M42810o562K0104o23436n15328J06049
$$ y = [639948540, 639561424, 639318542, 639373169, 639252434, 639150276, 639204979, 638420067, 638062057, 637748680, 637089806, 636486778, 636357193, 636433678, 636219101, 636248932, 636013947, 636154709, 635972443, 635639420, 635441055, 635091133, 635178528, 634530563, 634175262, 634155579, 634214134, 634411736, 634595222, 635022812, 634710121, 634310303, 633767509, 633605461, 633243103, 632524033, 632558022, 632457542, 632684212, 632714806, 632785149, 632910767, 632826385, 632384644, 631478577, 631371574, 631423645, 631513748, 631182976, 631048279, 631217155, 631192894, 631671143, 631470528, 631145134, 630723648, 630347862, 630114937, 630063286, 630409775, 629866447, 629604454, 629872055, 630270119, 630306396, 630099754, 629995232, 629560165, 629514771, 629107742, 628548012, 628318291, 628625641, 628640480, 628385201, 628828011, 628821449, 628841553, 628218117, 627702789, 627808838]
2109.1F27808838k20642k60735n62858K57530J21384j21193j14594j97067R9182l05023
2118.7F26504822n3292n37986m58489k24151l128K69584m06570l472m4937r842k02255
2129.4F24830284j49345j08719o77605k05726r8954J69525k56805j80206l9215l61023
2139F22922211J82647k56576j92795j04523M1008k47879n93795j5908r8228K8190j87225
2149.6F21477127k0180l4942j89286k17628n00984k48261j40381M73252J06086q1748
2159.3F20623055J10931J68419J62124n86166Q4801j40724k30561J10474o3133P8811
2168.9F20318031l96690P8125K36549K71302N7106M9896K66800k72370n9433k46238
2178.5F20303078j08567l16734k6932L84026k35787R4223J57586K80037j32943J4267
$$ y = [627808838, 627588196, 627327461, 626764603, 627022133, 627143517, 627022324, 626907730, 626710663, 626809845, 626504822, 626451530, 625913544, 625455055, 625230904, 625227776, 625497360, 625090790, 625087318, 625042381, 625032539, 624830284, 624680939, 624572220, 623894615, 623688889, 623589935, 623759460, 623502655, 623322449, 623283234, 622922211, 623104858, 622848282, 622655487, 622550964, 622591972, 622344093, 621750298, 621734390, 621636162, 621664352, 621477127, 621456947, 621422005, 621232719, 621015091, 620514107, 620265846, 620125465, 620598717, 620704803, 620623055, 620733986, 620902405, 621064529, 620478363, 620563164, 620422440, 620191879, 620302353, 620239220, 620318031, 619921341, 619999466, 620236015, 620507317, 620564423, 620614319, 620881119, 620608749, 620549316, 620303078, 620194511, 619877777, 619850845, 620234871, 619999084, 620093307, 620250893, 620530930, 620397987, 620412254]
2188.2F20412254J15204n10254l3531n0392j09825j84860R3650K61956N35316L71513
2197.8F20901031n42716k13051k78473M7455J7242j35155N1804j72043M52766L78037
2207.5F20506897L34396m0702k76642j70327l80439r652j38740j67999J4457L81470
2217.1F20052719J67313n455n2796q8081J94969n89561j24588J13525p2975P0686l33938
2227.7F19331818k0142J91612M27819j01548n6610q3275m58526r1591l34320Q9989
2237.4F18895226j16082k14309k37160k58713K16255Q6174J79444l23525l9100j30120
2247F18058090k23312Q6746l28865p9880j92718K78396J7128j42097J49498n036L17269
2257.6F17935219l00217k84309l52936j09291K5101j74485K90375n7602o4583k03972
$$ y = [620412254, 620527458, 620017204, 619983673, 619933281, 619823456, 619638596, 619732246, 619994202, 620529518, 620901031, 620358315, 620145264, 619866791, 619914246, 619931488, 619796333, 619848137, 619676094, 620128860, 620506897, 620841293, 620800591, 620523949, 620353622, 619973183, 619963531, 619824791, 619656792, 619671249, 620052719, 620220032, 620214577, 620161781, 620073700, 620268669, 619679108, 619554520, 619668045, 619595070, 619665756, 619331818, 619311676, 619503288, 619931107, 619829559, 619772949, 619689674, 619231148, 619139557, 618805237, 618895226, 618779144, 618564835, 618327675, 618068962, 618285217, 618371391, 618550835, 618227310, 618188210, 618058090, 617834778, 617921524, 617592659, 617512779, 617320061, 617598457, 617615585, 617473488, 617622986, 617617950, 617935219, 617635002, 617350693, 616997757, 616888466, 616913567, 616739082, 617029457, 616971855, 616907272, 616703300]
2267.3F16703300J412j85852k51885q6250l52135L00522J12915l43k27470J08680L95546
2277.9F16518440n0239j39084p29561o01044o14662L32451M74281L4714L74298j91536
2287.5F15408058m997k49901L96156K9068m94270p0496m74205L64495k30789P2860
2297.2F14745979K96479R3498L56140j34354L87421l60947l1509l13187k7618Q40645
2306.8F15852547L3989M58793j74904N81475K86751k37923n34287q85620Q67424j18828
2316.4F16129417M11911J39428k0867N54695J0796J002998k96669J97182j74294j67541
2326.1F17787056q9302L0289J243019n46952J84746l55797j79062l97796M22554J058922
2335.7F19157677j828118o1111j71547k15988j003647j76430J105576q45490L84026
$$ y = [616703300, 616704712, 616518860, 616266975, 616180725, 615828590, 616129112, 616242027, 616241684, 616014214, 616122894, 616518440, 616468201, 616329117, 615599556, 614998512, 614383850, 614716301, 615190582, 615225296, 615599594, 615408058, 615403061, 615153160, 615549316, 615578384, 615084114, 615013618, 614539413, 614903908, 614673119, 614745979, 615042458, 615135956, 615492096, 615357742, 615745163, 615384216, 615352707, 615039520, 615011902, 615852547, 615886536, 616345329, 616170425, 616751900, 617038651, 616800728, 616266441, 615380821, 616248245, 616129417, 616541328, 616680756, 616659889, 617214584, 617225380, 618228378, 617931709, 618128891, 617954597, 617787056, 617697754, 617728043, 618971062, 618424110, 618608856, 618253059, 618073997, 617676201, 618098755, 619157677, 617329559, 617268448, 617096901, 616880913, 615877266, 615700836, 616806412, 615960922, 616344948]
2344.4F16344948j287918j325722k150116j359253J869774J997414R32884l9826P07817
2353.1F15690002L68042N07889L73383l57323M20952O4583J123352n27954j067810
2361.8F16595116r67789O0043r19227k589226K51503K90604l14560k488900j882667
2370.4F08034897J33362k04316r48028k060013j329918o28166L45879l32413o42319
2379.1F02368965m22897j278877q79937q24127m09469o88782m83017j52626l78533
2387.8E96850700K94571l23829q3466n7907j27716k69585r55734k63100n03273j53007
2397.4E94407654R6969k51960l17231l58467J84327J18789k22053m80461j20087o04134
2407.1E92453346p93380m9515l1967r995j47171m6158n68237l25317k25831o05888
$$ y = [616344948, 615057030, 613731308, 611581192, 610221939, 612091713, 614089127, 615022011, 614982185, 615690002, 616058044, 616565933, 616939316, 616581993, 617002945, 617067528, 618190880, 617662926, 616595116, 615627327, 615687370, 614768143, 612178917, 612430420, 612721024, 612406464, 609917564, 608034897, 608168259, 607963943, 607015915, 604955902, 603625984, 602997818, 603343697, 603011284, 602368965, 601946068, 600667191, 599787254, 598963127, 598553658, 597864876, 597381859, 597229233, 596850700, 597145271, 596821442, 596737976, 596680069, 596552353, 596282768, 595327034, 595063934, 594560661, 594407654, 594504623, 594252663, 593935432, 593576965, 593761292, 593880081, 593658028, 593177567, 593057480, 592453346, 591659966, 591610451, 591578484, 591568489, 591421318, 591375160, 590806923, 590481606, 590255775, 589649887]
2416.7E89649887k31247o10237k79198r7046l3454l88604j05781N19829l54042l96271
2426.4E87673836p00112n42144o65360o83632k9297k3994K24190m81835j72119j2207
2436E84587326m11797n52139n43022K38266m12712q09326p02210j72691L3493r9335
2445.7E81155853r6740n44129J37673j54915l59688p25823j252670m85763K3880J56326
2455.3E77854004m89998Q7242K52152j63346l85856p58438j82038j15623J07383l92684
2465E75812798l87612m99382q06579l1586j13831K19345k65312l67126n49202o84204
2474.6E72327309r4605n69954j37024l14178K36320M02527m03976P0686J67351k80609
2484.2E71403847j104584n79567m31976l6621K03170n92079J00518J81770j00746o78749
$$ y = [589649887, 589418640, 588808403, 588529205, 588432159, 588398705, 588010101, 587904320, 588424149, 588070107, 587673836, 586973724, 586431580, 585766220, 585082588, 585053291, 585029297, 585253487, 584771652, 584599533, 584587326, 584175529, 583623390, 583080368, 583318634, 582905922, 582096596, 581394386, 581221695, 581255188, 581155853, 581059113, 580514984, 580652657, 580497742, 580138054, 579412231, 578159561, 577673798, 577697678, 577854004, 577364006, 577451248, 577703400, 577540054, 577154198, 576395760, 576213722, 576098099, 576205482, 575812798, 575425186, 574925804, 574119225, 574087639, 573973808, 574193153, 573927841, 573560715, 573011513, 572327309, 572232704, 571662750, 571525726, 571211548, 571447868, 571850395, 571446419, 571517105, 571684456, 571403847, 570299263, 569719696, 569287720, 569251099, 569454269, 568862190, 568962708, 569144478, 569043732, 568364983]
2493.9E68364983k15416M959o81610m69208n97649J2703m2457L14407J50375n41343
2503.5E66299744j56098j09176L43589n82733p52296k80609p3204Q9759m82749k01455
2513.2E64094772l47557n1040k78206k85836p8849l45726J8387n05066j19553k70424
2522.8E61830902m07905r9450L8681K66304n09529j3923o7864l25241o60553r88922
2532.5E59062500l09143m22974k41470J97220L77388p31888l55186L46336m73938k16713
2542.1E57232132p31087l94859j25389l74527k18353L3454K41242m55208j40877m89998
2551.7E54576530l18946k10686o73676j74293j91231L14140m32777p47414j40228K40707
2561.4E52242126K25640n88379j87416m41780m33159j64452j67198k17247k97165J58844
$$ y = [568364983, 568149567, 568154526, 567472916, 567003708, 566406059, 566418762, 566376305, 566690712, 566841087, 566299744, 566143646, 566034470, 566378059, 565795326, 565043030, 564762421, 564689217, 564778976, 564296227, 564094772, 563747215, 563696175, 563417969, 563132133, 563053284, 562707558, 562725945, 562220879, 562101326, 561830902, 561422997, 561323547, 561362228, 561628532, 561119003, 561105080, 561037216, 560711975, 560051422, 559062500, 558753357, 558330383, 558088913, 558286133, 558663521, 557931633, 557576447, 557922783, 557448845, 557232132, 556501045, 556106186, 555980797, 555606270, 555387917, 555421371, 555662613, 555207405, 555066528, 554576530, 554257584, 554046898, 553373222, 553198929, 553007698, 553321838, 552889061, 552141647, 552001419, 552242126, 552467766, 551879387, 551691971, 551250191, 550817032, 550652580, 550485382, 550268135, 549970970, 550129814]
2571E50129814o20766n93109m8942L03993M3144o85577o28128m74129M8370l41377
2580.7E47133293j15852J03950R957j3008p88041l31039K5482M6005p21588p63359
2590.3E44585800P9231N0240N5466l41225l1891k27356j93786j37406m77371m540j71852
2600.9E43185310k50969o18705l05939k52609j76506L9901n94902J450k53563m96712
2610.6E40276756o59027m39682M5242n89981j97753o0235k85797m89921J68495l3684
2620.2E37734413q59604l43322l96042p9232n92270n11970j58577l78380j99508p81098
2629.9E33434410l80402l06854n7716j73988m42315r3650m96750k90451m61960n1689
2639.5E30678635m00849r48677k15912k57454o53686p29447J49575j23253l50151m36630
$$ y = [550129814, 549509048, 548915939, 548866997, 549170990, 549214134, 548528557, 547900429, 547426300, 547474670, 547133293, 547017441, 547121391, 547131348, 547118340, 546330299, 545999260, 546024742, 546070747, 545349159, 544585800, 544665031, 544715271, 544770737, 544429512, 544397621, 544170265, 543976479, 543839073, 543361702, 543357162, 543185310, 542934341, 542315636, 542009697, 541757088, 541580582, 541620483, 541025581, 541027031, 540773468, 540276756, 539617729, 539178047, 539223289, 538633308, 538435555, 538375320, 538089523, 537599602, 537768097, 537734413, 536874809, 536531487, 536135445, 536056213, 535463943, 534951973, 534793396, 534415016, 534215508, 533434410, 533054008, 532747154, 532689438, 532515450, 532073135, 531979485, 531482735, 531192284, 530730324, 530678635, 530277786, 529329109, 529113197, 528855743, 528202057, 527472610, 527622185, 527498932, 527148781, 526712151]
2649.1E26712151n13344j58043o96259m5509l62968o92101m77448k57110K02331l65982
2658.8E23345718n989l83949n47752l31688j82991K36549n73006q93898n70831k7847
2668.4E20064316o3210K19040k61116q25119j53236l15285J09673k91748n04075l74946
2678.1E17604294m51775j52931k62070J46180o29921l46299Q9722k30789l36724o66313
2687.7E14763374J80245k96860n84221n65567j42937L66974m37965k01836l69682k98691
2697.4E12412834k78206l89862k91939j35345L3112n89638k87743m20189j75743j51253
2707E09726028l30619n8403o25878l33023m93049j41030q6937m31976k62871l10364
2716.6E06651878O9237n36766p1945J42212l41377k40479j36909J1367n56144l32985
$$ y = [526712151, 526198807, 526040764, 525344505, 525298996, 524936028, 524243927, 523766479, 523509369, 523711700, 523345718, 523339729, 522955780, 522408028, 522076340, 521893349, 522129898, 521556892, 520662994, 520092163, 520064316, 520001106, 520220146, 519959030, 519133911, 518980675, 518665390, 518775063, 518483315, 517979240, 517604294, 517152519, 516999588, 516737518, 516883698, 516253777, 515907478, 515997200, 515766411, 515429687, 514763374, 514943619, 514646759, 514062538, 513496971, 513354034, 513721008, 513283043, 513081207, 512711525, 512412834, 512134628, 511744766, 511452827, 511317482, 511350594, 510760956, 510473213, 510053024, 509877281, 509726028, 509395409, 509337006, 508711128, 508378105, 507885056, 507744026, 507657089, 507225113, 506962242, 506651878, 506721115, 506184349, 506112404, 506254616, 505913239, 505672760, 505535851, 505547218, 504991074, 504658089]
2726.3E04658089p55425o10542J30653m1961l02773n11436k2698o04820m09546l6545
2735.9E01492996J1902K50588m53034m68140m22172p4501n64804n78766q6823j39122
2745.6D98968124J01738m29878l7689k79617k89002k15454m54025j13373p41081j39160
2755.2D96370583q4992k40555r9411j36947j23062l19481J37176n35202k94113l05443
2764.9D94368553k08435J21269n98220M1465l14560k84614j76468l32375k66342m24576
2774.5D91925697j45797n91011J59111r6741n71556j87721n4703J77040o80695l35006
2784.2D89598618j76163m08898m32090j43051K22282k52533j06010m33007l10707m80652
2793.8D87077789l19900j43585o25267j73493p32193l46718P5493j21536m10843o62918
$$ y = [504658089, 503902664, 503292122, 503422775, 503380814, 503078041, 502566605, 502543907, 501939087, 501529541, 501492996, 501504898, 501755486, 501302452, 500834312, 500412140, 500337639, 499772835, 499194069, 499107246, 498968124, 499069862, 498639984, 498602295, 498322678, 498033676, 497818222, 497364197, 497250824, 496509743, 496370583, 496285591, 496045036, 495945625, 495808678, 495685616, 495366135, 495503311, 494968109, 494673996, 494368553, 494160118, 494281387, 493683167, 493724632, 493410072, 493125458, 492948990, 492616615, 492350273, 491925697, 491779900, 491188889, 491348000, 491251259, 490679703, 490491982, 490437279, 490614319, 489933624, 489598618, 489422455, 489013557, 488581467, 488438416, 488660698, 488408165, 488302155, 487869148, 487558441, 487077789, 486757889, 486614304, 485989037, 485815544, 485083351, 484736633, 484812126, 484690590, 484279747, 483616829]
2803.4D83616829j80168k48795J61896m78745n00488O4202l00713n65834r55582n75790
2813.1D80036812m25873K47612q278p05147q06579p15218J35117k01493J8387j90468
2822.7D77384872m13131l81699o22482l21999q67233j58844O0158j38169m83932p90176
2832.4D73267365r1210n83954p10716j021423n74303Q4686k23274n21202o31599r3232
2842D68901138n94902p37877o67839j88293k65389r43679o21758p56569k41737o93817
2851.7D63189278n83191m34113q96187l36952l00979j32866n87845J89743p8469n84335
2861.3D59444084l46756j314049m66766l20892j49918n88035j045685l90625m20800
2870D54400558O0349o96907q10127p70302m85535k02942n71365k87323p91359l39355
$$ y = [483616829, 483436661, 483187866, 483349762, 482871017, 482370529, 482434731, 482134018, 481568184, 480612602, 480036812, 479610939, 479858551, 479850273, 479145126, 478338547, 477623329, 477758446, 477556953, 477575340, 477384872, 476971741, 476590042, 475967560, 475645561, 474778328, 474619484, 474679642, 474541473, 474057541, 473267365, 473176155, 472592201, 471881485, 470860062, 470285759, 470370445, 470147171, 469625969, 468994370, 468901138, 468306236, 467568359, 466900520, 466712227, 466446838, 465503159, 464881401, 464124832, 463883095, 463189278, 462606087, 462171974, 461275787, 460938835, 460637856, 460504990, 459917145, 460106888, 460028419, 459444084, 459097328, 457783279, 457316513, 456995621, 456845703, 456257668, 455211983, 454821358, 454400558, 454460907, 453764000, 452953873, 452183571, 451698036, 451495094, 450923729, 450636406, 449845047, 449505692]
2879.6D49505692n99518o59142l61519m69284j51100k67944J34430o97403n36690l88565
2889.3D45508957l66592j21270r38148q4419j20697J28479j11084p09877m20533m46281
2898.9D42318535J62506j59798L6431m48571l26995k35672o75049K08778l75481j33934
2908.6D40370750l98178l87230k96440r66339n54275p07207j70136l48892k92015p76901
2918.2D35473137q88710j60904p78923k66152n48820j37100K29378L62701M67300m39376
2927.8D33312531k67296m13475j06163j97106M36287L1052p98493M37775N02701O66084
2937.5D33603897J99242M7378j24931J74637P31277N7373M18091m02336k68898M41399
2947.1D34877129M22210J98136m845P66487K55470J94703j8197O2485r5634o3477P74803
$$ y = [449505692, 448906174, 448247032, 447885513, 447416229, 447265129, 446997185, 447131615, 446434212, 445897522, 445508957, 445142365, 445021095, 444082947, 443998528, 443877831, 444006310, 443895226, 443185349, 442764816, 442318535, 442481041, 442321243, 442357674, 441909103, 441582108, 441346436, 440671387, 440880165, 440504684, 440370750, 439972572, 439585342, 439288902, 438322563, 437768288, 437061081, 436890945, 436542053, 436250038, 435473137, 434584427, 434423523, 433644600, 433378448, 432829628, 432692528, 432921906, 433284607, 433751907, 433312531, 433045235, 432631760, 432525597, 432328491, 432764778, 432795830, 431997337, 432435112, 432937813, 433603897, 433803139, 433850517, 433725586, 433900223, 434631500, 434688873, 435106964, 434704628, 434435730, 434877129, 435299339, 435497475, 435492630, 436259117, 436514587, 436709290, 436691093, 436753578, 436657944, 436594467, 437369270]
2957.7D37369270k0446J99432J42021M72069L13072j58539K72408J16195P55387J70975
2967.4D39631844J80893J14974p2479K26021L18604R73701J10931J59874l1509M27780
2977D42040634Q22754p2708K93312K4681P09038L36037j5641K63443Q8311O52008k04125
2987.6D44937744K0828M36364M21257J90734J11733M15268j14670J05133k36244j6327
2997.3D46271820p3013q3580L06892l67050j37253n0583J00212n6152J67999O6948
3006.9D46146240l09448L42827k49596o95686k15035M26979k36206l20167j77803p48558
3016.6D43963547p1640k09732q4687l43437j88370j50756p01523o2905j81732N8327
3026.2D42027092p13234o79207k36168m07295J55220m44946l82843p22122k18964l4370
$$ y = [437369270, 437348824, 437548256, 437690277, 438162346, 438475418, 438316879, 438589287, 438705482, 439460869, 439631844, 439812737, 439927711, 439855232, 440081253, 440399857, 441373558, 441484489, 441644363, 441612854, 442040634, 442863388, 442790680, 443083992, 443108673, 443817711, 444153748, 444138107, 444401550, 444489861, 445141869, 444937744, 444958572, 445394936, 445816193, 446006927, 446118660, 446533928, 446419258, 446524391, 446288147, 446271820, 446198807, 446115227, 446422119, 446055069, 445917816, 445867233, 445967445, 445911293, 446079292, 446146240, 445836792, 446179619, 445930023, 445234337, 445019302, 445446281, 445210075, 444889908, 444712105, 443963547, 443891907, 443682175, 443597488, 443254051, 443065681, 442914925, 442213402, 442150497, 441968765, 442027092, 441313858, 440634651, 440398483, 439991188, 440146408, 439701462, 439318619, 438596497, 438377533, 438343163]
3035.9D38343163n42679j14098o6757M70505o30188p94449k38037m05960o66581p74688
3045.5D34580231j49842o23626j8883j61018k44751k88811q69293j02463l94325M0855
3055.1D31768074n51186r91745m62570k27775K75535l90281m38729p12356k27814l77350
3064.8D27663803k03247K70500j085357o13480l67127o86k62871l88489j99814p51113
3074.4D24062119j46943n85861j21994r7084l39546l65791n48172k35634q34313J5869
3084.1D20802650k25601l8795q9684q78258n00717j066436k16332k20642j2474j17722
3093.7D17435989n51948L28674k34108j30348m89159n52520m89617n37643m26903n61562
3103.4D13790855K54364j49536n21240q46062j82418K4070n71747j29280l15323k68669
$$ y = [438343163, 437800484, 437686386, 437619629, 438090134, 437459946, 436665497, 436427460, 436021500, 435354919, 434580231, 434430389, 433806763, 433787880, 433626862, 433382111, 433093300, 432224007, 432121544, 431727219, 431768074, 431216888, 430225143, 429762573, 429534798, 429810333, 429420052, 428981323, 428268967, 428041153, 427663803, 427460556, 427731056, 426645699, 426032219, 425665092, 425664406, 425401535, 425013046, 424813232, 424062119, 423915176, 423329315, 423207321, 423110237, 422770691, 422404900, 421856728, 421621094, 420786781, 420802650, 420577049, 420538254, 420448570, 419570312, 419069595, 418003159, 417786827, 417566185, 417553711, 417435989, 416884041, 417212715, 416978607, 416848259, 416359100, 415806580, 415316963, 414779320, 414352417, 413790855, 414045219, 413895683, 413374443, 412528381, 412345963, 412370033, 411798286, 411669006, 411353683, 411085014]
3113D11085014p49054J90735Q2512o17180K28005l32871n41572j021271m11453m43154
3122.6D07469711o31065N9662q7090J56899o25496j97334l71094m59900L5820m77676
3132.3D04872437m92936q40377o8360k69317K73094L57551p85904m27055p92236k40708
3141.9D01586189m28085l34969o48k31438k0675l40157R3956n14908o43272l77770
3151.6C98788223k50015k05955l30048j64719o85653K9335k5330J70212j72501p29027
3161.2C96424522k27966r43489j82266j87836m52690p82738o01005L38363j79252J49955
3170.9C93355598l14559r5330q8196l61290k68173l54347K46887q26416m46014l00331
3180.5C90547829k63253k7771n03273n1765o99043k36664m12789l04756j81617p13768
$$ y = [411085014, 410335960, 410526695, 410609207, 409992027, 410220032, 409887161, 409345589, 408324318, 407912865, 407469711, 406838646, 406898308, 406811218, 406968117, 406342621, 406145287, 405774193, 405314293, 405350113, 404872437, 404379501, 403539124, 403470764, 403201447, 403474541, 403832092, 403046188, 402619133, 401826897, 401586189, 401158104, 400823135, 400822487, 400591049, 400570374, 400230217, 400324173, 399809265, 399165993, 398788223, 398538208, 398332253, 398002205, 397837486, 397151833, 397181168, 397155838, 397326050, 397153549, 396424522, 396196556, 395253067, 395070801, 394882965, 394430275, 393647537, 393046532, 393384895, 393205643, 393355598, 393041039, 392945709, 392857513, 392496223, 392228050, 391873703, 392120590, 391294174, 390848160, 390547829, 390284576, 390256805, 389753532, 389701767, 389002724, 388766060, 388353271, 388048515, 387866898, 387153130]
3190.1C87153130J32789k12364j13525j05896K5711n49469p07016J983q33282l54843
3199.8C84437218J05400R9335m66462l84102m12559m04472N25474k22015o0578n42297
3209.4C82674942m11568j37252n30053R6016m05960K4758m23127k04315J39961m89578
3219.1C80333824l10860p47985n82962p54280K15454K73437m96788l13301o3705O22901
3228.7C78175735m06799l74794j35612m14124p59506o07834j1024n91240J21269l60146
3238.4C74635925l31802J8425j96419O5499k80915J37520o73141j08567k33497o07338
3248C72425690j2513o52465L91426p7935k95028k66342o77987l20167m73862O4507
3257.7C70105324J15089M99726o07377r76944R3956J74866o5269p78542l34396n35317
$$ y = [387153130, 387285919, 387073555, 386960030, 386854134, 386879845, 386330376, 385623360, 385625343, 384792061, 384437218, 384542618, 384641953, 384175491, 383791389, 383378830, 382974358, 383499832, 383277817, 383217239, 382674942, 382263374, 382126122, 381596069, 381692085, 381286125, 381310883, 380887756, 380683441, 380823402, 380333824, 380022964, 379274979, 378692017, 377937737, 378153191, 378426628, 377929840, 377616539, 377552834, 378175735, 377768936, 377394142, 377258530, 376844406, 376084900, 375477066, 375466042, 374874802, 374996071, 374635925, 374304123, 374322548, 374126129, 374191628, 373910713, 374048233, 373375092, 373266525, 373033028, 372425690, 372413177, 371760712, 372152138, 372074203, 371779175, 371512833, 370834846, 370514679, 370040817, 370105324, 370220413, 370720139, 370112762, 369135818, 369229774, 369404640, 369339371, 368560829, 368226433, 367691116]
3267.3C67691116J22605K69584k44064l6240m62799K9946n32379n1232r7885m73404
3276.9C66215248J8730n14183l46794p51076O7788k213n97610j16539l2883L471o23894
3287.5C63320045J0109q7699Q1443j69525r43031j47400k3346L25394k25296m94614
3297.2C61646080n96161j64337n0125o75926M13551o0272n78690n53970k39678j95694
3306.8C58944778j00021Q2436p73201J22375l55758l90435n36880p59049M29039j24855
3316.5C56538429Q6823n15442j94664m1199m22325R4376o49262m2953m80042p40661
3326.1C53633080n12085k60964o0577n63431q8463o28815o3705j38321m73175p3891
3335.8C50769653l40919L509l32679j49308m27055q2893m6235l43894J9645m26903
$$ y = [367691116, 367813721, 368083305, 367839241, 367803001, 367340202, 367370148, 366837769, 366786537, 366688652, 366215248, 366233978, 365719795, 365373001, 364621925, 364689713, 364687500, 364089890, 363973351, 363940468, 363943939, 363320045, 363330154, 363242455, 363323898, 363154373, 362211342, 362063942, 362040596, 362365990, 362140694, 361646080, 361049919, 360885582, 360835457, 360159531, 360573082, 360512810, 359934120, 359380150, 359140472, 358944778, 358844757, 358927193, 358153992, 358276367, 357920609, 357530174, 356993294, 356234245, 356663284, 356538429, 356625252, 356109810, 355915146, 355873947, 355451622, 355545998, 354896736, 354853783, 354373741, 353633080, 353120995, 352860031, 352799454, 352236023, 352147560, 351518745, 351455040, 351316719, 350843544, 350769653, 350428734, 350432243, 350099564, 349950256, 349523201, 349440308, 349394073, 349050179, 349069824, 348642921]
3345.4C48642921k22206q23097l62053k32582m80156j76239m68140J20316r0942Q0757
3355.1C45988579o01807p19452k98958m32090J00288j98898O9504q28705l29933Q811
3364.7C42757339p39631L1547o69593n20935k47345p2785j14059k31514j73340j64795
3374.3C39854889J68190o92597j49917l44658k68364k54211j064606k47154m38652
3383C36562920M4899k30217m14849j40915J39695M32586o30302j57852k54212k63405
3392.7C35088348o01501l61710p0038j039924j55335J68457M80576m77104m83284k24953
3402.3C32323532q83751K28119k32658o2332m80996k3727R9525q68263K15645J78757
3412C30493851K18811r65424o05736Q1444r5482K74506n39093K10724l27835j96305
$$ y = [348642921, 348420715, 347597618, 347235565, 347002983, 346522827, 346346588, 345878448, 345998764, 345907822, 345988579, 345386772, 344667320, 344368362, 343936272, 344036560, 343837662, 343907166, 343078461, 342748528, 342757339, 342017708, 342049255, 341379662, 340858727, 340611382, 340538597, 340424538, 340193024, 340019684, 339854889, 340023079, 339330482, 339180565, 338835907, 338567543, 338313332, 337248726, 337001572, 336562920, 336607819, 336377602, 335962753, 335821838, 335961533, 336394119, 335763817, 335605965, 335351753, 335088348, 334486847, 334125137, 334055099, 333015175, 332859840, 333028297, 333508873, 333031769, 332548485, 332323532, 331439781, 331667900, 331435242, 331372910, 330891914, 330868187, 330967712, 330099449, 330315094, 330493851, 330712662, 329747238, 329141502, 329222946, 329127464, 329401970, 328862877, 329073601, 328745766, 328549461]
3421.6C28549461o4010j78719J1139q35876l68920q79326J06163k2277l68386M9553
3431.2C25998802k09427Q59223k36626J16196M40483k31056n82886l10097K40631m48341
3440.9C25636902L21350q14819k36359L86391J40304J93558k033424J89743O31675
3449.6C24415321J26038R3269l83949K11601n41115K49482M46052L26882k15912l82958
3459.2C24344711K31591k37542l21083r82589M1084M80194M93469j65787p52601K35100
3468.8C23366547n52674l8185M02832M05579j36490l13492K12402n08728p8201M64096
3478.5C23223686J284867j26038l52860J77613p71523Q16040q0185k92663N4207n87120
3488.1C23346024l16697m8446J08986o49605L31688P35397M58870n03883o24771L68919
$$ y = [328549461, 328485451, 328306732, 328317871, 327481995, 327113075, 326233749, 326339912, 326317635, 325949249, 325998802, 325789375, 326648598, 326411972, 326528168, 326968651, 326737595, 326154709, 325844612, 326085243, 325636902, 325958252, 325143433, 324907074, 325293465, 325433769, 325627327, 323593903, 323783646, 324415321, 324541359, 324634628, 324250679, 324462280, 323921165, 324170647, 324616699, 324943581, 324727669, 324344711, 324576302, 324338760, 324017677, 323035088, 323076172, 323556366, 324049835, 323884048, 323131447, 323366547, 322813873, 322775688, 323178520, 323584099, 323447609, 323134117, 323346519, 322837791, 322759590, 323223686, 324508553, 324382515, 324029655, 324207268, 323435745, 324251785, 324171600, 323878937, 323933144, 323346024, 323029327, 322980881, 323089867, 322440262, 322771950, 323507347, 323966217, 323462334, 322837563, 323206482]
3497.8C23206482k06261M63677N11551R80568L6315r21554m21372p71751L99323L24707
3507.4C23601685J005401j81122r94186N48210p1106L02773J43470L86582l2158K44980
3517.1C24954529N09186m62838j75209m09126J171684N69191j612282o67724Q53348
3525.7C24730759P39021m18663O16341l74566r8419J13297l07312K90680m5700J266632
3535.4C26512070k08550j090965O31332N13230m2038N3329P13768j66893M31442l21693
3545C27025032n12428M40826j206894P45354Q28743P62062J48926j998024O30493L80478
3554.7C27244568n0011R70726K59781N53932O50559n31044n5771J471252j96037j18980
3564.3C30198975K641182p07436j876526j179047j623382K533302R60427j50986J047439
$$ y = [323206482, 323000221, 323463898, 323975449, 324956017, 324992332, 324070778, 323649406, 322877655, 323276978, 323601685, 324607086, 324425964, 323431778, 323979988, 323908882, 324211655, 324355125, 324741707, 324709549, 324954529, 325463715, 325000877, 324825668, 324416542, 325588226, 326157417, 324545135, 323877411, 324730759, 325469780, 325051117, 325667458, 325292892, 325194473, 325307770, 325000458, 325291138, 325245438, 326512070, 326303520, 325212555, 325843887, 326357117, 326315079, 326368408, 327082176, 326915283, 327346725, 327025032, 326512604, 326953430, 325746536, 326491890, 327320633, 328082695, 328231621, 326233597, 326864090, 327244568, 327194557, 328165283, 328425064, 328978996, 329629555, 329098511, 329042740, 330513992, 330317955, 330198975, 332840157, 332132721, 330256195, 329077148, 327453766, 329987068, 330947495, 330796509, 331843948]
3573C31843948K53601n3215J39504L40576q15391Q68682R18198o07834P29637N46646
3582.6C34164352l2043j41068L171769Q24585l418618M64821k479667J639709K230186
3591.3C36424026J750756J61323j123733K288246k796555N87273K153702m68865J653099
3600C40629272o09283l98674J69296L39470M69818K462387J852188k623023J918029
3608.7C44209480l195190r62563O392937K42996k886963J982994j233596J294822K788811
3617.4C48633728m42238N06058k814255l31459K169571O99921J595459J224746P13463
3626C51954994R40094N168266p25212j1993637L632737L282585L737487q468k629967
3634.7C53358879P70149J784706J943436q11386K57683R87739J746903N14870r60312
$$ y = [331843948, 332097549, 332044334, 332183838, 332524414, 331709023, 332577705, 333495903, 332888069, 333617706, 334164352, 334132309, 333991241, 337163010, 337987595, 334568977, 335033798, 332554131, 334193840, 336424026, 338174782, 338336105, 337212372, 339500618, 336704063, 337291336, 339445038, 338976173, 340629272, 340019989, 339621315, 339790611, 340130081, 340599899, 343062286, 344914474, 342291451, 344209480, 341014290, 340051727, 346444664, 346687660, 343800697, 345783691, 344550095, 345844917, 348633728, 348191490, 348697548, 345883293, 345551834, 347721405, 348421326, 350016785, 351241531, 351954994, 352895088, 358063354, 357338142, 345344505, 348977242, 352259827, 355997314, 355988846, 353358879, 354129028, 355913734, 357857170, 357045784, 357303467, 358291206, 360038109, 360552979, 359592667]
3643.4C59592667J393966K736969M990464l017121l544922M254570j459541m301376
3651.1C60645676k134590N040550L101082L364944L230095p729683J607552L094253
3658.8C70219879K14806M75845M9896J496926P33413O41022P61833O44646L588257
3667.5C78826523K181167p97615K83928q329162J093177P804680P452469k233581j8864861
3676.2C67416725N731392P143364K667694k226143k84576K342377P24411J481857J64528
3684.9C85161629L3493M154014M912644r523812l894233P792358o347999o81878M395600
3693.5C86001816J70822J524086n84297k96364N66559O56624K578468J766624n347366
3702.2C87036972k850761M415168P72248l48969p8544K335128L830071o840706M546852
$$ y = [359592667, 360986633, 363723602, 368714066, 365696945, 362152023, 366406593, 364947052, 360645676, 358511086, 363551636, 366652718, 370017662, 373247757, 365518074, 367125626, 370219879, 370434685, 370910530, 370960426, 372457352, 373190765, 373831787, 374593620, 375238266, 378826523, 381007690, 380210075, 380494003, 372164841, 373258018, 381062698, 388515167, 386281586, 367416725, 373148117, 380291481, 382959175, 380733032, 380448456, 382790833, 383515244, 384997101, 385161629, 385195122, 389349136, 394261780, 384737968, 380843735, 388636093, 382288094, 381606216, 386001816, 386172638, 387696724, 387112427, 386816063, 387382622, 388039246, 390617714, 392384338, 387036972, 384186211, 388601379, 389373627, 389024658, 388946114, 391281242, 395111313, 388270607, 392817459]
3710.9C92817459L400383j2656250K909393L065453M9438K71569K066269Q67195l603859
3719.6C89187050O92329N562821l734474m456139N165634J433792q60939n094871m41132
3728.3C87454071L728981J995621O092949m130287p174530P762489Q95614r210624
3736C87414284m39568J759300j51901K452316K098427l404693L356552J2434349r850350
3744.7C95668716j7407074R077912M677696O590576n596771q856545J0628968q057251
3752.4C86726227n695496N443154L882522J447144m222069K642593L906594p030373
3760.1C87100296j762428L196296K72675R11903K640915l733597l502960L488732M823341
3768.8C93435173j246300q171730J943321K518578m72641J74904k87514O75583P43103
$$ y = [392817459, 396217842, 383561592, 386470985, 389536438, 389585876, 389857445, 391923714, 392790909, 389187050, 389879379, 395442200, 391707726, 387251587, 392417221, 393851013, 392990074, 387895203, 387454071, 391183052, 393178673, 399271622, 395141335, 387966805, 395729294, 396624908, 387414284, 386974716, 388734016, 388582115, 391034431, 393132858, 389728165, 393084717, 405519066, 395668716, 378261642, 387339554, 392017250, 398607826, 393011055, 384154510, 394783478, 386726227, 381030731, 386473885, 390356407, 391803551, 387581482, 390224075, 394130669, 387100296, 385337868, 388534164, 388806839, 389718742, 392359657, 388626060, 385123100, 388611832, 393435173, 392188873, 384017143, 385960464, 388479042, 388006401, 388181305, 387893791, 388569374, 389312477]
3777.4C89312477J791458j297302o904945K637939K053680R60045K402954l424835
3785.2C87531471j364441R77326R38682J41564q70171J54610o77986Q42857R6893J395913
3794.8C89166718K946701m105187l619842J418380M460793N166015o926002j0118103
3802.5C78389473K771187L362846M525528M304657j0033379l544692M271545J810684
3810.2C85857849Q6975l7765k64817J332970O974182k807350j4256134N353394N849723
3818.9C88089027N281449M86831j5671157L43475L994369J543236L004723O23436m492912
3827.6C83202477o2943Q73985K974167M04205p851486L720780N420837o551857J22452
3836.3C82252617P979164q336678j982345O753273p094956J8807N259361k298088l760376
$$ y = [389312477, 391103935, 389806633, 382901688, 385539627, 387593307, 388553352, 390956306, 387531471, 386167030, 387144356, 388083038, 388224602, 387354431, 387509041, 386831055, 387673912, 387770805, 389166718, 392113419, 388008232, 384388390, 385806770, 390267563, 395433578, 388507576, 378389473, 381160660, 384523506, 389049034, 393353691, 383320312, 379775620, 384047165, 385857849, 385944824, 385907059, 385642242, 386975212, 393949394, 391142044, 376885910, 382239304, 388089027, 393370476, 393857307, 378186150, 378529625, 382523994, 384067230, 387071953, 387695389, 383202477, 383139534, 384013519, 386987686, 387391891, 379540405, 383261185, 388682022, 382130165, 382252617, 390231781, 381895103, 379912758, 386666031, 379571075, 379589882, 384849243, 382551155, 378790779]
3844.9C78790779K108231R38797K28729K820854q78906J546860L297805l721771J172257
3853.6C86303635j6643982L568382Q350792j999016j685219K533417K486305J584282
3861.3C84498596n122490R70307N865707p776451m141197M029197N824776O603775
3869.1C90752220r728165r811592L332367O626015K576141r386177N10025K868157
3876.8C77738991l65296K082215M176025p043381m701347N960197L01590J669999K361221
3885.4C82180214j1704025J354522L825608J112556M334679j081162q631592K200127
3893.2C73590927K657623j570930M92439P69577K720871O74019p808609M712219J160279
3901.8C77398415n139733L108521l793259o14662O49528K33040K156334m72221J27563
$$ y = [378790779, 380899010, 381837807, 382066536, 384887390, 384008484, 385555344, 388853149, 385131378, 386303635, 369659653, 373228035, 381578827, 379579811, 377894592, 380428009, 382914314, 384498596, 379376106, 380346413, 386212120, 378435669, 374294472, 378323669, 384148445, 390752220, 381024055, 371212463, 374544830, 381170845, 383746986, 374360809, 374870834, 377738991, 377373695, 379455910, 383631935, 376588554, 371887207, 377847404, 378148994, 379818993, 382180214, 370476189, 371830711, 375656319, 376768875, 381103554, 380022392, 371390800, 373590927, 376248550, 374677620, 375170059, 375939636, 378660507, 379334526, 371525917, 376238136, 377398415, 372258682, 375367203, 371573944, 370959282, 371608810, 371841850, 373998184, 373525963, 373653526]
3910.5C73653526n75752m63524Tn21469J798516J330299l137169k952309M203339n59349
3920.2C72312584m129982K240944J315422R59549k844734k872353J599846J727447
3927.9C70308723J103058j406059j07613L96576k298164q19817Q90503l53164K45399
3936.6C67959442J425171q50754j165619l61595K023201J175957l666916p26242L02658
3945.2C66115303J193085J308708j456413Q1939n05485j884003J421433R13887j595841
3953.9C65592613J5717J40495n87807n31463l24898M22363O24695l79105j984710L65944
3963.6C63353844O50901l55110M79966j04256K89688o62270o59408J49307m8218K63138
3973.2C63357582m03519o45065o53610K84386J03530j33895J2741k95563N4130p59773
$$ y = [373653526, 373077774, 372614250, 372150726, 371629257, 373427773, 374758072, 371620903, 368668594, 372871933, 372312584, 368182602, 370423546, 371738968, 372698517, 369853783, 366981430, 368581276, 370308723, 371411781, 370005722, 369898109, 370294685, 367996521, 367176704, 368067207, 367714043, 367959442, 369384613, 368533859, 367368240, 367006645, 369029846, 370205803, 366538887, 365812645, 366115303, 367308388, 368617096, 367160683, 367242622, 366737137, 364853134, 366274567, 367188454, 365592613, 365608330, 365748825, 365161018, 364629555, 364304657, 364727020, 365351715, 364972610, 362987900, 363353844, 364004745, 363649635, 364129601, 364025345, 364315033, 363652763, 362993355, 363142662, 363094444, 363357582, 362954063, 362308998, 361655388, 361939774, 362043304, 361909409, 361922150, 361626587, 361680717, 360920944]
3982.8C60920944k74467k15683j81885L79601j98899o5536J42708o5117n80559K00653
3992.5C60061760K87170r0332r82704r57832P70912p7667l9559l73840
4000.2C58597908
$$ y = [360920944, 360646477, 360430794, 360248909, 360628510, 360429611, 360364075, 360506783, 360441666, 359861107, 360061760, 360348930, 360258598, 359275894, 358318062, 359088974, 359011307, 358971748, 358597908]
##END=$$ End of the data block
