##TITLE=$$ Begin of the data block
##JCAMP-DX=5.00 $$ ACD/SpecManager v 10.08
##SPECTROMETER/DATA SYSTEM=Varian
##DATE=19 Mar 2013 10:04:46
##DATA TYPE=INFRARED SPECTRUM
##DATA CLASS=XYDATA
##ORIGIN=
##OWNER=
##NPOINTS=3735
##FIRSTX=399.26403809
##LASTX=4000.35498047
##MAXX=4000.35498047
##MINX=399.26403809
##MAXY=119.62777710
##MINY=34.18613434
##XFACTOR=1.0000000000
##YFACTOR=0.000001000000000
##FIRSTY=68.93222809
##DELTAX=0.96440572
##XUNITS=1/CM
##YUNITS=TRANSMITTANCE
##XYDATA=(X++(Y..Y))
399.3F8932228k4588623M6369576J124481l6370617j7772888l508023K0502793K7473182
$$ 68932228 44343605 90713181 91837662 55467045 37694157 34186134 54688927 82162109
407H2162109r012146j3335651K9884792K9928673k9595039k5365654j859810j8374478
$$ 82162109 73149963 59814312 89699104 119627777 90032738 64667084 62807274 44432796
414.7D4432796l291610J7101928K1720128j4281113k7616257J4454888J347831M549084
$$ 44432796 41141186 58243114 79963242 65682129 38065872 52520760 53868591 58417675
422.4E8417675R55002r490166p402096M723721J4332504o46854j0027081N421177J6886902
$$ 58417675 59372677 49882511 42480415 47204136 61536640 60889786 50862705 56283882 73170784
431.1G3170784R89456p299614l951767m136390K495895p569996j820049P178016j672954
$$ 73170784 74160240 66860626 62908859 58772469 61268364 53698368 51878319 59056335 57383381
439.8E7383381M109447M336502J840516Q44986k477532M92821j162155m69147p146339
$$ 57383381 61492828 65829330 67669846 68514832 66037300 66530121 65367966 64898819 57752480
448.4E7752480m505455R799552Q321663O139382j672531j1423882o939827m819897
$$ 57752480 53247025 63046577 71368240 77507622 75835091 64411209 57471382 52651485
456.2E2651485M461243Q517658l574642L175793l05008j0470356l844544L886090O531284
$$ 52651485 57112728 65630386 62055744 65231537 64926529 54456173 50611629 54497719 61029003
464.8F1029003J2307804P260552j2613655j1172173Q91617p36431p858685o562206
$$ 61029003 73336807 80597359 67983704 56811531 57703148 56966717 49108032 42545826
472.6D2545826J3906242P217244o567391k011425O509037k785160o688492L672806
$$ 42545826 56452068 63669312 57101921 55090496 61599533 58814373 52125881 55798687
480.3E5798687R584393M273536m175491k989082L269775M265816m583649l907249M465889
$$ 55798687 65383080 69656616 65481125 62492043 65761818 70027634 65443985 61536736 66002625
489F6002625j866448m960621K3575N707020N59212n712578K957039N899505J761597
$$ 66002625 64136177 59175556 59199131 64906151 65465363 59752785 62709824 68609329 70370926
497.6G0370926j636696o572823n106891J411167R90334j115963M761879K160610p02294
$$ 70370926 68734230 62161407 57054516 58465683 59456017 58340054 63101933 65262543 64560249
506.3F4560249j812736J070179K339924m121331K435723n94677l354412L678970k417095
$$ 64560249 62747513 63817692 66157616 62036285 64472008 63877331 60522919 64201889 61784794
515F1784794m019550j155125K514500J222492M27711M280140P25937k563553k305439
$$ 61784794 57765244 56610119 59124619 60347111 60774822 65054962 65780899 63217346 60911907
523.7F0911907K67864K314583L065323l701164p032616k148041L27404N085484M073944
$$ 60911907 61179771 63494354 66559677 62858513 55825897 53677856 54005260 59090744 63164688
532.4F3164688J26148r62997l896977J25969q1665j151691L499859L596847L16109
$$ 63164688 63290836 62327839 58430862 58556831 58475166 57323475 60823334 64420181 64736290
541F4736290j01990J91757j749019K4875j595611j394386L428054o6166r18109L570877
$$ 64736290 64634300 64826057 63077038 63101913 61506302 60111916 63539970 63473804 62555695 66126572
550.7F6126572J343399l409584l195507k841538m427341j331158N534801O234223m40037
$$ 66126572 67469971 64060387 60864880 58023342 53596001 52264843 57799644 64033867 63593830
559.4F3593830j417320M54464k502915k932293J911232L813946N45723r85988j977826
$$ 63593830 62176510 62630974 60128059 57195766 59106998 62920944 63466667 62480679 60502853
568F0502853k415512J332592K644310q2126j820473k068222j329132j178986J391270
$$ 60502853 58087341 59419933 62064243 61982117 60161644 58093422 56764290 55585304 56976574
576.7E6976574L773678q24452k974933K07123K39772n19672K935116M381801k174232
$$ 56976574 60750252 59925800 56950867 57157990 57397762 56878090 59813206 64195007 62020775
585.4F2020775k401142K108421O5575j830162j632923K519638L349327j182511l87016
$$ 62020775 59619633 61728054 61793629 59963467 58330544 60850182 64199509 63016998 62629982
594.1F2629982j239029q53447m02721r30352J762013K239464m1069k936413l163895
$$ 62629982 61390953 60537506 60134785 59204433 60966446 63205910 63164841 60228428 57064533
602.8E7064533O7723J629463J982857K379241K92027j759525l18711J653977Q71700
$$ 57064533 57132256 58761719 60744576 63123817 63415844 61656319 61337608 62991585 63863285
611.4F3863285k548855j915630K199287Q40374j434467M10587k48901j228146k60719
$$ 63863285 61314430 59398800 61598087 62438461 61003994 61414581 61165680 59937534 59676815
620.1E9676815J749397K938549j180946j857449L145596L213699k110572m674656p23042
$$ 59676815 61426212 64364761 63183815 61326366 64471962 67685661 65575089 60900433 60177391
628.8F0177391Q84781Q26672K412746J7639K60773J834266J0262k050888j232906J405658
$$ 60177391 61062172 61888844 64301590 64319229 64580002 66414268 66424530 64373642 63140736 64546394
638.4F4546394N97084j036254j478016j644642M6776K071586K272743N8838k344043
$$ 64546394 65143478 64107224 62629208 60984566 61031342 63102928 65375671 65434509 63090466
647.1F3090466j029603K262295J262383k89223L1281p67884r30908j044033n82870
$$ 63090466 62060863 64323158 65585541 65296318 65327599 64559715 63628807 62584774 62001904
655.8F2001904K77420J067417J775924K49344r63775M51767Q10829m54384j86768j617988
$$ 62001904 62279324 63346741 65122665 65372009 64408234 64860001 65670830 65216446 65029678 63411690
665.4F3411690k111893r94335L07480L097042J82255o29509O37169P38010p21600j400161
$$ 63411690 61299797 60305462 60612942 63709984 63892239 63262730 63899899 64637909 63916309 62516148
675.1F2516148P02613K000729P15050l31009p61528p32887N18104O01944p76916J43676
$$ 62516148 63218761 65219490 65934540 65603531 64842003 64109116 64627220 65229164 64452248 64595924
684.7F4595924j63307j159855j67251l43766j80984R26029Q25203L37662N68519o39305
$$ 64595924 64432617 63272762 63105511 62761745 62580761 63506790 64331993 64669655 65238174 64598869
694.4F4598869r02340J223606J131577L91624L4226n08728j795479j915958J050758
$$ 64598869 63696529 64920135 66051712 66443336 66477562 65968834 64173355 62257397 63308155
703.1F3308155L99330r74918N31807p26242k8885J611542k48661j23974J54312n76203
$$ 63308155 63707485 62732567 63264374 62538132 62509247 64120789 63872128 63748154 63902466 63326263
712.7F3326263p36984m97330J196789O59951k62917J093273J057816K30972K43088
$$ 63326263 62589279 62091949 63288738 63948689 63685772 64779045 65836861 66067833 66310921
721.4F6310921o09474j000550K10373q10089l65231J391285Q7433l80226p43805k53849
$$ 66310921 65701447 64700897 64911270 64101181 63735950 65127235 65214668 64834442 64090637 63836788
731F3836788O84139Q30491J501426L35251q98834J3260J204513K55478j19201j53916
$$ 63836788 64520927 65351418 66852844 67188095 66289261 66302521 67507034 67762512 67643311 67489395
740.7F7489395q03825m65599q40851L63556j732o76109O11847j04630k61765L4043
$$ 67489395 66685570 66219971 65379120 65742676 65740944 65064835 65676682 65572052 65310287 65344330
750.3F5344330M96734q48960j370953N27515p7400L9192O49636Q32130k52304j014748
$$ 65344330 65841064 64992104 63621151 64148666 64071266 64110458 64760094 65592224 65339920 64325172
760F4325172J86898R5482J44287q03074j6571J391811j74316j69091m943R7099L21762
$$ 64325172 64512070 64607552 64751839 63948765 63932194 65324005 65149689 64980598 64975655 65072754 65394516
770.6F5394516J43295N23285M73244N73440L96782K39518N49919K02759r05732j556862
$$ 65394516 65537811 66061096 66534340 67107780 67504562 67744080 68293999 68496758 67591026 66034164
780.2F6034164j069931j35780O98723J960495J702637o63445n22278J85776j042465
$$ 66034164 64964233 64828453 65527176 67487671 69190308 68526863 68004585 68190361 67147896
788.9F7147896q86879Q22044K76985p91771J545334J323448q88908q00835n43060N98503
$$ 67147896 66261017 67083061 67360046 66568275 68113609 69437057 68548149 67747314 67204254 67802757
798.5F7802757J491951J097290l64258j146705k55737N50842l47077j565651J35453
$$ 67802757 69294708 70391998 70027740 68881035 68625298 69176140 68829063 67263412 67398865
807.2F7398865L82324L75130K055099L96599j014061q11905K53708J165672k63717
$$ 67398865 67781189 68156319 70211418 70608017 69593956 68782051 69035759 70201431 69937714
815.9F9937714p59415m85924N02548J625641O59416l10920J81679Q11203q7105p88178
$$ 69937714 69178299 68692375 69194923 70820564 71479980 71169060 71350739 72161942 72074837 71286659
825.5G1286659m24591p57896m86672k90260o90453J88858L67653m45434R15001J976104
$$ 71286659 70862068 70104172 69617500 69327240 68636787 68825645 69193298 68747864 69662865 71638969
835.2G1638969L01468j011192j606018j510155q56262k99271L19641L47710J136086
$$ 71638969 71940437 70929245 69323227 67813072 66956810 66657539 66977180 67324890 68460976
843.9F8460976L75755o30531L89701m92813o92161M86244R27689K90123n59891k03240
$$ 68460976 68836731 68206200 68595901 68103088 67410927 67897171 68824860 69114983 68555092 68351852
853.5F8351852n18623r5543L48755K34993P03346k60490o97106M88778L95713n85243
$$ 68351852 67833229 67737686 68086441 68321434 69024780 68764290 68067184 68555962 68951675 68366432
863.1F8366432J37474N16823N42511K00897p69714J48277K58599O11167K97844o71569
$$ 68366432 68503906 69020729 69563240 69764137 68994423 69142700 69401299 70012466 70310310 69638741
872.8F9638741Q40591O49338R895m7798Q0971m72527j840774k63855Q18580J50414
$$ 69638741 70479332 71128670 71138565 71090767 71171738 70699211 68858437 68594582 69413162 69563576
882.4F9563576L86024R50653P65847l69004j584739j233406m2275l73444l8459L98323
$$ 69563576 69949600 70900253 71666100 71297096 69712357 68478951 68436676 68063232 68024773 68423096
892.1F8423096N24322P58225l80608o43318n02884j06041K7977J66657M85275j036789
$$ 68423096 68947418 69705643 69325035 68681717 68178833 68072792 68100769 68267426 68752701 67715912
901.7F7715912o19316K88391n73090K388K96654m30794k57225M47945M26773o03149
$$ 67715912 67096596 67384987 66811897 66814285 67110939 66680145 66422920 66870865 67297638 66694489
911.4F6694489p04484M17977K39212o74782p07878l80775m95026k78267O22314N53627
$$ 66694489 65990005 66407982 66647194 65972412 65264534 64883759 64388733 64110466 64732780 65286407
921F5286407L21312o1302K4056N43434l79624p83050r45549k25937P84889J16402P034
$$ 65286407 65607719 65546417 65570473 66113907 65734283 64951233 64005684 63779747 64564636 64681038 64688072
931.6F4688072P59522J064804n55802j117759m7242k01652J96121L98911L83163P46422
$$ 64688072 65447594 66512398 65956596 64838837 64791595 64589943 64786064 65184975 65568138 66314560
941.3F6314560J82075q35647o00990N20416L45955M06181Q10020K8924n70405l08280
$$ 66314560 66496635 65660988 65059998 65580414 65926369 66332550 67142570 67171494 66601089 66292809
950.9F6292809l71529p60422l58192j98807k46323j23161j12381N8464R4086k31941
$$ 66292809 65921280 65160858 64802666 64603859 64357536 64234375 64121994 64180458 64274544 64042603
960.6F4042603p21920l01289m54933j198590k94879L70059l31455n93048N1254Q0731
$$ 64042603 63320683 63019394 62564461 61365871 61070992 61441051 61109596 60516548 60567802 60648533
970.2F0648533k59659p351k11017o66100j68789K15721q57818p85393N28950N2009
$$ 60648533 60388874 60381523 60170506 59504406 59335617 59551338 58693520 57908127 58437077 58489086
979.8E8489086p87815m30225j45230n07526j29944O38863J17878o83361l69656M08871
$$ 58489086 57701271 57271046 57125816 56618290 56488346 57127209 57245087 56561726 56192070 56600941
989.5E6600941l10280n39887O36143j46915p86133k19631K37732Q32233O1306l90270
$$ 56600941 56290661 55750774 56386917 56240002 55453869 55234238 55471970 56304203 56365509 55975239
999.1E5975239k00585j47884P50675M67091l6034j89121q08655o83842m35691J95022
$$ 55975239 55774654 55626770 56377445 56844536 56808502 56619381 55810726 55126884 54691193 54886215
1008.8E4886215P1438j68545P02866L99517J78783j25755q93780l27198K43561j94172
$$ 54886215 54957653 54789108 55491974 55891491 56070274 55944519 55050739 54723541 54967102 54772930
1018.4E4772930j96094N61245j52371k82665J103325M78691m27204j34468O0241K40502
$$ 54772930 54576836 55138081 54985710 54703045 55806370 56285061 55857857 55723389 55783630 56024132
1028.1E6024132j22784r10721o17401l6243N6289O00048L60520l32775j42514N01824
$$ 56024132 55901348 54990627 54373226 54336983 54393272 54993320 55353840 55021065 54878551 55380375
1037.7E5380375P04292j80088l77731n2708m5296N26173L45570n35610n6748N74143
$$ 55380375 56084667 55904579 55526848 55474140 55428844 55955017 56300587 55764977 55708229 56282372
1047.4E6282372l07911k53903J234074J094795l3363k84180o10950l04463j11919k37965
$$ 56282372 55974461 55720558 56954632 58049427 58016064 57731884 57120934 56816471 56704552 56466587
1057E6466587P51720K71851j68236L70797L17714L69751n02678j89220Q28380P71199
$$ 56466587 57218307 57490158 57321922 57692719 58010433 58380184 57877506 57688286 58516666 59287865
1066.6E9287865q580q44120L37124J53733r06105j65959J7887J56887O6117k82658
$$ 59287865 59279285 58435165 58772289 58926022 58019917 57853958 57871845 58028732 58094849 57812191
1076.3E7812191k03362o74350n56919J95434j2069l31246k79083J59580O75560M54216
$$ 57812191 57608829 56934479 56377560 56572994 56560925 56229679 55950596 56110176 56785736 57239952
1085.9E7239952R19861Q38280N5679j34956p76883q63338l22529P95380L54629q19881
$$ 57239952 58159813 58998093 59053772 58918816 58141933 57278595 56956066 57751446 58106075 57286194
1095.6E7286194N21984Q89656n5515l07728L16162M50428m86580j5129k6997l38081
$$ 57286194 57808178 58697834 58642319 58334591 58650753 59101181 58614601 58599472 58572475 58234394
1105.2E8234394K56172k03899P0782R82772N02922m43035n39035J94171J98018k14238
$$ 58234394 58490566 58286667 58357449 59340221 59843143 59400108 58861073 59055244 59253262 59039024
1114.9E9039024L12348N51128k02854m60026J50707K12895O8863L5065l82214K54112
$$ 59039024 59351372 59902500 59699646 59239620 59390327 59603222 59672085 59707150 59324936 59579048
1124.5E9579048O15322K67670P58488q0719r94152n1991N07870j11099p08367j12308
$$ 59579048 60194370 60462040 61220528 61139809 60145657 60093666 60601536 60490437 59782070 59669762
1134.1E9669762M12933j38149k3533K86205N3906j43814o58959k36137K18952l54698
$$ 59669762 60082695 59944546 59921013 60207218 60261124 60117310 59458351 59222214 59441166 59086468
1143.8E9086468o9294p843m20426j80240L26912L95355m15943k29309M57882k76642
$$ 59086468 59017174 59009331 58588905 58408665 58735577 59130932 58714989 58485680 58943562 58666920
1153.4E8666920p80781j03420J96418k14538m2244J05499j48483K33127N85946L63258
$$ 58666920 57886139 57782719 57979137 57764599 57722355 57827854 57679371 57912498 58498444 58861702
1163.1E8861702J1837j16776J07956K45907j91238l91289J10184M71046L29903J56521
$$ 58861702 58873539 58756763 58864719 59110626 58919388 58528099 58638283 59109329 59439232 59595753
1172.7E9595753L18573M94808O79768O24118J06407n1094q2367m73224j43208M54678
$$ 59595753 59914326 60409134 61088902 61713020 61819427 61768333 61685966 61212742 61069534 61524212
1182.4F1524212J80633N31125P61776J45408K16240L57651J9554l92780J41712K83443
$$ 61524212 61704845 62235970 62997746 63143154 63359394 63717045 63736599 63343819 63485531 63768974
1192F3768974m17587J3721K82918M3331J99028L51894Q8104J34796K07871m14681j77444
$$ 63768974 63351387 63365108 63648026 63691357 63890385 64242279 64330383 64465179 64673050 64258369 64080925
1202.6F4080925J74133J60271M24072J24901n35255n59918K5883J02856M3018L28865
$$ 64080925 64255058 64415329 64839401 64964302 64429047 63869129 63895012 63997868 64040886 64369751
1212.3F4369751P41661M55223l73596l5721J01807l04634n6458j51237k67357N64232
$$ 64369751 65111412 65566635 65193039 65157318 65259125 64954491 64898033 64746796 64479439 65043671
1221.9F5043671N06393k46910K38274M22592K43652n2536n96290l05993J6320m1550
$$ 65043671 65550064 65303154 65541428 65964020 66207672 66155136 65558846 65252853 65269173 65227623
1231.5F5227623l41553l15483O7436K79313M11781J75468j95274l46489j08147K55776
$$ 65227623 64886070 64570587 64638023 64917336 65329117 65504585 65309311 64962822 64854675 65110451
1241.2F5110451N11062J18920l20946k95311l89435J65436K00089m9233J23047J37489
$$ 65110451 65621513 65740433 65419487 65124176 64734741 64900177 65100266 65051033 65174080 65311569
1250.8F5311569N52796J73294j47003J35154K2850k67166l89953o3981L4340J50498
$$ 65311569 65864365 66037659 65890656 66025810 66048660 65781494 65391541 65327560 65361900 65512398
1260.5F5512398J71455J90483K16873J4260Q2687P7599M25445K13234k43187l79135
$$ 65512398 65683853 65874336 66091209 66105469 66188156 66265755 66691200 66904434 66661247 66282112
1270.1F6282112n72189O4522K38960P1258J85593L61008L78196j64611r049J62850
$$ 66282112 65709923 65774445 66013405 66084663 66270256 66631264 67009460 66844849 66835800 66998650
1279.8F6998650k13364l39974j99806j45309j69190J64399K79037J26312j29692n5938
$$ 66998650 66785286 66445312 66245506 66100197 65931007 66095406 66374443 66500755 66371063 66315125
1289.4F6315125R0644k69737j53847O7131J38756K3216k88208j90788k11319N0865
$$ 66315125 66405769 66136032 65982185 66049316 66188072 66211288 65923080 65732292 65520973 65571838
1299F5571838L93189J74873j7784R4986K67418j49971m90173k56363n8594J17569P2510
$$ 65571838 65965027 66139900 66122116 66217102 66484520 66334549 65844376 65588013 65529419 65646988 65719498
1309.7F5719498J44394K34481q7928l4874N10597M53812l02506o24290n17441l08930
$$ 65719498 65863892 66098373 66010445 65975571 66486168 66939980 66637474 66013184 65495743 65186813
1319.3F5186813J6518k04361k34039n2750R3994L65219K48474K92756K42073k56661
$$ 65186813 65203331 64998970 64764931 64712181 64806175 65171394 65419868 65712624 65954697 65698036
1328.9F5698036n71312l98109J26709l6286m81117l12401k04937l8398K43869K74941
$$ 65698036 65126724 64728615 64855324 64819038 64337921 64025520 63820583 63782185 64026054 64300995
1338.6F4300995J38809q1451j74706K739K30881p0297k83532j08108j04786L002J15914
$$ 64300995 64439804 64358353 64183647 64186386 64417267 64346970 64063438 63955330 63850544 63853546 63969460
1349.2F3969460J47026J15814K37808L69507M8729k39105l95493m43073j33900J13594
$$ 63969460 64116486 64232300 64470108 64839615 64888344 64649239 64253746 63810673 63676773 63790367
1358.8F3790367j61178m72085l5934K31907M62757N00656l5286k38762o6475j86287
$$ 63790367 63629189 63157104 63121170 63353077 63815834 64316490 64281204 64042442 63975967 63789680
1368.5F3789680l54522o4347J47881P6321j0071l06564J38507N92690J42624j10947
$$ 63789680 63435158 63370811 63518692 63595013 63584942 63278378 63416885 64009575 64152199 64041252
1378.1F4041252J42212J97319k11952j73267j90964m40411j3843Q1981P2674L71857
$$ 64041252 64183464 64380783 64168831 63995564 63804600 63364189 63350346 63432327 63505001 63876858
1387.8F3876858J92554M37035K67723j99295m6768K7855k09328k76352k44988J5774
$$ 63876858 64069412 64506447 64774170 64574875 64528107 64555962 64346634 64070282 63825294 63841068
1397.4F3841068L10864j70639q9993K67689J27418J54427K29530n9265m37599k47314
$$ 63841068 64151932 63981293 63891300 64158989 64286407 64440834 64670364 64611099 64173500 63926186
1407.1F3926186j96541l49846j83235L06690L52413j37150k26928O9042K19917J55495
$$ 63926186 63729645 63379799 63196564 63503254 63855667 63718517 63491589 63560631 63780548 63936043
1416.7F3936043j06163l00156k51102n4062j08658O1756M8779k652K95456L03120L02708
$$ 63936043 63829880 63529724 63278622 63224560 63115902 63177658 63226437 63223785 63519241 63822361 64125069
1427.3F4125069J12137j56487k90417q220J71375J18046j45420m20983k6611M58671
$$ 64125069 64237206 64080719 63790302 63782082 63953457 64071503 63926083 63505100 63478489 63937160
1437F3937160p2971J54511L09356K73011Q3908K29339j60438m95995Q9554k63268n23696
$$ 63937160 63864189 64018700 64328056 64601067 64684975 64914314 64753876 64257881 64347435 64084167 63560471
1447.6F3560471m2481J31924N12577M58465p6767l74496j01135K31224l66131r69315
$$ 63560471 63517990 63649914 64162491 64620956 64544189 64169693 64068558 64299782 63933651 62964336
1457.2F2964336O69911J68804k22878R3144K8198K19860L06973j54938Q5732M92904
$$ 62964336 63634247 63803051 63580173 63673317 63701515 63921375 64228348 64073410 64159142 64652046
1466.8F4652046N16297r2385l14705J77513K12723l56430K51991M70116L5919K89582
$$ 64652046 65168343 65075958 64761253 64938766 65151489 64795059 65047050 65517166 65553085 65842667
1476.5F5842667M15748J86630J91147L73787L02834n5496K32116L3081p9475N3001
$$ 65842667 66258415 66445045 66636192 67009979 67312813 67257317 67489433 67522514 67443039 67496040
1486.1F7496040l57322o9428K65579N29801O00410K56363K77268K04940J02570k92625
$$ 67496040 67138718 67069290 67334869 67864670 68465080 68721443 68998711 69203651 69306221 69013596
1495.8F9013596n62478L38830L09410J09504L75840K81547o5712J45073M91829P70271
$$ 69013596 68451118 68789948 69099358 69208862 69584702 69866249 69800537 69945610 70437439 71207710
1505.4G1207710q90945r58534Q84590j59767m05602K49046M46450L2730K33703J4710
$$ 71207710 70316765 69358231 70242821 70083054 69677452 69926498 70372948 70405678 70639381 70654091
1515.1G0654091r7931L71971J19484M62601N0644j082688M5601Q47893L39233o9694
$$ 70654091 70556160 70928131 71047615 71510216 71560860 70478172 70523773 71371666 71710899 71641205
1524.7G1641205k06383J85165K46239N5603K16805Q0841l2662N29000j42540p79740
$$ 71641205 71434822 71619987 71866226 71921829 72138634 72219475 72186813 72715813 72573273 71793533
1534.3G1793533L68515o424j27372k2782j382980q65700J795731M00367L85956Q63190
$$ 71793533 72162048 72155624 72028252 72005470 70622490 69756790 71552521 71952888 72338844 73202034
1544G3202034q4824p02827k029q439Q4504J57928J10825K53975J41593k61467q35327
$$ 73202034 73117210 72414383 72412354 72403915 72488419 72646347 72757172 73011147 73152740 72891273 72055946
1554.6G2055946M05167P33879R6375j486741k232353J552925J551697K88262j71227
$$ 72055946 72461113 73194992 73291367 71804626 69572273 71125198 72676895 72965157 72793930
1563.3G2793930k11815k89902L62145P57698L31680k09907p38388N9135L61481m9637
$$ 72793930 72582115 72292213 72654358 73412056 73743736 73533829 72795441 72854576 73216057 73166420
1572.9G3166420j56441J55319K457p56813J75774N12336L98064k6886k82631r0355
$$ 73166420 73009979 73165298 73167755 72410942 72586716 73099052 73497116 73470230 73187599 73097244
1582.6G3097244n3184j87241k53898j38932J34468k4261j72089k9968J31584Q9737
$$ 73097244 73044060 72856819 72602921 72463989 72598457 72574196 72402107 72372139 72503723 72593460
1592.2G2593460j58585j8074K65259j39251l97179j12274j99417k16744k41463l16215
$$ 72593460 72434875 72416801 72682060 72542809 72145630 72033356 71833939 71617195 71375732 71059517
1601.9G1059517L9062L1464j78390j68030j46767k68959n1910l2280l25211j97868
$$ 71059517 71098579 71130043 70951653 70783623 70636856 70367897 70315987 70283707 69958496 69760628
1611.5F9760628j85372k0980j74241k53822q9546l83141N1697J15799P217k75497j43753
$$ 69760628 69575256 69554276 69380035 69126213 69036667 68653526 68705223 68821022 68828239 68552742 68408989
1622.1F8408989k20863o68557j41075j66092o1042j75011M6043j1635j44012j1749
$$ 68408989 68188126 67519569 67378494 67212402 67151360 66976349 67022392 67010757 66866745 66854996
1631.7F6854996j21132J35528J99387j004196j92070J33140l77754P9697J91780j53763
$$ 66854996 66733864 66869392 67068779 66064583 65872513 66005653 65627899 65707596 65899376 65745613
1641.4F5745613K09755J09505J50215L33389j26976p30408j82724N97687P7645J28341
$$ 65745613 65955368 66064873 66215088 66548477 66421501 65691093 65508369 66106056 66183701 66312042
1651F6312042P7469l45459m39110k96981Q87901M62768J55678J84174m4075m4640K87598
$$ 66312042 66389511 66044052 65604942 65307961 66195862 66658630 66814308 66998482 66954407 66909767 67197365
1661.6F7197365J01013n94658J34338J79863K92016N08720K45018n2887j95854P4821
$$ 67197365 67298378 66703720 66838058 67017921 67309937 67818657 68063675 68010788 67814934 67889755
1671.3F7889755L86734L83110L3417l86391j36512M22027M06288L4851J50002M5235
$$ 67889755 68276489 68659599 68693016 68306625 68170113 68592140 68998428 69033279 69183281 69228516
1680.9F9228516N79055J165345m13475j239563Q28872M55292J14265k26730K26601
$$ 69228516 69807571 70972916 70559441 69319878 70148750 70604042 70718307 70491577 70718178
1689.6G0718178J79436J49993R6642K82310L79998k8343K59704J65955K15454O55670
$$ 70718178 70897614 71047607 71144249 71426559 71806557 71778214 72037918 72203873 72419327 73074997
1699.3G3074997J54434j081947L67935O5742J36368L51326p3929q7822M63372N53764
$$ 73074997 73229431 72147484 72515419 72581161 72717529 73068855 72994926 72907104 73370476 73924240
1708.9G3924240k3140n0636K86362j16593o9450o0127L8917j4900n83344J90064O59706
$$ 73924240 73901100 73850464 74136826 74020233 73950783 73890656 73929573 73914673 73331329 73521393 74181099
1719.5G4181099M04694K04345L85918J23970k23549J83823q8509k14752j06102J26282
$$ 74181099 74585793 74790138 75176056 75300026 75076477 75260300 75171791 74957039 74850937 74977219
1729.1G4977219K61879K19291N71854N13657l12935j084259N21759L70872j32416J47591
$$ 74977219 75239098 75458389 76030243 76543900 76230965 75146706 75668465 76039337 75906921 76054512
1738.8G6054512k304m40697K1736L03765J66877P2640L55278K08816J74424j89797
$$ 76054512 76052208 75611511 75633247 75937012 76103889 76176529 76531807 76740623 76915047 76725250
1748.4G6725250P6859L46809o48987m27360L41987M17283O3835r7741M4892J13930
$$ 76725250 76802109 77148918 76499931 76072571 76414558 76831841 76895676 76797935 76842827 76956757
1758.1G6956757J44836P6141J68618j83892j26709J91780R9076j13350j5434L92791
$$ 76956757 77101593 77177734 77346352 77162460 77035751 77227531 77326607 77213257 77197823 77590614
1767.7G7590614k00378q8280K22778O6262j55548l60665M21250J81129j90498O9679
$$ 77590614 77390236 77301956 77524734 77590996 77435448 77074783 77496033 77677162 77486664 77556343
1777.4G7556343L4348J5396k08336j40473K93473M66903K64328q2885k13639j93275
$$ 77556343 77590691 77606087 77397751 77257278 77550751 78017654 78281982 78199097 77985458 77792183
1787G7792183P1228J89224R651l02047k54418k27813J44248N28862K23702o638K73011
$$ 77792183 77863411 78052635 78062286 77760239 77505821 77278008 77422256 77951118 78174820 78168182 78441193
1797.6G8441193K77107l60474k30781M18869k68769m15283K1622J98555J56853k2942
$$ 78441193 78718300 78357826 78127045 78545914 78277145 77861862 77883484 78082039 78238892 78215950
1807.3G8215950J23680J41968n0301j23375K30400Q9875j58043q4313r3544M6990O317
$$ 78215950 78339630 78481598 78431297 78307922 78538322 78628197 78470154 78385841 78292297 78339287 78345604
1817.9G8345604J31958N4283n4855J99745M3922K32804K47955m64325j47385J17737
$$ 78345604 78477562 78531845 78476990 78676735 78720657 78953461 79201416 78737091 78589706 78707443
1827.5G8707443p1480k90168l71048J01036K73117J01158r865K46163L84300n8182
$$ 78707443 78635963 78345795 77974747 78075783 78348900 78450058 78440193 78686356 79070656 79012474
1837.2G9012474j52130K72575r0606l54897l21846j86310Q362j25961K23236K55470
$$ 79012474 78860344 79132919 79042313 78687416 78365570 78179260 78187622 78061661 78284897 78540367
1846.8G8540367K30431p675q1376K70394M776l08174j94535M4320j9227j37619K66579
$$ 78540367 78770798 78763123 78681747 78952141 78956917 78648743 78454208 78498528 78479301 78341682 78608261
1857.4G8608261J61476j2527J82510K3102O103j8264j13228q8265j50985j95420k37548
$$ 78608261 78769737 78757210 78939720 78962822 78968925 78950661 78837433 78749168 78598183 78402763 78165215
1868G8165215R315J25435J02157M13277J60347m4876k2812j58981l1J0483J6976j27289
$$ 78165215 78174530 78299965 78402122 78815399 78975746 78930870 78908058 78749077 78749046 78759529 78776505 78649216
1879.6G8649216j81275K0409p1182l1639m2656K16339L23265q820l7964j49376r4902
$$ 78649216 78467941 78488350 78417168 78385529 78342873 78559212 78882477 78873657 78835693 78686317 78591415
1890.2G8591415N5252j0170q5594j13014m0916K0363J63375J15914J31393J07216k3460
$$ 78591415 78646667 78636497 78550903 78437889 78396973 78417336 78580711 78696625 78828018 78935234 78911774
1900.8G8911774j4992j44028p1335j34903k36282k9709J26839K61978J18202j14433
$$ 78911774 78896782 78752754 78681419 78546516 78310234 78280525 78407364 78669342 78787544 78673111
1910.4G8673111p6126O3759J6723n3230M1733P5630M395l27355k29606O1691J02302
$$ 78673111 78596985 78660744 78677467 78624237 78665970 78741600 78745995 78418640 78189034 78250725 78353027
1921.1G8353027K15821J56517j808j0437q7952n7625p927j88774r8465J62262M1840
$$ 78353027 78568848 78725365 78723557 78713120 78625168 78567543 78559616 78370842 78272377 78434639 78476479
1931.7G8476479j16867j07270J93192L59825l1365k49359p8582R6756J17225j6472
$$ 78476479 78359612 78252342 78445534 78805359 78773994 78524635 78446053 78542809 78660034 78643562
1941.3G8643562l12019k17369K19948O210j07307J53007L3470l3684R0149q0551j22993
$$ 78643562 78331543 78114174 78334122 78340332 78233025 78386032 78419502 78385818 78475967 78395416 78272423
1951.9G8272423J33110M5624j94184j38321k0866K10075L49411R8023n1438K0897k7290
$$ 78272423 78405533 78451157 78256973 78118652 78097786 78307861 78657272 78755295 78703857 78724754 78697464
1962.5G8697464j59500j56235j30417n630K12219L6591j07438j03317q39K26395P1312
$$ 78697464 78537964 78381729 78251312 78245682 78457901 78494492 78387054 78283737 78282898 78509293 78580605
1973.1G8580605j07552m730Q7562j22108k34459R7404J66787L9680k47780m01512Q766
$$ 78580605 78473053 78468323 78555885 78433777 78199318 78296722 78463509 78503189 78255409 77853897 77862663
1983.7G7862663J51085M2748J11663K52938J87843n1636r7274j13625j53770r5917
$$ 77862663 78013748 78056496 78168159 78421097 78608940 78557304 78460030 78346405 78192635 78096718
1993.4G8096718N2864K792p7347K2545r3940q461K00561L8353m6326R2438m7836k84325
$$ 78096718 78149582 78152374 78075027 78097572 78003632 77995171 78195732 78234085 78187759 78280197 78232361 77948036
2005G7948036n6976K2995r3811L1303n5977n9158J58150J23192M9064o6787k31324
$$ 77948036 77891060 77914055 77820244 77851547 77795570 77736412 77894562 78017754 78066818 78000031 77768707
2015.6G7768707j65870j40793r9770J08048k5475k03216J27609K13211j04736n097
$$ 77768707 77602837 77462044 77362274 77470322 77444847 77241631 77369240 77582451 77477715 77472618
2025.2G7472618J47812K2774q6289j81663q4770k8992j22551q3702P93N3253n5000
$$ 77472618 77620430 77643204 77556915 77375252 77290482 77261490 77138939 77055237 77056030 77109283 77054283
2035.8G7054283n0506J46812Q6403j1185o1745q3030N9730k7046j91658p9498M1771
$$ 77054283 77003777 77150589 77236992 77225807 77164062 77081032 77140762 77113716 76922058 76842560 76884331
2046.4G6884331j1002K3880J18248q3015j45623K6719J06903N2681j35926j18400j87660
$$ 76884331 76873329 76897209 77015457 76932442 76786819 76813538 76920441 76973122 76837196 76718796 76531136
2057G6531136j74332P5188J13906J86463O0547L1791J50315J1863q6998p0022Q3382
$$ 76531136 76356804 76431992 76545898 76732361 76792908 76824699 76975014 76986877 76899879 76829857 76913239
2067.6G6913239j8372j8074p1457l67447m608J60515P3562J02524n7808Q9546J45875
$$ 76913239 76894867 76876793 76805336 76437889 76433281 76593796 76667358 76769882 76712074 76801620 76947495
2078.2G6947495j00152j68960j09894j24237J3260Q9165o2401l098Q1658J66191J15867
$$ 76947495 76847343 76678383 76568489 76444252 76457512 76546677 76484276 76481178 76562836 76729027 76844894
2088.9G6844894j75438k10830O2393J28609J8287J54900j7593l11211k75116k9099
$$ 76844894 76669456 76458626 76521019 76649628 76667915 76822815 76805222 76494011 76218895 76189796
2098.5G6189796L31147P1846r8473K85721K29057j62124k59545m1069K968j34010j44661
$$ 76189796 76520943 76592789 76494316 76780037 77009094 76846970 76587425 76546356 76549324 76415314 76270653
2109.1G6270653J1986K6100m6936N4863J9256J09207J27282k5620L3012j11198k34894
$$ 76270653 76282639 76308739 76261803 76316666 76335922 76445129 76572411 76546791 76579803 76468605 76233711
2119.7G6233711j56753J15669K83989p3120q6617J73104Q7890J2734j8303j67565k41279
$$ 76233711 76076958 76192627 76476616 76403496 76316879 76489983 76577873 76590607 76572304 76404739 76163460
2130.3G6163460M7729J60477j58218j36849l7331l5583K07603K97783J66199j33644
$$ 76163460 76211189 76371666 76213448 76076599 76039268 76003685 76211288 76509071 76675270 76541626
2140G6541626k55600K083O4781k0447j17363j90864n1613J3901j0209N5634R6024R9281
$$ 76541626 76286026 76288109 76352890 76332443 76215080 76024216 75972603 75986504 75976295 76031929 76127953 76227234
2151.5G6227234M6516O821N6923M2625o9687j60049n7037k3682l8704J03684j07178
$$ 76227234 76273750 76280571 76337494 76380119 76310432 76150383 76093346 76069664 76030960 76134644 76027466
2162.1G6027466j38260J69296J03058j2100M2175K41509J34452j91040p5348j7509
$$ 76027466 75889206 76058502 76161560 76149460 76191635 76433144 76567596 76376556 76301208 76283699
2171.8G6283699j67259k4513K34550R6153M311J34491O0715o3652k19300J0185J31058
$$ 76283699 76116440 76091927 76326477 76422630 76426941 76561432 76622147 76558495 76339195 76349380 76480438
2182.4G6480438k03110L045J51420N547J36581J76430O3248n8258j4962R6466k4223
$$ 76480438 76277328 76280373 76431793 76437340 76573921 76750351 76813599 76755341 76740379 76836845 76812622
2193G6812622q4968p401R186j4374j70372k17056L3943K47307K65396J46126P713M35
$$ 76812622 76727654 76720253 76729439 76715065 76544693 76327637 76361580 76608887 76874283 77020409 77028122 77028557
2204.6G7028557J3557j41853j26518O6040J39183J35925q6746j73996l3188K0477J55876
$$ 77028557 77042114 76900261 76773743 76839783 76978966 77114891 77028145 76854149 76820961 76841438 76997314
2215.2G6997314K90719Q9904k05414o2637J656k6978J9867j63315l5537J25274Q0666
$$ 76997314 77288033 77377937 77172523 77109886 77111542 77084564 77104431 76941116 76905579 77030853 77111519
2225.8G7111519J793k0729J03958J17142J17858j47941j44287J25931o6071r4032N6579
$$ 77111519 77113312 77092583 77196541 77313683 77431541 77283600 77139313 77265244 77199173 77105141 77161720
2236.4G7161720M7921n0850M6226R6306l82M4053r1645l021j8776k57194l2998J83732
$$ 77161720 77209641 77158791 77205017 77301323 77300941 77344994 77253349 77250328 77231552 76974358 76941360 77125092
2248G7125092J24145o2385k2584O4011r186O0051O9580n2993m2061M6936j65222j70800
$$ 77125092 77249237 77186852 77164268 77228279 77219093 77279144 77348724 77295731 77253670 77300606 77135384 76964584
2259.5G6964584R5383M7432R3544J27678k1919k098L6216o9015P8705K01553j14807
$$ 76964584 77059967 77107399 77200943 77328621 77306702 77304604 77340820 77271805 77350510 77552063 77437256
2270.2G7437256p7339R2758m723j2481r3804k9533O6025k8061R2857K37938N3665j27624
$$ 77437256 77359917 77452675 77447952 77435471 77341667 77312134 77378159 77350098 77442955 77680893 77734558 77606934
2281.7G7606934n6511j17203j81900R6931J11878j01631l4455P6424R2094R9388L7056
$$ 77606934 77550423 77433220 77251320 77348251 77460129 77358498 77324043 77400467 77492561 77591949 77629005
2292.3G7629005j80709k1698J82861j28479n3986m1252k17842o3812M5669K12250M7775
$$ 77629005 77448296 77426598 77609459 77480980 77426994 77385742 77167900 77104088 77149757 77362007 77409782
2302.9G7409782j46484Q0895K85583J66992j90140l46466l59420Q5525K23618j21804
$$ 77409782 77263298 77344193 77629776 77796768 77606628 77260162 76900742 76986267 77209885 77088081
2312.6G7088081k2339J27556L12348J87828o7833k88620l53722J1345o4377o3247M3472
$$ 77088081 77065742 77193298 77505646 77693474 77625641 77337021 76983299 76994644 76930267 76867020 76910492
2323.2G6910492L70361K21787n85579l75794K2797L17825M05671J77688k22221m43535
$$ 76910492 77280853 77502640 76917061 76541267 76564064 76881889 77287560 77465248 77243027 76799492
2332.8G6799492J39046J47483j30157j93718l5629J66572K98844L01254m02069j67404
$$ 76799492 76938538 77086021 76955864 76762146 76726517 76893089 77191933 77493187 77091118 76923714
2342.5G6923714L33732r9220l45108n5740J51016M6120N0048Q988Q5228l5950j762
$$ 76923714 77257446 77158226 76813118 76757378 76908394 76954514 77004562 77013550 77098778 77062828 77061066
2353.1G7061066N76950n72205j142402L79310Q04306L33504j34529l01827l09257n21759
$$ 77061066 77638016 77065811 75923409 76302719 77107025 77440529 77306000 77004173 76694916 76173157
2362.7G6173157J00418L21594n06271k20078K33055R2484R6184L48251M01550k67204
$$ 76173157 76273575 76595169 76088898 75868820 76101875 76194359 76290543 76638794 77040344 76773140
2372.4G6773140o23535k23145M85131K96814j78193O7086m9935J08261K73964k4917
$$ 76773140 76149605 75926460 76411591 76708405 76530212 76597298 76547363 76655624 76929588 76904671
2382G6904671K5093o279j67793k33086j09200o7672j37978o87K7184Q6937J06758J11320
$$ 76904671 76929764 76923485 76755692 76522606 76413406 76345734 76207756 76207069 76234253 76321190 76427948 76539268
2393.6G6539268J15654m2449k8977l8086J3268L1852l49128k79381K08656J25534Q1330
$$ 76539268 76654922 76612473 76583496 76545410 76558678 76590530 76241402 75962021 76170677 76296211 76377541
2404.2G6377541J20399r8930r812l3508k441k5246j98906N4077k2606q9409M7837n7228
$$ 76377541 76497940 76399010 76389198 76355690 76353249 76328003 76129097 76183174 76160568 76071159 76118996 76061768
2415.8G6061768J266P0831J5763q2131O3172N0514l26859k02743j0193j98563j49170
$$ 76061768 76063034 76133865 76149628 76067497 76130669 76181183 75854324 75651581 75641388 75442825 75293655
2426.4G5293655M1588J58135K15919J9264j4450J2429k21283k00318N2254J56418p6325
$$ 75293655 75335243 75493378 75709297 75728561 75714111 75726540 75505257 75304939 75357193 75513611 75437286
2437G5437286j40365J1139p2335k9861J04111J70944K0836o6803N8029p9712j15906
$$ 75437286 75296921 75308060 75235725 75205864 75309975 75480919 75501755 75434952 75492981 75413269 75297363
2447.6G5297363o1622o7398o1364k06329k19154J2748Q7784J6823K19017K52037n7663
$$ 75297363 75235741 75168343 75106979 74900650 74681496 74694244 74782028 74798851 75017868 75269905 75212242
2458.2G5212242k16301j50566j01410j44981m7791m4044n226M0573M5379J45928j83365
$$ 75212242 74995941 74845375 74743965 74598984 74551193 74507149 74501923 74542496 74587875 74733803 74550438
2468.8G4550438k18536J86080K47750o9504l37395j23153j16028o9779Q8135q6616
$$ 74550438 74331902 74517982 74765732 74696228 74358833 74235680 74119652 74049873 74138008 74051392
2478.5G4051392N4069J51634L6225K2308J37207J15181j21201j19110k20520j21322
$$ 74051392 74105461 74257095 74293320 74315628 74452835 74568016 74446815 74327705 74107185 73985863
2488.1G3985863N043j89698L3852O8382L8872J35330k32811j91330J47843J40724P2876
$$ 73985863 73990906 73801208 73835060 73903442 73942314 74077644 73844833 73653503 73801346 73942070 74014946
2498.7G4014946J076q9470j86363j03692K7062P9765J78223L9833p0602J8898n3849
$$ 74014946 74016022 73926552 73740189 73636497 73663559 73743324 73921547 73961380 73890778 73909676 73855827
2509.3G3855827j33117p6332J1940n234p2769m3778L9971L9192n8441K2369Q8936O2111
$$ 73855827 73722710 73646378 73658318 73653084 73580315 73536537 73576508 73615700 73557259 73579628 73668564 73730675
2520.9G3730675J6800j87325o1249R8648j12526j97662q9966K9175j15028p6432J46195
$$ 73730675 73747475 73560150 73498901 73597549 73485023 73287361 73197395 73226570 73111542 73035110 73181305
2531.5G3181305n2803n6435O3065J27792J69800j19316j69006j92803k15652O4628
$$ 73181305 73128502 73072067 73135132 73262924 73432724 73313408 73144402 72951599 72735947 72800575
2541.1G2800575N5306J0116J0605L929J67076Q7380O294k6192k68173k61970p622J43288
$$ 72800575 72855881 72865997 72876602 72880531 73047607 73134987 73141281 73115089 72846916 72584946 72577324 72720612
2552.7G2720612L9947j58684J0002J28373p4479L29J6334j47377j3351K1804r0736
$$ 72720612 72760559 72601875 72611877 72740250 72665771 72666100 72682434 72535057 72521706 72543510 72452774
2563.3G2452774k6283m4251p5950J1123j30615k9808K66441o8389j60553J50733O8352
$$ 72452774 72426491 72382240 72306290 72317413 72186798 72156990 72423431 72355042 72194489 72345222 72413574
2573.9G2413574k1164k2453k785r9212l15857j89202N1842J64604K17003K6291j95618
$$ 72413574 72392410 72369957 72367172 72267960 71952103 71762901 71814743 71979347 72196350 72222641 72027023
2584.5G2027023j7418J57456M2976p3807j81701j56677J1741J40961N4687j03721o4965
$$ 72027023 72009605 72167061 72210037 72136230 71954529 71797852 71809593 71950554 72005241 71901520 71836555
2595.1G1836555n8685L8155J31691q0178k77381j52131J58555J05682j49849j37543
$$ 71836555 71777870 71816025 71947716 71867538 71590157 71438026 71596581 71702263 71552414 71414871
2604.8G1414871l0037K0546J17508J27739j31485j01478O6215n1399K4635J732j57249
$$ 71414871 71384834 71405380 71522888 71650627 71519142 71417664 71483879 71432480 71457115 71458847 71301598
2615.4G1301598j42632j95640j0895J56410K1362O8726l7483j66130J7204n6931j11213
$$ 71301598 71158966 70963326 70952431 71108841 71130203 71198929 71161446 70995316 71012520 70955589 70844376
2626G0844376j11115k31338N9341K33452n409j24932j45065j2115J05377m4281p9926
$$ 70844376 70733261 70501923 70561264 70794716 70789307 70664375 70519310 70507195 70612572 70568291 70488365
2636.6G0488365l9070o9069j5289o5026j84547j35094k3651n8952j1078J47995O9473
$$ 70488365 70449295 70380226 70364937 70299911 70115364 69980270 69956619 69897667 69886589 70034584 70104057
2647.2G0104057l9444o3667n7312j11649j26762l929j34293k11464n0705J16600J09246
$$ 70104057 70064613 70000946 69943634 69831985 69705223 69701294 69567001 69355537 69304832 69421432 69530678
2657.8F9530678m0199L6499p7202k17903Q7112K32796j26442l03536m3564j4076L7972
$$ 69530678 69490479 69526978 69449776 69231873 69318985 69551781 69425339 69121803 69078239 69064163 69102135
2668.4F9102135K9876k16476j25931k4635N852N3505j9417j8967R2789q32k37762j64337
$$ 69102135 69132011 68915535 68789604 68764969 68770821 68824326 68804909 68785942 68878731 68877899 68640137 68475800
2680F8475800k4544Q3748J50428O41j77765m4082K30446k0234j46598R8381J2848j39473
$$ 68475800 68451256 68535004 68685432 68686073 68508308 68464226 68694672 68674438 68527840 68626221 68639069 68499596
2691.6F8499596j91414j29784m2450o0226m4869R049K5261J2596K9129k4567k5162
$$ 68499596 68308182 68178398 68135948 68075722 68030853 68039902 68065163 68077759 68106888 68082321 68057159
2702.2F8057159m0878j89796j28022P8034R3826n7884j15990Q515J26609N9914k7115
$$ 68057159 68016281 67826485 67698463 67776497 67870323 67812439 67696449 67704964 67831573 67891487 67864372
2712.8F7864372n6785j71547q0467Q0337k00623l61900K8114K53472J05888j7914l707
$$ 67864372 67807587 67636040 67555573 67635910 67435287 67073387 67101501 67354973 67460861 67442947 67439240
2723.4F7439240n0408k00355l5782J51802N844k15592j96868L1272J2886J01365R8304
$$ 67439240 67388832 67188477 67152695 67304497 67310341 67094749 66897881 66929153 66942039 67043404 67141708
2734F7141708k14187j03699O3545M608q9920L807J62499r2407k75078r4574J23833
$$ 67141708 66927521 66823822 66887367 66891975 66802055 66805862 66968361 66875954 66600876 66506302 66630135
2744.6F6630135J08291l5560m2153o714m6058k00478j26892J23367P7370j0925L0555
$$ 66630135 66738426 66702866 66660713 66653999 66607941 66407463 66280571 66403938 66481308 66470383 66500938
2755.2F6500938j27082k49085O1890J56212j13533m1817O5155j2528k929n2803o3454
$$ 66500938 66373856 66124771 66186661 66342873 66229340 66187523 66252678 66240150 66237221 66184418 66120964
2765.8F6120964O3316L8285j68312j84861k2064R0027K08771N8632k14691j41388K349
$$ 66120964 66184280 66222565 66054253 65869392 65847328 65937355 66146126 66204758 65990067 65848679 65851028
2776.4F5851028n9219j07551J25854J24992j93679k04964p0152K2850l800n9517M1298
$$ 65851028 65791809 65684258 65810112 65935104 65741425 65536461 65466309 65489159 65485359 65425842 65467140
2787F5467140J77544J03027j66168m8912R4170j29357j38382Q782n1598j88362j15372
$$ 65467140 65644684 65747711 65581543 65532631 65626801 65497444 65359062 65367844 65316246 65127884 65012512
2797.7F5012512M2824j7365j23344O7352J56998o6673j88492j60225P1625Q3252j43082
$$ 65012512 65055336 65037971 64914627 64981979 65138977 65072304 64883812 64723587 64795212 64878464 64735382
2808.3F4735382j33423j33446l6979M9209p6225m5746R3491K937q5609p8652j48636
$$ 64735382 64601959 64468513 64431534 64480743 64404518 64358772 64452263 64455200 64369591 64290939 64142303
2818.9F4142303Q385N2719j38656j53267o4278J2989L2971K8728j66752k04910m3598
$$ 64142303 64150688 64203407 64064751 63911484 63847206 63860195 63893166 63921894 63755142 63550232 63506634
2829.5F3506634r911O1943p1659j84429j01090o7939q9054K0733J69929l0838k39204
$$ 63506634 63496723 63558666 63487007 63302578 63201488 63133549 63044495 63065228 63235157 63204319 62965115
2840.1F2965115j74698O8664k7626k14512J1685q0227j98444n6439N7224N371j05518
$$ 62965115 62790417 62859081 62831455 62616943 62628628 62548401 62349957 62293518 62350742 62356113 62250595
2850.7F2250595O5727q1314m16694k03377K61551J71680j36070j49880j54136O3122
$$ 62250595 62316322 62235008 61818314 61614937 61876488 62048168 61912098 61762218 61608082 61671204
2860.3F1671204j46939m54910K6634J63853m3091K8397l4195k55757j99421J18348
$$ 61671204 61524265 61069355 61095989 61259842 61216751 61245148 61210953 60955196 60755775 60874123
2870F0874123m2527m12338q7292O8695j66519R323L8285J8844j3908j91589j27324
$$ 60874123 60831596 60419258 60331966 60400661 60234142 60243465 60281750 60300594 60286686 60095097 59967773
2880.6E9967773k07470p6210J08826q2905j77578j86359m8302K8137k9205J0384M0992
$$ 59967773 59760303 59684093 59792919 59710014 59532436 59346077 59297775 59325912 59296707 59307091 59348083
2891.2E9348083j1878j48129j29967P519J888l5724M7584k0412j36639L4718J3271
$$ 59348083 59336205 59188076 59058109 59065628 59067516 59031792 59079376 59058964 58922325 58957043 58970314
2901.8E8970314j77143m3930J25259M6040j56277k36702j07059K727N1502Q6167J23180
$$ 58970314 58793171 58749241 58874500 58920540 58764263 58527561 58420502 58423229 58474731 58560898 58684078
2912.4E8684078L7754l50017l36159M6631N1670j24210k87346q6766J68053p2063j49826
$$ 58684078 58721832 58371815 58035656 58082287 58133957 58009747 57722401 57635635 57803688 57731625 57581799
2923E7581799N5488J52050J59382M6604j93664j96598J19289K41970k2434j50570j9718
$$ 57581799 57637287 57789337 57948719 57995323 57801659 57605061 57724350 57966320 57943886 57793316 57773598
2933.6E7773598o5312k6157J06434O7173n341M9248K22713k540j92917Q8779K55787
$$ 57773598 57708286 57682129 57788563 57855736 57850395 57899643 58122356 58119816 57926899 58015678 58271465
2944.2E8271465J93360K5753N3775O2584q6883q4503q8715J80916L02841l0270O7490
$$ 58271465 58464825 58490578 58544353 58606937 58520054 58435551 58346836 58527752 58830593 58800323 58867813
2954.8E8867813K73358J85832Q8059j21346q0543J89548N6950o5109J43863K24766
$$ 58867813 59141171 59327003 59415062 59293716 59213173 59402721 59459671 59394562 59538425 59763191
2964.5E9763191J81526L7156j04287K4815R6966Q987J02841K42351M5303j96308l4469
$$ 59763191 59944717 59981873 59877586 59902401 59999367 60008354 60111195 60353546 60398849 60202541 60168072
2975.1F0168072K84992K48630o0615n6988Q2695J40835J29791j06075n1434J63334
$$ 60168072 60453064 60701694 60641079 60584091 60666786 60807621 60937412 60831337 60779903 60943237
2984.7F0943237Q5175q0223j82179k6478J75740J83590O4403K41L4362q2290q8585
$$ 60943237 61028412 60948189 60766010 60739532 60915272 61098862 61163265 61163506 61197868 61115578 61026993
2995.3F1026993K32166K76108n0419k5536j2596j99512l3867J02867Q2176j0910N436
$$ 61026993 61259159 61535267 61484848 61459312 61446716 61247204 61213337 61316204 61398380 61387470 61392906
3006F1392906M2027j24626N1834J88354q190o1359m0348k21688k18784J87893L2280
$$ 61392906 61434933 61310307 61362141 61550495 61542305 61480946 61440598 61218910 61000126 61188019 61220299
3016.6F1220299l22502k8454K06703K6649j61052j06793n6507l3539J5427L8113j6610
$$ 61220299 60897797 60869343 61076046 61102695 60941643 60834850 60778343 60744804 60760231 60798344 60781734
3027.2F0781734j69845j85391j05293K9965m1138j27277n555j06674m9114m150q0910
$$ 60781734 60611889 60426498 60321205 60351170 60310032 60182755 60177200 60070526 60021412 60017262 59936352
3037.8E9936352Q6956L5393n2208L0208n9585j88469o5594L4679j82899k07668P2994
$$ 59936352 60023308 60058701 60006493 60036701 59977116 59788647 59723053 59757732 59574833 59367165 59440159
3048.4E9440159R0378j37104j34064k8126l0208o3992k23049j03970K04983M1306j21869
$$ 59440159 59530537 59393433 59259369 59231243 59201035 59137043 58913994 58810024 59015007 59056313 58934444
3059E8934444r2742J0536J72172r2815l26103j47179n8800J9902o596j95599r0198
$$ 58934444 58841702 58852238 59024410 58931595 58605492 58458313 58399513 58419415 58412819 58217220 58127022
3069.6E8127022k0184q8180j2020p4109o7382L0418q1451j63258j29539P717Q3000
$$ 58127022 58106838 58018658 58006638 57932529 57865147 57895565 57814114 57650856 57521317 57529034 57612034
3080.2E7612034J49048L4870l30933j74774k571j58989n1823Q6235J00014j0254j98715
$$ 57612034 57761082 57795952 57465019 57290245 57287674 57128685 57076862 57163097 57263111 57252857 57054142
3090.8E7054142j49216k0221n4474J13365J39614k00783j80504j16745j03496R601
$$ 57054142 56904926 56884705 56830231 56943596 57083210 56882427 56701923 56585178 56481682 56491283
3100.5E6491283k6485j02146q1967J34777Q9570j53283j80591n5119j1665m9130R6661
$$ 56491283 56464798 56362652 56280685 56415462 56505032 56351749 56171158 56116039 56104374 56055244 56151905
3111.1E6151905j18656k56127l3752j01814L2203J28472q6537j56246j2298K0855j90125
$$ 56151905 56033249 55777122 55743370 55641556 55673759 55802231 55715694 55559448 55547150 55568005 55377880
3121.7E5377880j16489Q4198r846j99513q1150J82026k067k05052p9750P4627M6700
$$ 55377880 55261391 55345589 55335743 55136230 55055080 55237106 55235039 55029987 54950237 55024864 55071564
3132.3E5071564k03427k41504O9088J74545p86j26358j78093j38534k1279L4741l7659
$$ 55071564 54868137 54626633 54695721 54870266 54869480 54743122 54565029 54426495 54405216 54439957 54402298
3142.9E4402298k9602P5519P447j18267j59989p6770k2381r5188r6768L6183J98478
$$ 54402298 54372696 54448215 54455662 54337395 54177406 54100636 54078255 53983067 53886299 53922482 54120960
3153.5E4120960J4481k46811j72241l3593J58677J38614j79809k32262l6541R3288
$$ 54120960 54135441 53888630 53716389 53682796 53841473 53980087 53800278 53568016 53531475 53624763
3163.1E3624763N2945q1215j25256j09310q7437n4126N0312J67396L578j95972k8580
$$ 53624763 53677708 53596493 53471237 53361927 53274490 53220364 53270676 53438072 53441650 53245678 53217098
3173.8E3217098J6026k95384k57133P5542K87369K57195j88332l61633r2343n813m2321
$$ 53217098 53233124 52937740 52680607 52756149 53043518 53300713 53112381 52750748 52658405 52652592 52610271
3184.4E2610271K9870J81522r251j50779J7772l2421p7888j09108q4183R067j14940
$$ 52610271 52640141 52821663 52812412 52661633 52679405 52646984 52569096 52459988 52375805 52384872 52269932
3195E2269932o6384J23391l407j94752o0382O3648q2321l1338J67236k3960n2742Q1825
$$ 52269932 52203548 52326939 52323532 52128780 52068398 52132046 52049725 52018387 52185623 52161663 52108921 52190746
3206.5E2190746j20350o9961q5510j76770j0685k9045k3124r1759j01383l2818l6892
$$ 52190746 52070396 52000435 51914925 51738155 51727470 51698425 51675301 51583542 51482159 51449341 51412449
3217.2E1412449L8399k6543Q9088J43628j03272j89869j40930l6846J2077j04587j82282
$$ 51412449 51450848 51424305 51513393 51657021 51553749 51363880 51222950 51186104 51198181 51093594 50911312
3227.8E0911312l883J35460O6196L9040J03164m390j48899m7417o8730p3959J2688
$$ 50911312 50907429 51042889 51109085 51148125 51251289 51246899 51098000 51050583 50981853 50907894 50920582
3238.4E0920582n3032j00216K7390J98791n7220j98281m4945p6717j03649j11691J30513
$$ 50920582 50867550 50767334 50794724 50993515 50936295 50738014 50693069 50616352 50512703 50401012 50531525
3249E0531525J98597j05610k20795k05093J0849K30182P6229r6298J6857J50685J11000
$$ 50531525 50730122 50624512 50403717 50198624 50209473 50439655 50515884 50419586 50436443 50587128 50698128
3259.6E0698128j11080j98697r1819j15822J18236J37055k11292j06324Q0563Q6292
$$ 50698128 50587048 50388351 50296532 50180710 50298946 50436001 50224709 50118385 50198948 50285240
3269.2E0285240j7055q4065p7946j71703r5325P6477M7500m4975l6919p3822r0858
$$ 50285240 50268185 50184120 50106174 49934471 49839146 49915623 49963123 49918148 49881229 49807407 49716549
3279.8D9716549k464j1742j34819n9341J91654M2202r2041L1646K682m3949j12179
$$ 49716549 49714085 49702343 49567524 49508183 49699837 49742039 49649998 49681644 49684326 49640377 49528198
3290.4D9528198J42445K89753k38728k26352J95491q8047l17249K2850Q1024j46206
$$ 49528198 49670643 49960396 49721668 49495316 49690807 49602760 49285511 49308361 49389385 49243179
3300.1D9243179p1052J60633J19167o7169j48159q6609N0831o6868o9401K2721j33023
$$ 49243179 49172127 49332760 49451927 49384758 49236599 49149990 49200821 49133953 49064552 49087273 48954250
3310.7D8954250M3568J36421j07448j11756P5890Q1756k21218j68037K31071J33328
$$ 48954250 48997818 49134239 49026791 48915035 48990925 49072681 48851463 48683426 48914497 49047825
3320.3D9047825k11926j58165n3703l0628J29021J9168q2763o481l3020M2892M3041
$$ 49047825 48835899 48677734 48624031 48593403 48722424 48741592 48658829 48652348 48619328 48662220 48705261
3330.9D8705261r3757j13850k0317j30562j5819K27359j98822j67404J05373j54361
$$ 48705261 48611504 48497654 48477337 48346775 48330956 48558315 48359493 48192089 48297462 48143101
3340.6D8143101j11157M5109R8049J2829j12339k6447O3587k5463j66538M707R3738
$$ 48143101 48031944 48077053 48175102 48187931 48075592 48049145 48112732 48087269 47920731 47925438 48019176
3351.2D8019176M4987j53774l68881l0247J82075Q1j96148n2475K04937N2353j37322
$$ 48019176 48064163 47910389 47541508 47511261 47693336 47693417 47497269 47444794 47649731 47702084 47564762
3361.8D7564762r8450J41659O4907r2853m1176j31146o2561K812M3388j11046k96981
$$ 47564762 47466312 47607971 47672878 47580025 47538849 47407703 47345142 47347954 47391342 47280296 46983315
3372.4D6983315K1652K06356m0604j30730L926j19358N7625K23358r5398k9080L6129
$$ 46983315 47004967 47211323 47170719 47039989 47043915 46924557 46982182 47205540 47110142 47081062 47117191
3383D7117191o9359j25984m3132K2628k1431J90071N7641j06732k05559l88656L1997
$$ 47117191 47047832 46921848 46878716 46901344 46879913 47069984 47127625 47020893 46815334 46426678 46458675
3393.6D6458675K74891l6144j25076K51331J40137l45722j30387K57733J51035j94920
$$ 46458675 46733566 46697422 46572346 46823677 46963814 46618092 46487705 46745438 46896473 46701553
3403.3D6701553k13417J0155O0596l1757r7526m3660j3561O5296J2024j96720N360
$$ 46701553 46488136 46498291 46558887 46527130 46429604 46385944 46372383 46437679 46449703 46252983 46258343
3413.9D6258343K20932j22330k48669Q3119J86336R6695l1959k6676J7974o8962r3696
$$ 46258343 46479275 46356945 46108276 46191395 46377731 46474426 46442467 46415791 46433765 46364803 46271107
3424.5D6271107k25315j83941J37653K61799P6633p709L6369k14905k08709Q9630L4359
$$ 46271107 46045792 45861851 45999504 46261303 46337936 46330227 46366596 46151691 45942982 46032612 46066971
3435.1D6066971r5642K559K52240K21840j41037k13040j49654j18428J24878J02589
$$ 46066971 45971329 45973888 46226128 46447968 46306931 46093891 45944237 45825809 45950687 46053276
3444.7D6053276l1498O8150K7179r5417P023J44867P7694o7760j19778N9261J54633
$$ 46053276 46021778 46089928 46117107 46021690 46028713 46173580 46251274 46183514 46063736 46122997 46277630
3455.3D6277630j6491r8381j23593M2759P7031j6636m5140k06970J9261K01610Q3759
$$ 46277630 46261139 46162758 46039165 46081924 46158955 46142319 46097179 45890209 45909470 46111080 46194839
3466D6194839o0901m5155p0930k13795J63830J91238O56J29319J49364J48724j01425
$$ 46194839 46133938 46088783 46017853 45804058 45967888 46159126 46159782 46289101 46438465 46587189 46485764
3476.6D6485764o1825n867o9206Q5594n2876j42223l1964K33487J75205j03687M6150
$$ 46485764 46423939 46418072 46348866 46434460 46381584 46239361 46207397 46440884 46616089 46512402 46558552
3487.2D6558552j26274k26307Q3404J23352J23658O9744L9764R6016j13499j96628
$$ 46558552 46432278 46205971 46289375 46412727 46536385 46606129 46645893 46741909 46628410 46431782
3496.8D6431782K3800J73599j7536j97567J22825P0019r9453J13781L2700l3039M3388
$$ 46431782 46455582 46629181 46611645 46414078 46536903 46606922 46507469 46621250 46653950 46620911 46664299
3507.4D6664299K37583M1832k42882k0263O7600p214j09176J14803J21719p7339N017
$$ 46664299 46901882 46943714 46700832 46680569 46748169 46740955 46631779 46746582 46868301 46790962 46795979
3518D6795979Q3732Q1635j11836n6820j04843k4090L42686K51122L8303k24026N4543
$$ 46795979 46879711 46961346 46849510 46792690 46687847 46663757 47006443 47257565 47295868 47071842 47126385
3528.6D7126385R1400j82598n3009J4305L1833n4313L03497L74420j05926j41354j43406
$$ 47126385 47217785 47035187 46982178 46996483 47028316 46974003 47277500 47651920 47545994 47404640 47261234
3539.2D7261234J137Q8791K20001N6488j05125N3013q0178K26761J69430n9845N7102
$$ 47261234 47262371 47351162 47571163 47627651 47522526 47575539 47495361 47722122 47891552 47831707 47888809
3549.9D7888809J16352J2215k21062N7297J5404K754L3867p5054o600m5559J37467
$$ 47888809 48005161 48017376 47796314 47853611 47869015 47871769 47905636 47830582 47823982 47778423 47915890
3560.5D7915890J02058K00913O6276j01791M04270N2456l54805k72995j3065K72369
$$ 47915890 48017948 48218861 48285137 48183346 48587616 48640072 48285267 48012272 47999207 48271576
3570.1D8271576J98360L09952M3804Q0662J38344j20720N3944r9701k2938P6111k6398
$$ 48271576 48469936 48779888 48823692 48904354 49042698 48921978 48975922 48876221 48853283 48929394 48902996
3580.7D8902996K13146K21707k5112J33148M48734j56029m76799N8262k34192J17153
$$ 48902996 49116142 49337849 49312737 49445885 49894619 49738590 49261791 49320053 49085861 49203014
3590.4D9203014K34032K83688J15371k60559O4514K3674N3067J29612O8493J37985
$$ 49203014 49437046 49720734 49836105 49575546 49640060 49663734 49716801 49846413 49914906 50052891
3600E0052891K0618L67535L92620j96640j81587K30518M1664k63889L92471K12959
$$ 50052891 50073509 50441044 50833664 50637024 50455437 50685955 50727619 50463730 50856201 51069160
3609.6E1069160j41822L51146n2074l53062K96845K26276L56320K74597l83187k18364
$$ 51069160 50927338 51278484 51226410 50873348 51170193 51396469 51752789 52027386 51644199 51425835
3619.3E1425835j60836J2841L96751L05332K31377L51841J52573j4618M25170J37414
$$ 51425835 51264999 51277840 51674591 51979923 52211300 52563141 52715714 52701096 53126266 53263680
3628.9E3263680p04201K70656K96166L13553k20711m04198M77120N98404J24763j95015
$$ 53263680 52559479 52830135 53126301 53439854 53219143 52814945 53292065 53890469 54015232 53820217
3638.6E3820217J85490K89470M6673o7817j76663n3814K31522L33633l89560p0633
$$ 53820217 54005707 54295177 54341850 54274033 54097370 54043556 54275078 54608711 54219151 54148518
3648.2E4148518P16392K73930r2888j46687L55488L32096L89607L95519o38043J99769
$$ 54148518 54864910 55138840 55045952 54899265 55254753 55586849 55976456 56371975 55733932 55933701
3657.9E5933701L72058O5609J28746j3179K08080J61503M5387J15929P0743L81111
$$ 55933701 56305759 56371368 56500114 56486935 56695015 56856518 56901905 57017834 57088577 57469688
3667.5E7469688L60749J10996J63006o46630j14746M69365Q39996Q03223j569157J4007
$$ 57469688 57830437 57941433 58104439 57457809 57343063 57812428 58652424 59455647 57886490 57900497
3677.1E7900497N63614K71996j24485m3217K30206O3179Q7997K61223K39716M99523
$$ 57900497 58464111 58736107 58611622 58568405 58798611 58861790 58949787 59211010 59450726 59950249
3686.8E9950249O32004q53444m85725Q42091n42054l25798M78627J47907K80544J90971
$$ 59950249 60582253 59728809 59243084 60085175 59543121 59217323 59695950 59843857 60124401 60315372
3696.4F0315372j5388j06747j56109K01035K8713o18648k0298N10688J32534P2724
$$ 60315372 60299984 60193237 60037128 60238163 60266876 59648228 59627930 60138618 60271152 60343876
3706.1F0343876K28805K26136L28407n53268J38359J02230q64739P14913K52361j55438
$$ 60343876 60572681 60798817 61127224 60573956 60712315 60814545 59949806 60664719 60917080 60761642
3715.7F0761642K13086K78362J15723l62999j12179N55630n7255n17147L55835P4543
$$ 60761642 60974728 61253090 61368813 61005814 60893635 61449265 61392010 60874863 61230698 61305241
3725.4F1305241k60617j96380J35921K23923K77660R03515q6479r23126O57100R0687
$$ 61305241 61044624 60848244 60984165 61208088 61485748 62389263 62302784 61379658 62036758 62127445
3735F2127445j210270R2831L89667q6708J78818J20247k41211K11464R49150n71400
$$ 62127445 60917175 61010006 61399673 61312965 61491783 61612030 61370819 61582283 62531433 61960033
3744.7F1960033k453537J068272R97509J007080j98608j576622J115192q6304n77434
$$ 61960033 59506496 60574768 61572277 62579357 62380749 60804127 61919319 61833015 61255581
3753.3F1255581L66558K95456J74168n02667L47366N48306o63448l49785L71563Q4438
$$ 61255581 61622139 61917595 62091763 61589096 61936462 62484768 61821320 61471535 61843098 61927536
3763F1927536J4568M82437l49205l37326K91634K62962j12999o84860L83270J95286
$$ 61927536 61942104 62424541 62075336 61738010 62029644 62292606 62179607 61494747 61878017 62073303
3772.6F2073303J5816K18430O5372l0663k21843K76642K69588n18669J20006J56094
$$ 62073303 62089119 62307549 62372921 62342258 62120415 62397057 62666645 62147976 62267982 62424076
3782.3F2424076p1846J7551k84008j37470L04013O6001P279J2440j32306N9258R6428
$$ 62424076 62352230 62369781 62085773 61948303 62252316 62318317 62325596 62338036 62205730 62264988 62361416
3792.9F2361416l0781R3670K30076m99287l63060M81709M33708M39792p00836q77521
$$ 62361416 62330635 62424305 62654381 62155094 61792034 62273743 62707451 63147243 62446407 61568886
3802.5F1568886L63678P3997M19464N94567p16996m29035K47502J46949O7860M1824
$$ 61568886 61932564 62006561 62426025 63020592 62303596 61874561 62122063 62269012 62336872 62378696
3812.2F2378696J08708K47318N65678k58641j575672N08850O41682M28166K93903j591450
$$ 62378696 62487404 62734722 63300400 63041759 61466087 61974937 62616619 63044785 63338688 61747238
3821.8F1747238k63355M62238M31217L39810L9879m74434j79009K53491K80628K418
$$ 61747238 61483883 61946121 62377338 62717148 62757027 62282593 62103584 62357075 62637703 62640121
3831.4F2640121o03519K34894N05005n09075l7198N22171o54918j01769N88093n79128
$$ 62640121 62036602 62271496 62776501 62267426 62230228 62752399 62097481 61995712 62583805 62004677
3841.1F2004677K33181R43271l19232p12319K19601K52140j6113J04537j53713j3405
$$ 62004677 62237858 63181129 62861897 62149578 62369179 62621319 62605206 62709743 62556030 62542625
3850.7F2542625O50780k78801n30952j572109L56491J028770p0679q4938K20097J14952
$$ 62542625 63193405 62914604 62383652 60811543 61168034 62196804 62126125 62041187 62261284 62376236
3860.4F2376236K98103k34985J10660O15727o44257n73688L61889N08808Q41427o94531
$$ 62376236 62674339 62439354 62550014 63165741 62521484 61947796 62309685 62818493 63659920 62965389
3870F2965389j481518N01484P59110L30631p81551o8093Q2985l11897K50298N45635
$$ 62965389 61483871 61985355 62744465 63075096 62293545 62225452 62308437 61996540 62246838 62792473
3879.7F2792473n26161m08104N10807j60M5543J79161r84230K71885M23416O6349K16069
$$ 62792473 62266312 61858208 62369015 62368855 62414398 62593559 61609329 61881214 62304630 62370979 62587048
3890.3F2587048o0963m20548l1028Q3675n466K36469J23867R2144O3618n21382M50161
$$ 62587048 62526085 62105537 62074509 62158184 62152718 62389187 62513054 62605198 62668816 62147434 62597595
3900.9F2597595j59118o64441N26020k90679k20906J40946P2864K23305J11473P7282
$$ 62597595 62438477 61774036 62300056 62009377 61788471 61929417 62002281 62225586 62337059 62414341
3910.5F2414341j76853k11395R128R6394J71791O9336k56283k96036K35695O7959k41367
$$ 62414341 62237488 62026093 62035221 62131615 62303406 62372742 62116459 61820423 62056118 62124077 61882710
3921.1F1882710K44579J99425J03401k56802n22919J63063K60586J31752r170n3482
$$ 61882710 62127289 62326714 62430115 62173313 61650394 61813457 62074043 62205795 62196625 62143143
3930.8F2143143K29667k15751k35085K70554k602l39840k02324K18056J67973j01963
$$ 62143143 62372810 62157059 61921974 62192528 62189926 61850086 61647762 61865818 62033791 61931828
3940.4F1931828L03146L70193l37127m52355j91097K01595K01187j92745J68598J5004
$$ 61931828 62234974 62605167 62268040 61815685 61624588 61826183 62027370 61834625 62003223 62018227
3950.1F2018227m82212N6316J10920o9119J48709M5372o9222o8443P1987J23264J988
$$ 62018227 61536015 61592331 61703251 61634132 61782841 61828213 61758991 61690548 61762535 61885799 61887787
3960.7F1887787n963j60301J5175j2466k64004P6885J68911P3445M5909k7084J9234
$$ 61887787 61881824 61721523 61736698 61724232 61460228 61537113 61706024 61779469 61825378 61798294 61817528
3971.3F1817528r2827j32233r6554J0434J39183N0773n5793k3865R1499k3617m0752
$$ 61817528 61724701 61592468 61495914 61506348 61645531 61696304 61640511 61616646 61708145 61684528 61643776
3981.9F1643776J96384L4569l05530j34579J35738N6851k7249j24061j35464k2621
$$ 61643776 61840160 61874729 61569199 61434620 61570358 61627209 61599960 61475899 61340435 61317814
3991.5F1317814J67141K38987j05187j31092J01185j945j15357l3024R4605
$$ 61317814 61484955 61723942 61618755 61487663 61588848 61586903 61471546 61438522 61533127
4000.2F1533127
$$ 61533127
##END=$$ End of the data block
