##TITLE=$$ Begin of the data block
##JCAMP-DX=5.00 $$ ACD/SpecManager v 10.08
##SPECTROMETER/DATA SYSTEM=Varian
##DATE=19 Mar 2013 10:04:40
##DATA TYPE=INFRARED SPECTRUM
##DATA CLASS=XYDATA
##ORIGIN=
##OWNER=
##NPOINTS=3735
##FIRSTX=399.26403809
##LASTX=4000.35498047
##MAXX=4000.35498047
##MINX=399.26403809
##MAXY=86.69265747
##MINY=32.91666412
##XFACTOR=1.0000000000
##YFACTOR=0.000000100000000
##FIRSTY=61.17044830
##DELTAX=0.96440572
##XUNITS=1/CM
##YUNITS=TRANSMITTANCE
##XYDATA=(X++(Y..Y))
399.3F11704483j75898209L29815903l4621963o2075653R1086196l0227432J6859207
406G46642532p9782333j55670700j82022858K6642838J62768211k7346954K01600456
412.8F92831192J08345947j48340225j19623413k5661697N3580894o3663483K19811669
419.5G17280884J49645691k30065499m8390121K09926109k6682815r9033432J0087433
426.3F82768250Q7445449k3818969j40386315N7962990N3708191o1174011p4170304
433E82335281o6045189K6197892K1029205R5946922R5313721K9002762l1948395j15184860
440.7F36647339j32352104n7138024J07104988M8782616p2620430n51720j4498176
447.5E15374489p4060517N8818398J38440742m0907707l4230652J07346192M0185547
$$ y = [611704483, 435806274, 765622177, 731000214, 668924561, 760010757, 729783325, 746642532, 666860199, 511189499, 329166641, 355809479, 518577690, 491230736, 692831192, 801177139, 652836914, 533213501, 507551804, 561132698, 497469215, 717280884, 866926575, 636861076, 588470955, 798397064, 771714249, 672680817, 682768250, 770213699, 746394730, 606008415, 663971405, 717679596, 656505585, 582335281, 516290092, 542487984, 563517189, 659464111, 754777832, 783780594, 751832199, 636647339, 504295235, 447157211, 554262199, 603044815, 530424385, 529872665, 515374489, 441313972, 500132370, 638573112, 597665405, 563434753, 670780945, 710966492]
454.2G10966492o7711335n4192276L138962m8007583M1433143P0602227O7881698J5887146
462G39998474m4828567o3241120o3223877o1994400Q244667J05762291o258735J7297744
469.7F31756477O580773j6143532J54951134j62791977r1574898O9410477J2606773
476.4F04795227M2250443p5096016K7702980M3031463o6297645l3151970r8792954
483.2D44441528K537537P9937859N1111564Q3368378K6755066J2803650k7039032l3964196
490.9F39952354q5292282n5706405N3710251N9565620P8359222N2170182j8664704
497.6G24094238j6229706q5141639q1021347J4443359K5844498m2443962n7278786
504.4D82266655N3162498R4783249o6802559o0462074K6404686L2728348M2852936
$$ y = [710966492, 643255157, 589062881, 592201843, 544194260, 585627403, 656229630, 724111328, 739998474, 695169907, 631928787, 568704910, 506710510, 514955177, 620717468, 614458733, 631756477, 638337250, 622193718, 777144852, 614352875, 522777977, 592188454, 604795227, 647045670, 571949654, 599652634, 642684097, 576386452, 543234482, 444441528, 446979065, 526916924, 578028488, 661396866, 688151932, 700955582, 673916550, 639952354, 554660072, 498953667, 552663918, 612229538, 690588760, 742758942, 724094238, 707864532, 622722893, 541701546, 556144905, 581989403, 539545441, 482266655, 535429153, 630212402, 563409843, 502947769, 529352455, 562080803, 604933739]
511.1F04933739K7113952m6953468P892838O9606246j6704483j9834404k5561599p778664
518.9E92714157N0339127R028778N93033l3531304n0903549q722954j1459694K0171509
526.6E68229103K8579292j5417633k7792053N215187O2563439L7304229k3128624k0577469
534.3F14975471j0761299M411736j9469109j9986877L2454529J0328216k3845520j9748039
542E68359108K0452385K3779221j9765664j7053985J2958069N1466178R031144k2605057
549.7F26621399M3580856K2143173n3093643p4162826j5161476M7723236M8266792
556.5F45917511J9554596l5594940r113274L6802025R419174l8907204m1243591j283569
564.2E85550728j122093j0329552L3516006M1855965m3025398m7522659P977600J6667366
$$ y = [604933739, 632047691, 585094223, 592987061, 662593307, 645888824, 626054420, 600492821, 592714157, 643053284, 652082062, 652675095, 619143791, 568240242, 559517288, 548057594, 568229103, 596808395, 581390762, 553598709, 558813896, 621377335, 658681564, 635552940, 614975471, 604214172, 608625908, 589156799, 569169922, 601624451, 611952667, 588107147, 568359108, 588811493, 612590714, 592825050, 575771065, 588729134, 640195312, 649226456, 626621399, 670202255, 692345428, 639251785, 565088959, 549927483, 597650719, 645917511, 665472107, 629877167, 620763893, 657565918, 666985092, 628077888, 586834297, 585550728, 584428635, 574099083, 607615089, 649471054, 606445656, 558922997, 566900597, 583567963]
571.9E83567963P214775j1650048J1662941L089943k0765762J5473747k0516166j6281128
579.6E51796265N2246742J7319565l2638169j0396156J9192352K0973549R526253n255013
587.3F22765388m6751823k4833031M1670800M6291542O843147k4821854j4453773j0648308
595E96062088j0797424J7952957J8497352O706582M11453r306832n189476R97849q550072
603.7F06784477n319137J4422416o470222j714478J4189339N401192Q661346m139480
611.4F31815453k415581o173783r726715j0012855j2229309J508636p800102J7502441
619.2F02468185K4455948N172196K262115j5391350m943313R072189J3153877n423736
626.9F30826111q351479J046028j4136467L1603356L4455414j9238358k7185707q566895
$$ y = [583567963, 590782738, 579132690, 590795631, 593885574, 573119812, 588593559, 568077393, 551796265, 604043007, 621362572, 588724403, 578328247, 597520599, 618494148, 628020401, 622765388, 576013565, 551180534, 592851334, 639142876, 645986023, 621164169, 606710396, 596062088, 585264664, 603217621, 621714973, 628421555, 628833008, 619526176, 614336700, 615334549, 606784477, 601465340, 615887756, 609417534, 607703056, 621892395, 627293587, 635954933, 631815453, 629399872, 623226089, 613499374, 603486519, 591257210, 592765846, 584965744, 602468185, 626924133, 632096329, 634358444, 618967094, 614023781, 623095970, 636249847, 630826111, 622474632, 623520660, 609384193, 640987549, 675442963, 656204605, 629018898, 620452003]
634.6F20452003L0625496K899399k6133423k554321k53715K2417869N955124l6332321
642.3F17076111j1780815J6643409L9484101K2561874k3454819r874267j777802q369064
650F40508728R549103Q457641r204864j6592865K23198J3791389n427322j2138786
657.7F29166222J898803j3085670l961640K5637475N801811o012955K733459M813996
665.4F46991501J312713j3852615j0050812K2546158O226654q693771q943138Q463249
673.2F43999939L547974j2722512k031173J2129325K68860j50833Q620453Q049240
680.9F61711273k602691q186264j4900589j2150345J2974624j2670555j1873665K3628846
688.6F35930634N216751K168731L412094N49698m86450K857895J0907669r041824j1009293
$$ y = [620452003, 651077499, 653976898, 627843475, 625289154, 625035439, 647453308, 653408432, 617076111, 605295296, 621938705, 661422806, 683984680, 660529861, 650655594, 648877792, 640508728, 650057831, 658515472, 649310608, 632717743, 632940941, 646732330, 641305008, 629166222, 631065025, 617979355, 614017715, 639655190, 645457001, 639444046, 642177505, 646991501, 648304214, 634451599, 624400787, 646946945, 653173599, 644479828, 635536690, 643999939, 647547913, 634825401, 632794228, 644923553, 645192413, 645041580, 653662033, 661711273, 659108582, 650922318, 636021729, 623871384, 636846008, 624175453, 612301788, 635930634, 641147385, 643316116, 646728210, 647277908, 646791458, 649649353, 660557022, 651515198, 640505905]
697.3F40505905L867645K424698p848167M746132P555847r052582K330856j521835
705F43008499j3955841j1624374J2017517K7583694J371689p331238r445190j184921
712.7F40439835J3407592j610336j1659012o403465n127754M668350K3315353J2044068
720.4F69074631j2525406j7610207R108162K8699570n950089j8722534j6208648j5393868
728.1F20471611P890511J6690521P075195k543030K236176Q439102Q455048R60159
735.8F69675293j2548981k050934J0186615l000488j1158752L011017J0602111N427704
743.6F70143585p248993j2971039M646531J1033859J062317r017105n992737j352539
751.3F50303879q567810J62658Q051682L354187L010940P5074p818299l794937M447098
$$ y = [640505905, 644373550, 646798248, 638950081, 643696213, 651252060, 642199478, 644530334, 643008499, 629052658, 617428284, 629445801, 657029495, 658401184, 651069946, 641624756, 640439835, 653847427, 652237091, 640578079, 634174614, 629046860, 633715210, 657030563, 669074631, 656549225, 638939018, 648047180, 676746750, 670796661, 652074127, 635865479, 620471611, 628362122, 645052643, 652127838, 649584808, 651820984, 660260086, 668715134, 669675293, 657126312, 655075378, 665261993, 662261505, 651102753, 654113770, 664715881, 670143585, 662894592, 649923553, 654570084, 665603943, 666666260, 657649155, 651656418, 650303879, 641736069, 641898727, 649950409, 653304596, 656315536, 656390610, 648572311, 644777374, 649224472]
760F49224472L911667M180145k253723n257187J548386l266068j1652069L715820J1348114
768.6F51499557r920349Q19397J0597840q852616L282776J5154724k455368l300705
776.4F56825256Q168946M136123n98526o663742m787750P033539Q969726J0355606
784.1F83439178m051437N1041J4901886m484329m415589m436874o686707L671112l489685
792.7F74498596K654114N224457n231171l696899O848602K2161560R878006j0426178
800.5G01911087o968536m527130l209076m936295j3090363K374039J8843231Q766938
808.2F99163895J2546997J9384536K91062j9150849k3554534M44870J1293029l074798
815.9F97344208R062423N305558q431473r65271J207733P806931M418487l276672m315872
$$ y = [649224472, 653136139, 657316284, 655062561, 649805374, 651353760, 648087692, 636435623, 640151443, 651499557, 641579208, 642398605, 652996445, 644143829, 647426605, 662581329, 660125961, 656825256, 664994202, 669130325, 668531799, 661868057, 657080307, 664113846, 673083572, 683439178, 679387741, 679438782, 694340668, 689856339, 685440750, 681003876, 674317169, 677988281, 674498596, 677152710, 682377167, 677145996, 673449097, 680297699, 702459259, 712337265, 701911087, 694942551, 690415421, 687206345, 682270050, 669179687, 671553726, 690396957, 699163895, 711710892, 731095428, 731386490, 712235641, 688681107, 689125977, 700419006, 697344208, 706406631, 711712189, 703280716, 702315445, 703523178, 711330109, 715748596, 712471924, 708156052]
824.6G08156052q343506n344467q17337O765747K132110j0336838j201019N264359
832.3F96275101J662292J0346527J2417984n568390j6572876o075820K758483j4922180
840F80321121k0902023l752289Q381882J2476501l155136j353836J3246460L80554
847.7F85643234n774154L414611J1171570M580612l403244j091842r471283j4614411
855.4F70455093l800888P118607J0262680O823120j786728J239700J908036o318894
863.1F85900726L595505m526825r194412R993133J433030Q90121P204437k99301L175125
871.8F98171539m66919O034317J3047028j491394k49710J724548j1349258q067703
879.5F97352448P227706M791794k881012K125321P470398P760391o539536r119796
$$ y = [708156052, 699812546, 694468079, 693650742, 700416489, 702548599, 692211761, 691010742, 696275101, 697937393, 708283920, 720701904, 715133514, 698560638, 692484818, 695243301, 680321121, 659419098, 655666809, 664048691, 676525192, 673370056, 672016220, 685262680, 685643234, 679869080, 683283691, 694455261, 699035873, 695632629, 694540787, 685069504, 670455093, 666654205, 673772812, 684035492, 690858612, 689071884, 690311584, 692219620, 685900726, 689496231, 684969406, 675774994, 685768127, 687201157, 688091278, 695295715, 694996414, 698171539, 697704620, 703738937, 716785965, 715294571, 715044861, 716769409, 705420151, 697352448, 704580154, 709371948, 706490936, 708616257, 716086655, 723847046, 717307510, 708187714]
887.3G08187714j65635j0880355o521454J507873r581909n431595Q176956r90676j2741700
895.9F71559219k104034J3019791J9850235m306488j1552124M927062j1069793q926468
903.7F71397400R71146n430603l835068R26132Q206863K218399J259461m873581r308243
912.3F61531906K777252o315612r447632k592926j441498J985702M658966P707444
920F58863602O382751J882935q585663q419724M515229J241455o884461j853256j986618
928.7F45156250o280746J430969k07672q468438j17492J4259071J4739227L354111
936.4F63865280m407348p593003m521484M085007J0239181O253967l792419m201813
944.2F59927368j440048M966965N109634o153336M70734O714554m865341q046341m442597
$$ y = [708187714, 708022079, 697141724, 690620270, 692128143, 682546234, 677114639, 685291595, 684300919, 671559219, 669455185, 682474976, 702325211, 698018723, 686466599, 691393661, 680323868, 671397400, 672368546, 666937943, 663102875, 664029007, 672235870, 674454269, 675713730, 670840149, 661531906, 664309158, 657993546, 648545914, 645952988, 644511490, 646497192, 651156158, 658863602, 665246353, 667129288, 658543625, 650123901, 654639130, 655880585, 648996124, 647142868, 645156250, 638875504, 640306473, 640098801, 631630363, 631512871, 645771942, 660511169, 663865280, 659457932, 651864929, 647343445, 651428452, 661667633, 667921600, 664129181, 659927368, 658487320, 663454285, 668563919, 662410583, 662881317, 669595871, 664730530, 656684189, 652241592]
952.8F52241592m651260l090820k819977j670609L237687Q30612l802872o42853n774994
961.5F33856506j1022186p81708L32718k868652k724724o976700r90982L23067l853340
970.2F05293999j659470m718361l199386K148170j343956p558212q724518k064247
977.9E78174019j73493o626739k228890L320427M350663K215194o657715j643600L935967
986.6E74665833m32930l182564J209793J900978j4334946j2453079K609406O915817
994.3E56898308L765259j926613q16956l679428k018776M473915O387673n2567p326813
1003E55704002k07977q90350j725579J008034J27335O310959J327133k934380r23118
1011.7E57796059p788506o007843m56047P7515K098045k211113m998703N772858J5703888
$$ y = [652241592, 647590332, 644499512, 641679535, 640008926, 643246613, 644077225, 640274353, 639631500, 633856506, 622834320, 622052612, 622385330, 619516678, 616791954, 609815254, 608824272, 609147339, 605293999, 603634529, 598916168, 595716782, 597864952, 596520996, 588962784, 580238266, 578174019, 578000526, 571373787, 569144897, 572465324, 576815987, 579031181, 572373466, 570729866, 574665833, 574232903, 571050339, 572260132, 574161110, 559826164, 547373085, 549982491, 556898308, 560663567, 558736954, 557919998, 554240570, 552221794, 556695709, 563083382, 563030815, 555704002, 555496025, 554605675, 552880096, 553888130, 554015465, 560326424, 561653557, 558719177, 557796059, 550007553, 543999710, 543543663, 543621178, 545719223, 543508110, 538509407, 544282265, 559986153]
1020.3E59986153R77134j4624138k494659N435524O740379j182o997299J368637m569741
1029E45820808k775001M533882k004738o88095N552979M806099R86633O871452L426781
1037.7E66530800L114891J431618r972039K62337O448670M414291o771050k787399
1045.4E62672119J4235993k602578o909446m67148m562378p96738L797112l205071
1053.1E62161865r690056J117592R225579J0850257k597923o963768P660942K879830
1060.9E74644318m274750N918350J6763687K017327n104523K034073l746453J930886
1068.6E90182915O037178N269890m60587r377937j709175M743385p174530j3620529
1076.3E73890610K484627l187218q592377M858017o49452o845703n447808O273957
$$ y = [559986153, 560963287, 546339149, 543844490, 549280014, 556020393, 556019211, 549021912, 550390549, 545820808, 543045807, 547579689, 545574951, 544886856, 550439835, 555245934, 556232567, 563104019, 566530800, 569645691, 571077309, 561105270, 561367607, 567816277, 572230568, 565459518, 562672119, 576908112, 574305534, 567396088, 566928940, 562366562, 561569824, 565366936, 562161865, 552471809, 553589401, 562814980, 573665237, 571067314, 564103546, 571764488, 574644318, 570369568, 576287918, 593051605, 595068932, 589964409, 591998482, 588252029, 590182915, 596220093, 601489983, 601029396, 591651459, 589942284, 594685669, 587511139, 573890610, 576375237, 573188019, 564595642, 569453659, 568804207, 561958504, 556510696, 562784653]
1084E62784653J2798691O40754k329063N346489J0538292P588768J069336p299385
1091.7E91138535r997559j475449k19650N84221J0332031N967179p850571n391159
1099.4E83087578K906341N622521M252014j178513l585815j239510R64623K856293
1107.1E93685532K298927l348465l275681M29993J986008K316437o784707j0814247
1114.9E76493797J273461Q766098O425552L908386m134102n430107O293717J1229057
1122.6F04825859K552643n977631K468033K622185m189453m47808m333839n443420
1130.3E92076569q20351O604881L668976l276596K173386M965629J1158600o11153
1138F15939941j0650978k810554j0553894m495011L654824j359368l63197j418915
$$ y = [562784653, 575583344, 576224098, 573895035, 579241524, 589779816, 597368584, 598437920, 591138535, 581140976, 579665527, 579445877, 580030098, 590362129, 596329308, 588478737, 583087578, 585993919, 591616440, 595868454, 594689941, 591104126, 589864616, 590829239, 593685532, 595984459, 592635994, 589360313, 589790306, 591776314, 594092751, 587308044, 576493797, 577767258, 586533356, 592958908, 596867294, 592733192, 587303085, 593596802, 604825859, 607378502, 601400871, 603868904, 606491089, 602301636, 601853828, 597519989, 592076569, 591256218, 597861099, 601530075, 598253479, 600426865, 605392494, 616551094, 615939941, 605288963, 602478409, 591924515, 587429504, 591084328, 589724960, 589361763, 587942848]
1145.7E87942848j780090k757912n148048O020736J1325226m096222j730537K453957
1153.4E92229958o411858l226852k835961o76231L820877J171913l368607K476273
1161.1E83179512Q329887j710090L20930J468773k037010J654320o420517m748078
1168.9E80037727J263314p00531R292946J2608413p38182l039627O836433J1916314
1176.6F17476807N636520m807930k351189K22016k036591K339897J535797K534905
1184.3F20550232J0509567O922417j814423J357308J391716j170006M106064J208343
1192F43061218k134552k666282m477539l624917P91398N951461j5335K617531R274635
1200.7F48777618N97458m594726k01035N097962o21338o548310n324096q52242N863838
$$ y = [587942848, 586162758, 583404846, 578256798, 584277534, 595602760, 591506538, 589776001, 592229958, 585818100, 582591248, 579755287, 579079056, 582899933, 584071846, 580703239, 583179512, 591509399, 589799309, 590120239, 591589012, 589552002, 591206322, 584785805, 580037727, 581301041, 580600510, 589893456, 602501869, 601763687, 598724060, 605560493, 617476807, 623113327, 618305397, 615954208, 616176224, 614139633, 616479530, 618015327, 620550232, 631059799, 637982216, 636167793, 637525101, 638916817, 637746811, 641852875, 643061218, 640926666, 638260384, 633782845, 630157928, 630949326, 636900787, 636885452, 639502983, 648777618, 649375076, 644780350, 644579315, 649677277, 649055939, 642507629, 637183533, 636331291, 642195129]
1209.4F42195129M046021J461639K167130K695007Q07495q6746J109543m545899k616577
1218F47232742J800080k1439J709976j57318N04227O017227R57031l194656M177627
1226.7F59025497L790665j867294l184891k977829m28924l790894n401535j503449
1234.4F43661346N81742O289215P717361j613922o994858j15814N642395L722763k60925
1243.1F58629303k244339k819824k377320J192627k725143l565521L179702M112854
1250.8F53382339Q113862L635559m373474j422730k381897j402435J989593l121032
1258.5F54419785o412507J152192O615371K898178J353455J373291N22156K771683
1266.3F64693604N472564L56827m804459n414734m272918J62887j159210L95737O061325
$$ y = [642195129, 646241150, 647702789, 649869919, 652564926, 653372421, 653285675, 654395218, 649849319, 647232742, 649032822, 649011383, 650721359, 650564041, 651068268, 657085495, 658042526, 654847870, 659025497, 662816162, 660948868, 657763977, 654786148, 654357224, 650566330, 645164795, 643661346, 644243088, 650532303, 658249664, 656635742, 649640884, 649525070, 655167465, 658890228, 658629303, 656384964, 653565140, 651187820, 652380447, 649655304, 646089783, 649269485, 653382339, 661496201, 665131760, 660758286, 659335556, 656953659, 655551224, 657540817, 654419785, 648007278, 649159470, 655774841, 658673019, 660026474, 661399765, 661921921, 664693604, 670166168, 670522995, 665718536, 660303802, 656030884, 656193771, 655034561, 655430298, 661491623]
1274.9F61491623N136413L978043l23791q87833J557693k063140k390595l83301k188186
1283.6F63926926l691407O38428L836746J084061p02667J656265K298660l880691m696579
1292.3F60469742J264419J653977k293930l921738J18561J604919o2561K237397L018341
1301F64089127J009140m54178j212540N06821j950760n460816q8501J671296j553498
1309.7F56556091M15726K273026r66797k760086N044403N614776j70212j399536m779739
1318.3F59827652l473816k429810m605484j675872j41449J445999L753891J515655
1326F54216766l27224O96792k95028p00379k451782k975159J472931j429214m434204
1334.7F43773499k621918m83704L633118L147278j484299m297562j750183r06830K734909
$$ y = [661491623, 666628036, 670606079, 670282288, 669394455, 670952148, 668889008, 666498413, 666115112, 663926926, 660235519, 660873947, 664710693, 665794754, 665092087, 666748352, 669047012, 665166321, 660469742, 661734161, 663388138, 661094208, 657172470, 657291031, 658895950, 658833389, 661070786, 664089127, 665098267, 664644089, 663431549, 663938370, 661987610, 656526794, 656438293, 658109589, 656556091, 656971817, 659244843, 658278046, 655517960, 660562363, 666177139, 666006927, 664607391, 659827652, 656353836, 653924026, 649318542, 647642670, 647501221, 648947220, 652701111, 654216766, 653889542, 654586334, 654291306, 653590927, 651139145, 648163986, 649636917, 648207703, 643773499, 641151581, 640667877, 644300995, 647448273, 645963974, 641666412, 639916229, 639009399, 641744308]
1343.4F41744308O583252j723175o832695j811676J529808J407242J992111K734452
1351.1F45623627K094803K79312j974411l34702J972962k178269o649361k782096J163902
1359.8F37215767n66483K969437K143517k684021J933746P59888l61863P59201l260421
1368.5F38908768q35610K58179o269341l100624J396714L99894M827500P333297M243470
1377.2F47162247K14386j142121j983413l408966m125252l152352O96106n50766j775627
1385.8F31934242P17964M071083M783593M598236L608475j128693j986237j107711
1393.6F45490952l607331j723709o78520l53546N70831j77994J113167K436447L970566
1402.2F47040863M65393n007324k698708J487084j910057m155159o90728J282845J57242
$$ y = [641744308, 648327560, 646604385, 639771690, 637960014, 639489822, 640897064, 642889175, 645623627, 647718430, 647997742, 646023331, 645688629, 647661591, 645483322, 638833961, 636051865, 637215767, 636649284, 639618721, 641762238, 639078217, 641011963, 641771851, 641409988, 642169189, 638908768, 638073158, 638331337, 632061996, 628961372, 630358086, 630757980, 635585480, 642918777, 647162247, 647376633, 646234512, 644251099, 640842133, 636716881, 633564529, 634260635, 633709869, 631934242, 632652206, 636723289, 641506882, 646105118, 649713593, 648584900, 646598663, 645490952, 641883621, 640159912, 639481392, 639127846, 639698677, 639520683, 640633850, 643070297, 647040863, 647506256, 642498932, 639800224, 641287308, 639377251, 635222092, 634531364, 635814209, 635971451]
1410.9F35971451L085937L684464j30005l481255k874908K342605R72023k690734k131424
1419.6F34748154J168899R84917k097283j927146L243064L481751j122093J37405L823052
1428.3F42440720k262040k474289M898453K097931j311416l447800l687744j742783
1436F34511032N721054K735901j095276J24588K647248J032867J100540L386536k745972
1444.7F47418518n476379k928467n347214m194984N182800N993538R96475L089600
1452.4F44733887L432693k66342J202774N50537J200485m739303j1166535k683677
1460.1F32264519M002266L091087K797661J327438o31714J838913J867218N031586
1467.8F51588974J259918k152557J32141p127609r932900N385170J0389099P139588
$$ y = [635971451, 639057388, 642741852, 642611847, 639130592, 636255684, 638598289, 639570312, 636879578, 634748154, 635917053, 636901970, 634804687, 632877541, 636120605, 639602356, 638480263, 638617668, 642440720, 640178680, 637704391, 642602844, 644700775, 643389359, 639941559, 636253815, 634511032, 640232086, 642967987, 641872711, 641997299, 644644547, 645677414, 646777954, 650164490, 647418518, 641942139, 639013672, 633666458, 629471474, 634654274, 640647812, 641644287, 644733887, 648166580, 647900238, 649103012, 649653549, 650854034, 646114731, 634948196, 632264519, 636266785, 639357872, 642155533, 643482971, 642851257, 644690170, 646557388, 651588974, 652848892, 650696335, 650828476, 643700867, 633767967, 639153137, 649542236, 656681824]
1475.5F56681824L294143Q68607K163620M041595N524674N571442j516572l997344
1483.2F72631989o28281J641846P31277j340790J889267O241608Q705826j424256j191101
1491.9F87257385K944565L373642K94189q826370n867538R360580L276367k585601
1499.6F89227219L143158N746765K834167K579651N339127P161255j8124390j3746719
1507.3F84160233J5167236L437500k258911m11225M242173L983459L111115J286697
1515.1G12718277k146912K062226J346969J492997k31781k70157O465530l130188l177414
1523.7G15129547l277969l292542L11890M864349O674118M488373K286072j338654
1531.5G25845184J693344k059249m928437P15943l307267q06961l359527k0413208
$$ y = [656681824, 659975967, 660844574, 663008194, 667049789, 672574463, 678145905, 676629333, 672631989, 672003708, 673645554, 674376831, 673036041, 674925308, 681166916, 689872742, 688448486, 687257385, 690201950, 693575592, 693869781, 685043411, 679175873, 688536453, 691812820, 689227219, 692370377, 698117142, 700951309, 703530960, 708870087, 716031342, 697906952, 684160233, 699327469, 702764969, 700506058, 700094833, 704337006, 708320465, 711431580, 712718277, 710571365, 712633591, 713980560, 715473557, 715241776, 714971619, 721437149, 718306961, 715129547, 711851578, 708559036, 708870926, 713735275, 720409393, 724897766, 727183838, 725845184, 727538528, 725479279, 720550842, 721266785, 717959518, 717152557, 713793030, 693379822]
1539.2F93379822J2455063J7118301J875458L613205N322723q91571k781219N1269
1546.9G30143051j894684l706512j902695L853378J322098J81809J187820K256851
1554.6G31441116J177826J723480K350007J976776j0224152j4385452J0810470O719819
1562.3G31589890J240310l602524o343460K992783M822464M386291N099411o926269
1570G33258896m325256K252578K905121J729584J600494n411911q999634O417084K575379
1578.7G32002335K211303m02450j318589J150895o23093j859741k693482j714096n79910
1587.4G26173172k9984J488877J698150q12225l363953n17501R14840K502289n48324
1596.1G27505341m918595k195205l597947j961822j143341j609040j47171k433548
$$ y = [693379822, 705834885, 722953186, 724828644, 728441849, 733764572, 732873001, 730091782, 730143051, 728248367, 724541855, 722639160, 726492538, 727814636, 727996445, 729184265, 731441116, 732618942, 734342422, 736692429, 738669205, 728445053, 714059601, 724870071, 731589890, 732830200, 729227676, 722884216, 725876999, 730699463, 735085754, 740185165, 733258896, 728933640, 731186218, 734091339, 735820923, 737421417, 732009506, 723009872, 729426956, 732002335, 734213638, 733811188, 732492599, 733643494, 733020401, 731160660, 728467178, 726753082, 726173172, 726143188, 727632065, 729330215, 728517990, 725154037, 724636536, 725551376, 728053665, 727505341, 722586746, 720391541, 716793594, 714831772, 713688431, 712079391, 711932220, 709498672]
1603.8G09498672j282501o23245J908340J532288q57010k945251m754563k244873m206543
1612.5F96025314r24301O57273R3612k285766p362366O514053K000656l301849m811783
1621.1F86604843k393646m426804l739700L490524l914032l518524Q7433J838226j12762
1629.8F73915558m183197j510315r7504J215515K931214n496369k47268K069244o468277
1638.5F62128601k954330P75451L19519L261185J385422j18256k56500k376709k111740
1647.2F60052643J540603L600617k289505O43463K560349j9005661L293838R204178
1654.9F59600525M758911K500839J493302p49970Q80585L835678M239731J64490p340088
1663.6F69384003J440811R28039K421952N496826R53140J359329K105408J777954K150421
$$ y = [709498672, 708216171, 707592926, 709501266, 711033554, 710176544, 707231293, 702476730, 700231857, 696025314, 695101013, 695758286, 695851898, 693566132, 686203766, 692717819, 694718475, 691416626, 686604843, 684211197, 679784393, 676044693, 679535217, 675621185, 672102661, 672190094, 674028320, 673915558, 669732361, 668222046, 668124542, 669340057, 672271271, 666774902, 666527634, 668596878, 662128601, 659174271, 659949722, 660269241, 663530426, 664915848, 664797592, 664541092, 662164383, 660052643, 661593246, 665193863, 662904358, 663547821, 666108170, 647102509, 650396347, 659600525, 664359436, 666860275, 668353577, 667603607, 668484192, 672319870, 676559601, 676724091, 669384003, 670824814, 671752853, 674174805, 679671631, 680624771, 681984100, 684089508, 685867462, 688017883]
1672.3F88017883L33329j852265n014114m37088L630371N121307K143936J976929K715836
1680.9F96636124M979095J3068085J2056656j7861176m718017K264785J687394j581879
1688.6G06531067K362289J849213j95694J100540K785263M038544k866745p435761
1696.4G08168716Q925858N473633P471542Q068466j9515152L072281J561051J512146
1704.1G24738541N833358Q30079J344146O042481K406692j400223j17263R72824R6740
1712.8G40747375K73438j022949K550888L168487k420349n404815M606552N184784
1720.5G47683411L425598L017807P07092j688309m20227P51114P38526j948471n27802
1729.1G51738739Q55179M584656O847229m21677j3438110k88239R072800L010940r12246
$$ y = [688017883, 688351212, 686498947, 681484833, 681047745, 684678116, 689799423, 691943359, 693920288, 696636124, 701615219, 714683304, 726739960, 708878784, 704160767, 706425552, 708112946, 706531067, 708893356, 710742569, 710546875, 711647415, 714432678, 718471222, 715604477, 708168716, 717094574, 722568207, 730039749, 738108215, 718593063, 721665344, 723226395, 724738541, 730571899, 731401978, 732746124, 738788605, 741195297, 739795074, 739677811, 740650635, 740747375, 741020813, 739997864, 742548752, 745717239, 743296890, 737892075, 742498627, 747683411, 751109009, 754126816, 754833908, 753145599, 752725372, 753476486, 754215012, 752266541, 751738739, 752593918, 757178574, 764025803, 763604126, 750166016, 749877777, 758950577, 761961517, 761049271]
1737.8G61049271J92871k911530k568664J005096K147751K308731J494064L225479
1745.5G65943069K071457J793976j92032R28421L421860m151382m633255L471222L283538
1754.2G71936874j272506j609803J835633K699585j352692j85242O108704j758575
1761.9G76401978n322419K172089K503967J09482j655045J787034j483307k51236M724045
1770.6G78986588M920654l078690n187073M232789J050643k806396j395111k116928
1778.3G74606476J717605L23410k076873K166290M087219K165222k052459j021729
1786G79915161J212845J42899j520386j724472k527771k654038m12140O526184M918213
1794.7G83876495J077118L66669M34418M53720k110977L43475J720581m654541K94571
$$ y = [761049271, 761242142, 758330612, 755761948, 756767044, 758914795, 761223526, 762717590, 765943069, 768014526, 769808502, 769616470, 770544891, 773966751, 769815369, 765182114, 768653336, 771936874, 770664368, 769054565, 770890198, 773589783, 772237091, 772051849, 778160553, 776401978, 771079559, 773251648, 775755615, 775865097, 774210052, 775997086, 774513779, 774262543, 778986588, 783907242, 780828552, 775641479, 779874268, 780924911, 778118515, 776723404, 774606476, 776324081, 776647491, 774570618, 776736908, 780824127, 782989349, 780936890, 779915161, 781128006, 781270905, 779750519, 778026047, 775498276, 772844238, 772432098, 778958282, 783876495, 784953613, 785320282, 785754700, 786208420, 784097443, 784440918, 786161499, 781506958, 781801529]
1803.4G81801529K070618p14341k23083K29797L205261L231736L58810j788025j69372
1812.1G88002930r20029p69272r81750l681412J89361J508179J098175J728287O62918
1820.8G86837387J775208J554565K087936J666184n153656l577118Q93326n52445k170715
1829.4G83360672k299728k09198L971023L613510M96140O39419Q88443O74515J513596
1838.1G92648392J296692l020478m330902l470993n31387J418533k640686K917481
1845.8G84286652N445175Q45489m132080J84937K538147o66580p32346m54712n79453
1854.5G86735229j554183N0201K258758J118012K152328j23291r04617J169281j616592
1863.2G89285126q26111J763687j642837l640290l67660o24314q72039K864151L461227
$$ y = [781801529, 783872147, 783157806, 782934723, 783164520, 786369781, 789601517, 789960327, 788172302, 788002930, 787082901, 786313629, 785331879, 781650467, 781839828, 783348007, 784446182, 786174469, 786837387, 788612595, 790167160, 792255096, 793921280, 788767624, 785190506, 786083832, 785531387, 783360672, 781060944, 780851746, 784822769, 788436279, 788932419, 789571838, 790460281, 791134796, 792648392, 793945084, 790924606, 786593704, 783122711, 782591324, 784009857, 781369171, 784286652, 789731827, 790577316, 786445236, 786630173, 789168320, 788501740, 787769394, 787314682, 786735229, 785181046, 785231247, 787490005, 788608017, 790760345, 790637054, 789732437, 790901718, 789285126, 788459015, 790222702, 788579865, 784939575, 784571915, 783947601, 783075562, 785939713, 789400940]
1871.9G89400940l3646q5296J779251j28937r08051k662887j318588J223907j065369
1880.6G86201324q83102J057587J954498l83911l03116K514114K46201J32751n11016
1889.2G90025330m460679R01948K965240m01535l90549j131515j377182m31137m0970
1897.9G85658951L766937J914597j835938j277542k71988K32849r19342r41696m89197
1906.6G85837631K403183K983856l11660j708527j751862Q84705O10657N84183n27268
1915.3G89004898k047577J784744j110229l026199Q32977J234817O00281n74341p553
1923.9G86691818M98963J192093J87454p57141j26267j050262j424027j590805l78342
1932.6G83243484J130295J621628K177506r4376k273712r31320P98797J349106J703110
$$ y = [789400940, 789367294, 789281998, 791061249, 790932312, 790024261, 787361374, 786042786, 787266693, 786201324, 785318222, 786375809, 788330307, 787946396, 787643280, 790157394, 790403595, 790536346, 790025330, 785564651, 786466599, 789431839, 789030304, 788639755, 787508240, 786131058, 785699921, 785658951, 789425888, 791340485, 789504547, 788227005, 787955017, 788187866, 787268524, 786326828, 785837631, 788240814, 791224670, 790913010, 789204483, 787452621, 788337326, 788947983, 789532166, 789004898, 786957321, 788742065, 787631836, 784605637, 785438614, 786673431, 787273712, 786699371, 786691818, 787190781, 788382874, 788570328, 787813187, 787686920, 786636658, 785212631, 783621826, 783243484, 784373779, 785995407, 788172913, 788078537, 785804825, 784873505, 785672302, 787021408, 788724518]
1941.3G88724518l22190l613662m84085N16662j511612L29361J280747K022018K998123
1950G89939880n25360j688080j855163j841431l05939N35126N89447j335754P91778
1958.7G84304504J660691M7226J049041Q71430K071915k51694k678910j083679o54144
1967.3G85336380Q1558k07596K6474k43225M23432J982879p97653j726074J149521
1976G86025696O26907j263580L11203L55224p55539q61206j692962o27518P02362J395264
1985.7G84215851K446594J887894k54288j311645j510697k832718l262100N97992K950516
1994.3G82927399L40957j059723K43531Q08716k82135m13209Q97217J92948K404861
2003G86060562M00849l394547l89938r68552k19345O28204k019348j303940K11335
$$ y = [788724518, 788402328, 784788666, 784304581, 784821243, 783309631, 783638992, 784919739, 786941757, 789939880, 789414520, 787726440, 785871277, 784029846, 783723907, 784259033, 784848480, 783512726, 784304504, 785965195, 786012421, 787061462, 787932892, 790004807, 789753113, 787074203, 785990524, 785336380, 785417938, 785210342, 785236816, 784993591, 785417023, 787399902, 786602249, 784876175, 786025696, 786652603, 785389023, 785700226, 786055450, 785299911, 784438705, 782745743, 782118225, 782820587, 784215851, 786662445, 788550339, 788296051, 786984406, 785473709, 782640991, 779378891, 779976883, 782927399, 783268356, 782208633, 782452164, 783260880, 782978745, 782565536, 783462753, 783655701, 786060562, 786461411, 783066864, 782676926, 781708374, 781489029, 782117233, 780097885, 778793945, 779005280]
2011.7G79005280J287384O21643r07593m88053P55997q69293j303482P1945q03299
2020.4G77370529j23215o17218p32955O19888J206894J718597j600952l764801j451416
2029.1G72625351J221161L91693p11899K169495R90600l810577j937256K287293P79495
2037.7G74005356j65329N43060j017761j097870N76553Q64106j218872j997223K136
2046.4G70494156P23190j257324j231308J072235M68598j399537j092987J477738N77545
2055.1G69832306k234879j458740j37176J78451L24249K630921J213302j267089O15539
2063.8G69696884R21936J278382J57089o80695j661835j898193O61926k051696k810822
2072.5G63612976J615295K656479L7995q0033P91703M75006J000519j664963o23932
$$ y = [779005280, 780292664, 780914307, 780006714, 779518661, 780274658, 779405365, 778101883, 778173828, 777370529, 777247314, 776630096, 775897141, 776517029, 777723923, 779442520, 777841568, 774076767, 772625351, 773846512, 774238205, 773526306, 775695801, 776686401, 772875824, 770938568, 773225861, 774005356, 773840027, 774383087, 773365326, 772267456, 772844009, 773708115, 772489243, 770492020, 770494156, 771217346, 769960022, 768728714, 769800949, 770269547, 768870010, 767777023, 769254761, 769832306, 767597427, 766138687, 766001511, 766179962, 766504211, 769135132, 770348434, 769081345, 769696884, 770618820, 771897202, 772054291, 771373596, 769711761, 767813568, 768475494, 766423798, 763612976, 765228271, 767884750, 767922745, 767842712, 768634415, 769109421, 770109940, 768444977, 767821045]
2081.1G67821045k10114k161560J291352Q2626n17578J973877J462860l1204j397934
2089.8G68313370L07464L74375n06821J93405r83581l95890J098862r80148q88672
2098.5G66532364Q25348m49143R11713J812897K26364L25546j264877k421036r20486
2107.2G65578690q54340K79846K536545j64108j966172K14768P83844j49384K96936
2115.9G66556625J390839o72379k84957N645k778854k67334J234589o12641l50494
2124.5G64221039J441345Q93326p66297P72934J3733p72323J011581j016159k718887
2133.2G63080292M39453P49435j122360J621704L537216J853333k060928j726075J564865
2141.9G67936935k352676l334885O7826q53272r45816L48587J31912P07932K859726
$$ y = [767821045, 767610931, 765449371, 766740723, 766823349, 766305771, 768279648, 769742508, 769711304, 768313370, 768620834, 768995209, 768488388, 768681793, 767698212, 767302322, 768401184, 767421036, 766532364, 767357712, 766908569, 767820282, 769633179, 769859543, 770185089, 768920212, 766499176, 765578690, 764724350, 765004196, 767540741, 767376633, 765410461, 765625229, 766409073, 766259689, 766556625, 767947464, 767275085, 766990128, 766995773, 764216919, 763949585, 765184174, 764571533, 764221039, 765662384, 766555710, 765789413, 766562347, 766576080, 765803757, 766815338, 765799179, 763080292, 763519745, 764269180, 763146820, 764768524, 768305740, 770159073, 768098145, 766372070, 767936935, 765584259, 762249374, 762317200, 761463928, 760518112, 760866699, 760998611, 761706543, 764566269]
2150.6G64566269J700439j488418r94263L16239l62397r71832M04739M34494m68368
2159.3G63136902J259994j496200k491989L275604K170410l96576j057129r36584L047790
2167.9G66512222J626892j255874j411591m34494P07321q49533K17438J247253Q66852
2176.6G67226486o8817p79419J520996J99585j809845L60565J96991j399612k27127
2185.3G65219803P32040K530899L242493J210403O45676j019363o88782O02646j392212
2194G71083603k740326r29184R20486j462783n14145J221924P19909K303849K632293
2202.6G73235626K432404l88794j809998o99997l14102M43649j54190n78613k342224
2211.3G69823761j738434N04837L26004J118012K222366J382446r2010R98306J97525
$$ y = [764566269, 766266708, 764778290, 763784027, 764100266, 763737869, 762766037, 763170776, 763605270, 763136902, 764396896, 762900696, 760408707, 763684311, 765854721, 765458145, 764401016, 763464432, 766512222, 768139114, 766883240, 765471649, 765037155, 765744476, 764894943, 765112381, 766359634, 767226486, 767157669, 766378250, 767899246, 768098831, 766288986, 766649551, 766846542, 765446930, 765219803, 765951843, 768482742, 771725235, 772935638, 773581314, 772561951, 771873169, 772475815, 771083603, 768343277, 767414093, 768334579, 766871796, 766357651, 767579575, 768299484, 770603333, 773235626, 775668030, 775279236, 773469238, 772769241, 772455139, 772898788, 772744598, 772165985, 769823761, 768085327, 768590164, 768916168, 770034180, 772256546, 773638992, 773546982, 774545288, 774742813]
2220G74742813p96280j648254k428971J019669J858902Q46634j188583L91311L459778
2228.7G76257019r75265l492585j402206J654510O48194j108704R92203J700745R66339
2237.4G75240250p01142L75824J549073O73370l05710o03332N59768j90048l53165
2246G76244888j253357j874923n55573N63355M65240k426300n47104K976685R26437
2254.7G74519348q90274J187363J885605r04999r25751o64520j622925M86298J946869
2263.4G75017014J7623J382294K435532j323929j59073J251144j452941j995011O48880
2272.1G75821533J977692j048279l001327k185517Q17414K993011K667313P62786j707382
2280.8G77097244q64410J397705R04999k431946q61206O48727j371383O73751K248230
$$ y = [774742813, 773946533, 772298279, 769869308, 770888977, 772747879, 773594513, 772405930, 772797241, 776257019, 775281754, 771789169, 770386963, 772041473, 772689667, 771580963, 772573166, 774273911, 775240250, 774539108, 774914932, 776464005, 777137375, 776831665, 776228333, 776788101, 776598053, 776244888, 774991531, 773116608, 772561035, 773124390, 773589630, 771163330, 770616226, 773592911, 774519348, 773629074, 774816437, 776702042, 775797043, 774871292, 774206772, 772583847, 773070145, 775017014, 775034637, 776416931, 778852463, 777528534, 777369461, 778620605, 777167664, 775172653, 775821533, 777799225, 776750946, 773749619, 771564102, 772381516, 775374527, 778041840, 778804626, 777097244, 776232834, 777630539, 778535538, 776103592, 775242386, 775891113, 774519730, 775193481, 777441711]
2289.4G77441711J505814q76923N70298J167450j222306L04947j581650j916046m11377
2298.1G74981918J591187N33447j711578K081756N5085Q31756J487351j799317M9820
2306.8G78101425p63092j065216j104431J205368N14831m601516k671738K397385L758163
2315.5G75771179k81296K21024Q96759L39890m22135n977630l947678J397476N399170
2324.2G73396759J093063k549286l85742k057647J238021L789826L395462j956863
2331.9G75963593k087021L021316o17447k335205k996139j37863q1482n06745K520142
2340.6G72743149R66263j793595q74405N905609l65753n045166J600037J593017k059783
2349.2G72669373m279709j23139M089585O256027N04532j0689850L1891P615280o75202
$$ y = [777441711, 778947525, 778070602, 778640900, 779808350, 778586044, 778890991, 777309341, 775393295, 774981918, 776573105, 777106552, 775394974, 777476730, 777531815, 778363571, 779850922, 778051605, 778101425, 777338333, 776273117, 775168686, 776374054, 776888885, 772287369, 769615631, 772013016, 775771179, 775489883, 775710907, 776607666, 776947556, 776525421, 770547791, 766600113, 767997589, 773396759, 774489822, 771940536, 771554794, 769497147, 770735168, 774524994, 777920456, 775963593, 773876572, 776897888, 776280441, 773945236, 770949097, 770811234, 770729752, 770223007, 772743149, 773709412, 771915817, 771041412, 776947021, 776581268, 771536102, 773136139, 774729156, 772669373, 768389664, 768266525, 772356110, 778612137, 779116669, 768426819, 768458710, 776073990, 775398788]
2357.9G75398788l339538M577026K485352j1826401j3681793m064942N518952O649475
2365.6G61716919K917862k247162J352921M891815m43726m337082l939667K578888
2373.3G62490768K784043J004181N77087P99484L063507j766967j772461Q58383J270447
2382G69308472J911926o39114L24707j267167j804046J705856q86307k581329j306152
2390.7G64766846K86636J425171R89914K70767Q00171N56183k122879m4937J447754
2399.4G68375626j831971k011795M89045J792449P6218n06286O81686J18256k70310
2408.1G66912918j25656j241608j378555J23672j037063j757736R8343J063995N92956
2416.7G63251266m06875J52054N74875J61666k68631m53567n80139j435471r55124
$$ y = [775398788, 772059250, 776636276, 779121628, 767295227, 753613434, 749548492, 755067444, 761716919, 764634781, 762387619, 763740540, 768632355, 768188629, 763851547, 759911880, 762490768, 765274811, 766278992, 766856079, 767655563, 770719070, 768952103, 767179642, 768038025, 769308472, 771220398, 770581284, 770905991, 769638824, 767834778, 769540634, 768654327, 766072998, 764766846, 765053482, 766478653, 767468567, 767739334, 768539505, 769095688, 766972809, 766927872, 768375626, 766543655, 764531860, 765020905, 766813354, 766889572, 766383286, 767064972, 767183228, 766912918, 766787262, 765545654, 764167099, 764290771, 763253708, 761495972, 761594315, 762658310, 763251266, 762844391, 762996445, 763571320, 763732986, 763464355, 763010788, 762430649, 760995178, 760040054]
2425.4G60040054j291351k148514l25546K154083R11865j908035r51080j84403L98178
2434.1G56695251J591568J851578J63651k332764K03781n60989k053909J189575L71322
2442.8G57119064n3939M08172L27072j753692l527604M95072J302795j1215p52792
2451.5G53552933j520233o69785J44730J269989K15072j87835j311570j317825P45926
2460.1G50921402k159500j761627N67779N08423J05057k512818j035766K873001K556457
2468.8G50062408o74285n27497J287308j217575k430496j398697j217652p67288n90896
2477.5G42525330o80466J097183J958313L5553R49020J915818M50973j24817o67266
2486.2G47459641j796723j719971k27279n70069j58157J17188r01948k22702o66656
$$ y = [760040054, 758748703, 756600189, 756274643, 758428726, 759340591, 757432556, 756481476, 756297073, 756695251, 758286819, 760138397, 760302048, 757969284, 758173065, 757612076, 755558167, 756747742, 757119064, 757065125, 757473297, 757800369, 756046677, 752519073, 753014145, 754316940, 754305725, 753552933, 752032700, 751362915, 751507645, 752777634, 752992706, 752804871, 751493301, 750175476, 750921402, 748761902, 747000275, 747568054, 748076477, 748181534, 745668716, 744632950, 747505951, 750062408, 749388123, 748860626, 750147934, 748930359, 746499863, 745101166, 743883514, 743116226, 742525330, 741844864, 742942047, 744900360, 744935913, 745884933, 747800751, 748251724, 748126907, 747459641, 745662918, 743942947, 743715668, 743145599, 742987442, 743104630, 742202682, 741979980, 741313324]
2494.8G41313324P07474J267700p11594r17206j195068p52029q02918K37046O81839
2503.5G39828568P247J796418m2725j285782P33338N13382q45795k251129j24741K933731
2513.2G41262512R90830j354065q28171p66068j156997r07364O39114K552185J448822
2521.9G41880798k44522j812973j851501p06177k853622q60215K460480j50680L9291
2530.5G35900879J131439j039505j083450j055222n63659J231994n37948j614151j50071
2539.2G32220306J098633R01261j572190j062317M0131l18146Q49991P32803M50211
2547.9G33340683P91626j35040j536866j088562j131362k988282j492004J336746J554337
2556.6G28651276J480484J830825o21185j857605P7362o26907p24411o10581o62231
$$ y = [741313324, 742020798, 743288498, 742576904, 741659698, 740464630, 739712601, 738909683, 739146729, 739828568, 739835815, 741632233, 741589508, 740303726, 741037064, 741550446, 740704651, 738453522, 738328781, 741262512, 742253342, 740899277, 740071106, 739305038, 738148041, 737240677, 737879791, 740431976, 741880798, 741636276, 739823303, 737971802, 737265625, 734412003, 733551788, 736012268, 735861588, 735900879, 737032318, 735992813, 734909363, 733854141, 733290482, 734522476, 733984528, 732370377, 732220306, 733318939, 734220200, 732648010, 731585693, 731625824, 731307678, 732157669, 732890472, 733340683, 734132309, 733997269, 732460403, 731371841, 730240479, 727252197, 725760193, 727096939, 728651276, 730131760, 731962585, 731341400, 729483795, 729561157, 728934250, 728209839, 727599258, 726937027]
2565.2G26937027L39508o80466r88998q24814M95987l28140k168274J260376J901626
2573.9G25943832n1879j77842k51770j027145k103577m91333O35224N75027J188736
2582.6G24239273j57547j261825R67483J524506j903992k050705P59506j15280j827927
2591.3G20173492K09961L95203j189499m5929l31573R02176K356643l47214j977615
2600G20145645r95254J785049J153641k402725l507538k076645J254425J658096N60532
2608.6G17575226R15375P31659r94416k723312L14331K741928k84042l075104k510681
2617.3G12690964R46579K730560Q32520r87626k462234k461014k85187R1019p74155
2626G10321426j138534k15683R47876j98593q50830j225663l87649R56879q48694o22406
$$ y = [726937027, 727276535, 726596069, 725607071, 724782257, 725278244, 724950104, 722781830, 724042206, 725943832, 725891953, 725714111, 725462341, 724435196, 722331619, 721840286, 722475510, 723050537, 724239273, 724081726, 722819901, 723787384, 725311890, 723407898, 721357193, 722116699, 722001419, 720173492, 720383453, 720778656, 719589157, 719543228, 719211655, 720113831, 722470474, 722123260, 720145645, 719150391, 720935440, 722089081, 719686356, 716178818, 714102173, 715356598, 717014694, 717575226, 718490601, 719222260, 718227844, 715504532, 715818863, 718560791, 718276749, 715201645, 712690964, 713637543, 716368103, 717200623, 716212997, 713750763, 711289749, 711004562, 711095581, 710321426, 709182892, 708967209, 709915085, 709716492, 708865662, 707639999, 707252350, 708209229, 707360535, 706738129]
2635.6G06738129J316147K85110j618042j81885J636429K06528j607819l573913k590409
2644.3G00610275j16119L86200O48880q93402r17435P16248J243286J4496l049698
2653F98642731l315049n54733K029724R25141j177903L30582J544647p6370k488556
2661.7F95860214j348953K25067q65631J194153J957550j802597j619339R3002j286392
2670.4F92407074l20129O62307j356659o24847J254425j32370r39484P72019j91727
2679F91530609l176346j670608J427994J043777J25198k59857m88128n86777q73413
2687.7F87072449J169662J339874j729507k640152j362915J111526P66678j41296J701050
2696.4F87287369m27475k184906N44662j34353j152420L1738j685028j071015k98156
$$ y = [706738129, 708054276, 708339386, 706721344, 706539459, 708175888, 708382416, 706774597, 703200684, 700610275, 700494156, 700880356, 701529236, 700635834, 699718399, 700434647, 701677933, 701692429, 698642731, 695327682, 694772949, 696802673, 697727814, 696549911, 696880493, 698425140, 698348770, 695860214, 694511261, 694736328, 693870697, 695064850, 697022400, 695219803, 693600464, 693693466, 692407074, 692086945, 692749252, 691392593, 690767746, 692022171, 691889801, 690950317, 691722336, 691530609, 688354263, 686683655, 688111649, 689155426, 689280624, 689020767, 688532639, 687945862, 687072449, 688242111, 689581985, 687852478, 685212326, 683849411, 684960937, 685727615, 685586319, 687287369, 686859894, 684674988, 685219650, 685085297, 683932877, 683964615, 682279587, 681208572, 680910416]
2705.1F80910416j818695k87400J035233J903763Q73565K49253n91050k598800R93805
2713.8F80670090J349029q27026j969910k416916l93829j066895Q73719Q08792j475983
2722.4F75551071j650696j012344K500992K20337l7003K045212j348572k459259k127151
2731.1F71682587J83487J781311O11343p65915j451187j279449R90219L957367K7618
2739.8F75737381k624588j163559o18744q74786k535172o02493N30319R20563J246719
2748.5F70015640o92825k8839l1128o41937k62909K92434p45697k641830j486816L66592
2758.1F64142685J379623l93753k343979O20499L134232l4638k115478j397400r92661
2766.8F61999130K361374R01489l342590r46045J504746J163177j152115k156677l34320
$$ y = [680910416, 679091721, 678804321, 679839554, 681743317, 682616882, 682866135, 682275085, 679676285, 680670090, 682019119, 681192093, 679222183, 676805267, 676411438, 675344543, 676218262, 677027054, 675551071, 673900375, 672888031, 675389023, 675609360, 675572357, 677617569, 676268997, 673809738, 671682587, 671866074, 673647385, 674258728, 673492813, 672041626, 670762177, 671752396, 675709763, 675737381, 673112793, 671949234, 671330490, 670455704, 667920532, 667318039, 667848358, 668768921, 670015640, 669322815, 669293976, 669262848, 668620911, 668358002, 668650436, 667904739, 665262909, 663776093, 664142685, 665522308, 665128555, 662784576, 663405075, 666539307, 666504669, 664389191, 662991791, 661999130, 664360504, 665261993, 661919403, 660973358, 662478104, 663641281, 662489166, 660332489, 659998169]
2775.5F59998169N02548O93512J131745N61447r2774j059952k395248L83835J243896
2784.2F60967178j636810j476898K60620J712799r27353l093338p63245J95084n94101
2792.8F54643936l61175P35931L26614J43662j062241j193466j79825j465606P73391
2801.5F52361221J329727m79354j696015l256912K37732J665344k12173J47476L34015
2810.2F50431061k08283n32608k19955j466522k473679r71832R20868J618957J110153
2818.9F48208160p71942l058014j646804k16980j494980j506348j159706M4632J033897
2827.6F39431915k67219r07250j086960q64944L46870J538659J602668j648788k663040
2836.2F35481911k53601o42052n40505j23977p59545O02227j00365k654877j610565
$$ y = [659998169, 660500717, 661194229, 662325974, 662887421, 662794647, 661734695, 659339447, 659723282, 660967178, 659330368, 657853470, 658114090, 659826889, 658899536, 655806198, 655042953, 655238037, 654643936, 654282761, 655018692, 655345306, 655488968, 654426727, 653233261, 653053436, 651587830, 652361221, 653690948, 653211594, 651515579, 648258667, 648496399, 650161743, 649949570, 650097046, 650431061, 650222778, 649690170, 649470215, 648003693, 645530014, 644558182, 645479050, 647098007, 648208160, 647436218, 644378204, 642731400, 642514420, 641019440, 639513092, 638353386, 638398018, 639431915, 639164696, 638257446, 637170486, 636305542, 636652412, 638191071, 639793739, 638144951, 635481911, 635228310, 634586258, 634045753, 633921776, 633162231, 633764458, 633664093, 631009216, 629398651]
2844.9F29398651l41682r42459j488686j813355J218682K067108j344223k967758l093262
2853.6F20693016J41869J769523K58179j324234k396240j262665j804657j119614k71034
2862.3F14684143J682282J742363m399186k334213J836090O14357j122360j291046
2870F11412430n2567l423614j680756K169113j050453k410736j296387j164627j079216
2878.7F01423187Q68378m78935j971894M45481M60701P5149j154365j245613r47419
2887.3E97474670k145118O36902J659698o04706j007538m54559m20723L38860k7542
2896E95449944k707482j659279J83831J25885J266861K74734j266441l34587O9694
2904.7E91403160j198006j956253P55844K385026j356736j114120Q36754k729950k839966
$$ y = [629398651, 629056969, 628114510, 626625824, 624812469, 626031151, 628098259, 626754036, 623786278, 620693016, 620834885, 622604408, 622862587, 621538353, 619142113, 617879448, 616074791, 614955177, 614684143, 616366425, 618108788, 613709602, 611375389, 613211479, 613825836, 612703476, 611412430, 611359863, 607936249, 606255493, 608424606, 607374153, 604963417, 603667030, 602502403, 601423187, 602291565, 601812630, 599840736, 600286217, 600746918, 600822067, 599667702, 598422089, 597474670, 595329552, 595966454, 597626152, 597021446, 596013908, 595559349, 595138626, 595477486, 595449944, 592742462, 591083183, 591267014, 591392899, 592659760, 592934494, 591668053, 591333466, 591403160, 590205154, 588248901, 589004745, 591389771, 590033035, 588918915, 589755669, 587025719, 584185753]
2913.4E84185753J95541J355438K96937r79805j93253j325302j548615o62155l99208
2922.1E80925331Q22487j39122j071396j458778r64470R68971O65741L29132J636582
2930.7E81714478J171226k458992k875290O09093K280922K582588m10156j517411J273041
2939.4E82369499k62527m74739Q50753q53080J20315J567040J988334K225647N81971
2948.1E88113213R63363J782074J103478J207657r29337k395439J77536K407074K829971
2956.8E95259590R83238j15738K027398K439727L6049j207885q96454r16138J246185
2965.5E98855972L634796J198006j393127L0822K518464J648941K71263J620331J87530
2974.1F08572998j486244J487999K378959n3367n21088n71976j13601Q11348k05307
$$ y = [584185753, 584381294, 585736732, 586033669, 585053864, 584860611, 583535309, 581986694, 581324539, 580925331, 581747818, 581608696, 580537300, 579078522, 578114052, 579083023, 579748764, 580077896, 581714478, 582885704, 580426712, 577551422, 578160515, 580441437, 583024025, 582613869, 581096458, 582369499, 582106972, 581632233, 582482986, 581629906, 581750221, 583317261, 585305595, 587531242, 588113213, 589076576, 590858650, 591962128, 593169785, 592240448, 589845009, 590022545, 592429619, 595259590, 596242828, 596127090, 598154488, 600594215, 600630264, 599422379, 598525925, 597609787, 598855972, 602490768, 603688774, 602295647, 602326469, 604844933, 606493874, 606765137, 608385468, 608572998, 607086754, 608574753, 610953712, 610900345, 610379257, 609807281, 609693680, 610505028, 610299721]
2982.8F10299721L99284J060867R26400L184738J919975k154655j682816M76341J375008
2991.5F15804863Q09212j078606r78203n89180J83144K151527M11721j373673N9509
3000.2F15400314P23992q81806q97064K083283J674308m88357r68170j176949k80189
3008.8F15189362Q64677J978683O22559k343063j541634J560326R47418k544212j855355
3017.5F12878761M82827J345176J401749j957131l555984q2665J466256r97391k050476
3026.2F08931122N45311J703682p16744r11178Q5029k041130j003494P15752j544876
3034.9F05763474k179642k026520o35262J280747K4033q71048q00019n378j98517r74274
3044.5E99377594M40559o59332k378693j015281M60624r346p59086M0779O5269m6196
$$ y = [610299721, 610699005, 611759872, 612686272, 615871010, 617790985, 615636330, 613953514, 614429855, 615804863, 616614075, 615535469, 614557266, 613968086, 614151230, 616302757, 616714478, 615340805, 615400314, 616124306, 615242500, 614345436, 616428719, 618103027, 617614670, 616646500, 615469551, 615189362, 616054039, 618032722, 618655281, 616312218, 614770584, 616330910, 617278328, 614734116, 612878761, 613361588, 614706764, 616108513, 614151382, 610595398, 610512733, 611978989, 610981598, 608931122, 609476433, 611180115, 610463371, 609552193, 609637222, 607596092, 606592598, 607308350, 605763474, 603583832, 601557312, 600922050, 602202797, 602226830, 601355782, 600555763, 600550385, 600351868, 599377594, 599818153, 599158821, 596780128, 595764847, 596225471, 596216125, 595457039, 595497818, 595563087, 595516891]
3054.2E95516891r52987j527252o01693j026611K68707N2643r68399L98827o94428
3062.9E90465698j884880j557541n6953q01850l268165j488724J535721K870064O68297
3071.5E86481667k240754k102050p14875l53317n77316L48053l29285p5302O45676
3080.2E81082497k23961n69649k608223k576942o40259J830902K454719j601524k951088
3088.9E74196472q89778J374779n85480l133926j246338r84383P23572J429481j164550
3097.6E69719849J29661J255608j296158l030586j705971j73302J206360J67236j640739
3106.2E64631958q202l40118n14755K02789j342506j735039j021996N48020J569900
3114.9E61990051J406822j112289k380829M16031o19697j822167j46828M99802m83665
$$ y = [595516891, 594563904, 593036652, 592434959, 591408348, 591677055, 591729698, 590761299, 591160126, 590465698, 588580818, 587023277, 586966324, 586164474, 582896309, 581407585, 582943306, 585813370, 586481667, 584240913, 582138863, 581423988, 581070671, 580493355, 580841408, 580512123, 580436821, 581082497, 580858536, 580288887, 577680664, 575103722, 574463463, 576294365, 578749084, 577147560, 574196472, 573306694, 574681473, 574095993, 570962067, 569715729, 568731346, 569454918, 570884399, 569719849, 569849510, 571105118, 569808960, 566778374, 565072403, 564899101, 566105461, 566272697, 564631958, 564623756, 564283638, 563768883, 563971672, 562629166, 560894127, 559872131, 560420151, 561990051, 563396873, 562284584, 559903755, 560319786, 559700089, 557877922, 557731094, 558230896, 557747231]
3123.6E57747231k909890j257248K01607j122131m52194l82958k1438L7117l83339
3132.3E51456757m48990r26247J301384J454430j261826p93381p98378j483230q97370
3141E47603149o65474K31934p97539j470489L84712M43802o52962j697845J29432L73955
3150.6E43882675k934494o98852J690673L39890j76163j23634L72162R46579j20659
3159.3E43178177k289314q55103J42746k166710k569504j032409J04026m36553N85823
3168E34661179J495094J016769J096955j228257k305679j347542n31616m6959n34286
3176.6E32275658k28234Q20160J526261n72396j936683j81694q35114j915359k7886
3185.3E28924713J397438L10097j138458j555558j175079r04312p19910Q45948K256965
$$ y = [557747231, 554837341, 553580093, 553781700, 552659569, 552207375, 551824417, 551802979, 551840096, 551456757, 551007767, 550081520, 551382904, 552837334, 551575508, 550782127, 549983749, 548500519, 547603149, 546937675, 547169609, 546372070, 544901581, 545286293, 545730095, 545077133, 543379288, 543508720, 543882675, 540948181, 540249329, 541940002, 542279892, 542103729, 541980095, 542352257, 543298836, 543178177, 540888863, 540033760, 540176506, 538009796, 535440292, 534407883, 534511909, 534075356, 534661179, 536156273, 537173042, 538269997, 537041740, 534736061, 533388519, 532856903, 532809944, 532275658, 532047424, 532867584, 534393845, 533821449, 531884766, 531703072, 530867958, 528952599, 528924713, 530322151, 530632248, 529493790, 527938232, 526763153, 525858841, 525138931, 525984879, 528241844]
3194E28241844J03378j602478J10894j611748l228378q7662K388763J322899j391830
3202.7E24245682o73981j011772j084252J041909o98395n07927k48032j977386n6801
3211.4E19029045K661514J451607j908569k092552j588593M61273K300797j121292
3219.1E19193230k649041K96746P54814j231003j006660r40400p21550l01971q50792
3227.8E12543373N7793J423568K206460l38059j133499p86629j933250J42593j18141
3236.4E12064209j73340o19964j881218M8713m35180K27699J712837R17816j489143
3245.1E10372429j371346J169205n66101q86955o67610p96280P23228J85661j771888
3253.8E06390343l203278J449471L887329k22626m68369N17922j535225j866493J314049
$$ y = [528241844, 528345222, 526742744, 526853638, 525241890, 522013512, 521925850, 524314613, 525637512, 524245682, 523571701, 522559929, 521475677, 522517586, 521819191, 521311264, 521063232, 519085846, 519029045, 521690559, 523142166, 521233597, 519141045, 517552452, 518013725, 520314522, 519193230, 516544189, 516840935, 517595749, 516364746, 515358086, 514417686, 513696136, 513394165, 512543373, 512601166, 514024734, 516231194, 515893135, 514759636, 513973007, 512039757, 512182350, 512064209, 511890869, 511270905, 509389687, 509438400, 509003220, 509230919, 510943756, 511861572, 510372429, 509001083, 510170288, 509604187, 508717232, 508049622, 507253342, 507976570, 508162231, 506390343, 503187065, 504636536, 508523865, 508301239, 507832870, 508350792, 506815567, 504949074, 506263123]
3262.5E06263123P72132p69577J247559j430244l532296K07062J923943M39109k08320
3271.2E04912491j045876k151756r15794n93415k26211L52440M25911K020988k06604
3279.8E02572174j995506j495781j078148J356049J049499J089859l69034j701660
3287.5D99427452L24516j385231L11890J376839j318207p85713p50580o12602j606217
3296.2D94982147p92579J339187J218453J322326j133766j330604N25016j059112j610146
3304.9D93460922K76413J635895O26221r84764l86925j261292j731338K618561J430702
3313.6D95684395j890297j568375l187256m70428J277313L52173N57098r89189j9378
3322.3D89746056R33761J301613M48532k068367k718811o16455K106438N34706m84314
$$ y = [506263123, 507035255, 506265678, 507513237, 506082993, 502550697, 502757759, 504681702, 505120811, 504912491, 503866615, 501714859, 500799065, 500205650, 499979439, 500331879, 500757790, 502778778, 502572174, 500576668, 499080887, 498002739, 499358788, 500408287, 501498146, 501129112, 499427452, 499751968, 498366737, 498678627, 500055466, 498737259, 497951546, 497200966, 496588364, 494982147, 494189568, 495528755, 496747208, 498069534, 496935768, 495605164, 496130180, 495071068, 493460922, 493737335, 495373230, 495999451, 495014687, 494627762, 493366470, 491635132, 494253693, 495684395, 493794098, 492225723, 489038467, 488568039, 489845352, 490197525, 490754623, 489765434, 489746056, 490679817, 491981430, 492429962, 490361595, 487642784, 487026329, 489132767, 489667473, 489183159]
3330.9D89183159j337738k060509m86946o09779J218452R20639j881409Q5717M20112
3339.6D85451698k427139r99832M59442J231956K726479j712303j068001K502022o25267
3348.3D85539055p92351k39944m55704j480179k529755l52592O56128J028442o54793
3357D80718307k590332p47184J331062TJ36872j826744k486649k87361N01099N65948
3366.6D76646080P97844j153755j679306R69276K014694q5373k42881J76468k29912
3375.3D77213135p76177j462440r00269r51462k98042m58908q32176m00772m34303
3384D70698586J717414J108132r74884r23538q50754j557579l153000j15662L254967
3392.7D69203682R15642j61400K73933p24067p01065m35639J360626K204476j505356
$$ y = [489183159, 487845421, 485784912, 485297966, 484688187, 485906639, 486827278, 484945869, 485031586, 485451698, 483024559, 482024727, 482484169, 483716125, 486442604, 484730301, 483662300, 486164322, 485539055, 484746704, 484506760, 484051056, 482570877, 480041122, 479688530, 480344658, 481373100, 480718307, 478127975, 477380791, 478711853, 480042915, 480179787, 478353043, 475866394, 475579033, 476080132, 476646080, 477443924, 476290169, 474610863, 475580139, 477594833, 477509460, 477266579, 477443047, 477213135, 476436958, 474974518, 474074249, 473122787, 472824745, 472365837, 471533661, 471132889, 470698586, 472416000, 473524132, 472549248, 471625710, 470774956, 469217377, 466064377, 465948715, 469203682, 470119324, 469957924, 470231857, 469507790, 468806725, 468371086, 469731712, 471936188, 470430832]
3401.3D70430832k283402j724701j424255N17044J775437J919784k234192k455482
3409.1D64521065N09720L62587J470756Q60100j063767k012672N59845J091766j17683
3417.7D66181717J863747k526551k728080K238311R85985K29035j293641j983986k98118
3426.4D62668419L097801J932945l979416j497116K160492J36032r95674n1956R41925
3435.1D64413452K100220R56268j724472O30112O28433k322960k020416k180824O46934
3443.8D61126747K624664J70136j120262o981J170692M23508j129112k253304l38821
3452.5D60667267J720047J046448J597709N07469j131668m04205n76096O38962J610718
3461.1D65676651K24266j250801k865410r17435J444283o523j37520k78969J529923
$$ y = [470430832, 468147430, 466422729, 464998474, 465515518, 467290955, 469210739, 466976547, 464521065, 465030785, 465393372, 466864128, 467724228, 466660461, 464647789, 465207634, 466299400, 466181717, 468045464, 465518913, 462790833, 465029144, 466015129, 466244164, 464950523, 462966537, 462668419, 465766220, 467699165, 463719749, 462222633, 464383125, 464519157, 463523483, 463471527, 464413452, 466513672, 467469940, 465745468, 466375580, 467004013, 464681053, 462660637, 460479813, 461126747, 463751411, 463921547, 462801285, 462794304, 463964996, 464388504, 463259392, 461006088, 460667267, 462387314, 463433762, 465031471, 465538940, 464407272, 464003067, 463426971, 464065933, 465676651, 465900917, 464650116, 461784706, 460867271, 462311554, 462305031, 462167511, 461888542, 463418465]
3469.8D63418465M819030j05514k968712Q93745l87191k200432J31225K409478J627426
3478.5D67637520j137505j077347k086219o38619K407761Q07380K487641P55348k759170
3487.2D66396790n29175k27585o05469m27246J655579J603317j451416Q28514J790504
3495.8D69033813O25802R59129n76058k401962j671943J026649R86557n2338J185952
3504.5D69115601Q92410j274948K21367K605476o68755k002067L99246J322594O92405
3513.2D71303329j096572n28832Q83064J249848J18179l10135P01599M43993M43230
3521.9D73207703J82647j083679j525268P37381J897773Q65097J258049n42030p73163
3530.6D74224510O20804k60658j082497k70805L080253L561554j29013j255760k25296
$$ y = [463418465, 468237495, 468131981, 465163269, 466057014, 465669823, 463469391, 463600616, 466010094, 467637520, 466500015, 465422668, 463336449, 462697830, 465105591, 465912971, 468400612, 469155960, 466396790, 465867615, 465640030, 465034561, 464607315, 466262894, 467866211, 466414795, 467243309, 469033813, 469659615, 470618744, 470042686, 467640724, 465968781, 466995430, 467981987, 467929649, 469115601, 470008011, 468733063, 468954430, 471559906, 470891151, 468889084, 469288330, 470610924, 471303329, 470206757, 469677925, 470560989, 471810837, 471929016, 471618881, 472320480, 472764473, 473207703, 473390350, 472306671, 470781403, 471518784, 473416557, 474281654, 475539703, 474997673, 474224510, 474845314, 474584656, 473502159, 473231354, 476311607, 479873161, 479744148, 478488388, 478263092]
3539.2D78263092J32675R2354J286163Q40149J47133n03807k727737p05986J665153
3547.9D78489189J95847L1929K415428J281090k323952q42133N80521J890221K589607
3556.6D84307747Q41446j090393j874542K97317J693420N91317j308899m7035L761672
3565.3D87172050J220322j123123j922874j273423M064064J883126J399459L041497
3573D94461098j469002k629356L74565K424125N84641j723442o24008K48794J310730
3581.7D92958145K295265J422806K07749J666984R83086l775559j843147J802521K365532
3590.4D98083382J853943K748565m47540j723099L011780J41792l12309o50902j977768
3599E00727844J343041J691742K597427J555824j33018P43599L292656K446670k712555
$$ y = [478263092, 478395767, 478488121, 479774284, 480614433, 480761566, 480257759, 477530022, 476824036, 478489189, 478685036, 478716965, 481132393, 482413483, 480089531, 479247398, 479827919, 481718140, 484307747, 485149193, 484058800, 482184258, 482481575, 484174995, 484766312, 483457413, 483410378, 487172050, 488392372, 487269249, 485346375, 484072952, 488137016, 490020142, 491419601, 494461098, 492992096, 490362740, 490737305, 493161430, 493746071, 492022629, 491398621, 491647415, 492958145, 495253410, 496676216, 496883965, 498550949, 499534035, 495758476, 493915329, 495717850, 498083382, 499937325, 502685890, 502238350, 500515251, 503527031, 503668823, 503356514, 502705612, 500727844, 502070885, 503762627, 506360054, 507915878, 507782860, 508526459, 511819115, 514265785, 511553230]
3607.7E11553230L776551K515602l491021K583085M81224j489907L801651k56996j079292
3616.4E18394127J533584j80702o07490j475640m82711L714676M335060K596092J972809
3625.1E29799805K78930j384048L066292K542610q091469J171265L000107N640029
3632.8E36023521L358803k205620K193337L214722J933937n23453o83937k39220j417007
3641.5E41655083P09991L261948L162842K523918M277420o58875m712677K060852j167068
3650.1E51113434J980247J839333K693062J950416M809876Q292122o238137J784783
3657.9E68225136L909683k634468J97792L41568K879829K394905Q1139l21197j186562
3666.5E73887825M076653L655967j289940j224784m664689K718125P212753Q992004
$$ y = [511553230, 515329781, 517845383, 514354362, 516937447, 517418671, 515928764, 519730415, 519473419, 518394127, 519927711, 519747009, 519139519, 517663879, 517181168, 520895844, 525230904, 527826996, 529799805, 530078735, 528694687, 531760979, 534303589, 526212120, 527383385, 530383492, 536023521, 539382324, 537176704, 539370041, 542584763, 544518700, 543995247, 543311310, 543072090, 541655083, 542365074, 545627022, 548789864, 551313782, 555591202, 554932327, 550219650, 552280502, 551113434, 553093681, 554933014, 557626076, 559576492, 564386368, 572678490, 566440353, 568225136, 572134819, 569500351, 569698143, 570039711, 572919540, 575314445, 575395584, 575074387, 573887825, 577964478, 581620445, 580330505, 579105721, 574441032, 577159157, 584371910, 593363914]
3674.3E93363914J054116j7238884N308113Q793449L538094l123436j07956J992416
3682E93579826j26304K124099L122750j197281J162109M210930j1081199k041359J2948303
3690.6F02701874J21956l406220M097901J547737J238136R15604n54467j636543k045822
3699.3F02980156J454468R44137l758354J230774N994301J996422q46787R34410K863465
3708F13792992K476425j0020409K356224M547425j2304574P528573M838600j051979
3715.7F12163277P55272J215248J613235k253570K73971L824463k274971k050743L214226
3724.4F16480408O19163J392136N14068j866951J54038N75676O704178J199646r599533
3733.1F16172829P850647N846862j3903999k415962N868606J752854P72934K240944
$$ y = [593363914, 594418030, 577179146, 582487259, 591280708, 594818802, 591695366, 591587410, 593579826, 593453522, 595577621, 598700371, 597503090, 598665199, 602876129, 591794930, 589753571, 602701874, 602823830, 599417610, 603515511, 605063248, 606301384, 607216988, 606662521, 605025978, 602980156, 604434624, 605378761, 601620407, 602851181, 608845482, 610841904, 609995117, 610929527, 613792992, 616269417, 606249008, 608605232, 613152657, 600848083, 608376656, 613215256, 612163277, 612918549, 614133797, 615747032, 613493462, 613767433, 617591896, 615316925, 613266182, 616480408, 617099571, 618491707, 619005775, 617138824, 617292862, 617868538, 624572716, 625772362, 616172829, 624023476, 629870338, 615966339, 613550377, 619418983, 621171837, 621944771, 624185715]
3740.8F24185715j824723K148629Q348846j3017502j8063125Q839264P321548R454041
3748.5F27392693J597366j2908173N487557m563408l437081N987244M482193L969231
3756.2F28007622m792176j52053L844528o973534k998886M668617L620072R92355M237595
3764.9F30454140j579743o443901J043778M140396L154831m892731l44353j34659p10716
3773.6F24687042k5139n85403K378883Q80776L332634J68304o722221L294487P78007
3782.3F28187370j294632K269326k78206k801743K19002K882957J459618j285858k232971
3790.9F27124863j087609M58107K128373M028968L666993o920891r136658L799782
3798.7F24061928N592193L737412k490654q700600m63447J322822N578575O257935
$$ y = [624185715, 622360992, 624509621, 632858467, 619840965, 601777840, 610617104, 617938652, 627392693, 628990059, 616081886, 621569443, 617006035, 613568954, 619556198, 624038391, 628007622, 623215446, 623063393, 626907921, 619934387, 616935501, 621604118, 625224190, 626216545, 630454140, 628874397, 622430496, 623474274, 627614670, 630769501, 625876770, 625532417, 625397758, 624687042, 624661903, 624076500, 626455383, 627336159, 630668793, 630837097, 624114876, 627409363, 628187370, 626892738, 629162064, 628883858, 626082115, 626301117, 629184074, 630643692, 629357834, 627124863, 626037254, 626495361, 628623734, 632652702, 636319695, 629398804, 620262146, 624061928, 629654121, 633391533, 630900879, 622200279, 621736832, 623059654, 628638229, 634896164]
3806.4F34896164p792702n029144M357262K834243r74769O06727K996254K973519K119255
3815.1F36986809p843285j1363487O314621O258049L265343L082504j4562302j811828
3822.8F20326424O537895L037224K201500k643471l209458L011780k23312J834144
3830.5F30872726K285233p497826K126999O718521n575485j694984R483871k065964
3838.2F34653091l429031N049362p634926m62112N033455o551705l076667N073890
3845.9F28655357R08165j557693P67135Q03757K894631J707725m122619M635696j8995667
3854.6F15696487J394730J1442146K10343j752777K614326J619187J753883n489235
3862.3F27489090k855759O768112j210136m328384L311119M252891O100502q891678
$$ y = [634896164, 627103462, 622074318, 626431580, 629265823, 628291054, 628897781, 631894035, 634867554, 636986809, 629143524, 617780037, 624094658, 630352707, 633618050, 636700554, 622138252, 620326424, 626864319, 629901543, 632103043, 629459572, 626250114, 629261894, 629038582, 630872726, 633157959, 625660133, 627787132, 634505653, 628930168, 627235184, 636719055, 634653091, 631224060, 636273422, 628638496, 628176384, 633209839, 626658134, 623581467, 628655357, 629563522, 628005829, 628772964, 629576721, 632471352, 634179077, 630056458, 634692154, 615696487, 617091217, 628533363, 628743706, 626990929, 629605255, 631224442, 632978325, 627489090, 624633331, 631401443, 630191307, 625862923, 629174042, 633426933, 639527435, 630635757]
3870F30635757p347259N232582M828033N683480r404259l019600J696472j104126M044915
3878.7F31245995J250572o708031j891708L835525N35546K390251P306823j2460937
3886.4F25504036k465210L562775J891975O675644j346207r106445o15196J877670
3894.1F25979042J914787K277527J039314J294137L328742p729415n8709N44129n496674
3902.8F23092880N284996q51021k292327j33248j3122L200225M1810j99089M31823
3911.5F28562927j985054k596054K00386L047638K007828k509117j79596O063766j924209
3920.2F30688515o230049K918891L073769J342239k540779k844734J66741l5897J361466
3928.8F27900162j790962j922074K739182J110992r81026p79228n06668J443405k91671
$$ y = [630635757, 623288498, 628521080, 633349113, 639032593, 629628334, 626608734, 628305206, 627201080, 631245995, 632496567, 625788536, 623896828, 627732353, 628267899, 630658150, 637964973, 625504036, 623038826, 626601601, 628493576, 635169220, 633823013, 624716568, 624101372, 625979042, 627893829, 630171356, 631210670, 632504807, 635833549, 628104134, 628045425, 628589554, 623092880, 628377876, 627526855, 625234528, 625101280, 625088158, 628288383, 628330193, 628131104, 628562927, 626577873, 623981819, 624182205, 627229843, 629237671, 626728554, 626548958, 632612724, 630688515, 624458466, 627377357, 630451126, 631793365, 629252586, 626407852, 626574593, 626538696, 627900162, 626109200, 624187126, 626926308, 628037300, 627056274, 626277046, 625770378, 627213783, 626922112]
3937.5F26922112l829461l106269n15099M183731L453331k444382q82797k202492M30718
3946.2F22009392M681244j729126l146363l58657Q21647J436005j260948p42493J301155
3954.9F23011856P09000m89540n97382J239700J411476Q63381p28188k136306O71730
3963.6F23955727J96762j891289n95818J229325J292495k249069k334900J053200J522026
3972.2F22178459J348725m92211k062797o90194R55277Q74786N75714R05114q35495
3980.9F22757378p58019J19248J10817J079635j469269r56230J970177r74732k661361
3989.6F19217644k40135R71412p4730J431999K294465j952210l69797L118782k490005
3998.3F21907425k641716L366852
$$ y = [626922112, 623092651, 619986382, 619471283, 623655014, 627108345, 624663963, 623781166, 621578674, 622009392, 626690636, 624961510, 621815147, 621456490, 622278137, 623714142, 622453194, 621710701, 623011856, 623720856, 623231316, 622633934, 623873634, 625285110, 626148491, 625420303, 623283997, 623955727, 624152489, 622261200, 621665382, 622894707, 624187202, 621938133, 619603233, 620656433, 622178459, 623527184, 623034973, 620972176, 620281982, 621237259, 622112045, 622687759, 623592873, 622757378, 621999359, 622118607, 622229424, 623309059, 621839790, 620883560, 622853737, 621879005, 619217644, 618977509, 619948921, 619874191, 621306190, 623600655, 621648445, 621278648, 624397430, 621907425, 619265709, 622632561]
4000.2F22632561
$$ y = [622632561]
##END=$$ End of the data block
