##TITLE=$$ Begin of the data block
##JCAMP-DX=5.00 $$ ACD/SpecManager v 10.08
##SPECTROMETER/DATA SYSTEM=Varian
##DATE=19 Mar 2013 10:04:36
##DATA TYPE=INFRARED SPECTRUM
##DATA CLASS=XYDATA
##ORIGIN=
##OWNER=
##NPOINTS=3735
##FIRSTX=399.26403809
##LASTX=4000.35498047
##MAXX=4000.35498047
##MINX=399.26403809
##MAXY=100.59495544
##MINY=19.85026550
##XFACTOR=1.0000000000
##YFACTOR=0.000001000000000
##FIRSTY=92.59336853
##DELTAX=0.96440572
##XUNITS=1/CM
##YUNITS=TRANSMITTANCE
##XYDATA=(X++(Y..Y))
399.3I2593369Q001586j5684883j9925926J0234413j379959j5543339j3884033p158428
$$ 92593369 100594955 84910072 64984146 75218559 73838600 58295261 44411228 37252800
407C7252800J2751904K4431987l871734q789158J0339153L093147r604393j1648330
$$ 37252800 50004704 74436691 70564957 61775799 72114952 75208099 65603706 53955376
414.7E3955376Q872066L941448j1376087l5542537J6570636L8925381j8895432p65419
$$ 53955376 62827442 66768890 55392803 19850266 36420902 75346283 56450851 55685432
422.4E5685432J3201218L24478O29380j7148118L891091M401108p141129O688099Q964748
$$ 55685432 68886650 69211128 69840508 52692390 56583481 60984589 53843460 60531559 69496307
431.1F9496307j229698j5024776L251304J6807324N104957j736290p169426j078285
$$ 69496307 68266609 53241833 56493137 73300461 78405418 76669128 69499702 68421417
438.8F8421417j183113k296806o18477q742989j392536R359272L643410k0348K30660
$$ 68421417 67238304 64941498 64323021 55580032 54187496 63546768 67190178 67169830 67400490
447.5F7400490q883152q350353L694442J0252419J1803337N118629o086860n847000
$$ 67400490 58517338 50166985 53861427 64113846 75917183 81035812 74948952 69101952
455.2F9101952q641549k630420K1315487J030304j2156357j0860218k152725M052627
$$ 69101952 60460403 57829983 79145470 80175774 68019417 57159199 55006474 59059101
462.9E9059101J630287M899960R441810M489983o665100j0624786o660168j0272953
$$ 59059101 60689388 65589348 75031158 79521141 72856041 62231255 55571087 45298134
470.6D5298134k301834N705509M141704J1286126J650337m423596J113076m90464n91270
$$ 45298134 42996300 48701809 52843513 64129639 65779976 61356380 62469456 61978992 61387722
479.3F1387722l313045L466545N436744k635803l106209j848705K073345J664196M344235
$$ 61387722 58074677 61541222 66977966 64342163 61235954 59387249 61460594 63124790 67469025
488F7469025j983902j3443573J743820M070618o173153O34143K768437O054516M394462
$$ 67469025 65485123 52041550 53785370 57855988 51682835 52316978 55085415 61139931 65534393
496.7F5534393O38245K874794l549400l936898R32919j204785j1235260l691581J0158199
$$ 65534393 66172638 69047432 65498032 61561134 62494053 61289268 50054008 46362427 56520626
505.3E6520626O919148J029098l738327j709839J828892k615929L458081M805481J87339
$$ 56520626 63439774 64468872 60730545 59020706 60849598 58233669 61691750 66497231 66684570
514F6684570m78386o81472j4420m925289j859478N406059L146149j702034j369629
$$ 66684570 66206184 65524712 65510292 60585003 58725525 64131584 67277733 65575699 64206070
522.7F4206070n47241j970753l30086j941795L07979N368401j044907m560897p91836
$$ 64206070 63658829 61688076 61357990 59416195 59724174 65092575 64047668 59486771 58694935
531.4E8694935L26576j851955j318493K052414j026303j448753L427929K633968J618939
$$ 58694935 59021511 57169556 55851063 57903477 56877174 55428421 58856350 61490318 63109257
540.1F3109257J032230j558670k584209m38649M430451K731941k034645r06200O21631
$$ 63109257 64141487 62582817 59998608 59559959 63990410 66722351 64687706 63781506 64403137
548.7F4403137j79893k081055j301582k444210j876625L844913J830864j746010j919800
$$ 64403137 64223244 62142189 60840607 58396397 56519772 60364685 62195549 60449539 58529739
557.4E8529739m01870K360012P45311N74631j389782j959522L61881j051300k21210
$$ 58529739 58127869 60487881 61233192 61807823 60418041 58458519 58820400 57769100 57547890
566.1E7547890j234680r83578J028835n6015J664902K286838L20858l91876j8715k060848
$$ 57547890 56313210 55329632 56358467 56302452 57967354 60254192 60575050 60183174 60164459 58103611
575.8E8103611l911888P94876K577816J66454J335411J285714j587941J604607M847328
$$ 58103611 54191723 54986599 57564415 57730869 59066280 60351994 58764053 60368660 65215988
584.4F5215988j108688n114701m11746K408622j236690k782254K85183L207520J41392
$$ 65215988 64107300 58992599 58580853 60989475 59752785 56970531 57255714 60463234 60604626
593.1F0604626o47129J534355M51752J114387O15021r37145j844536j955002K031128
$$ 60604626 59957497 61491852 61943604 63057991 63673012 62735867 60891331 58936329 60967457
601.8F0967457m66278k066212K591724J650631j390346R8305J854946j08982J35296
$$ 60967457 60501179 58434967 61026691 62677322 61286976 61385281 63240227 63131245 63266541
610.5F3266541r9633k487854r43821Q9989Q08529n6889j033405Q67737K341072J782318
$$ 63266541 63166908 60679054 59735233 59825222 60633751 60576862 59543457 60411194 62752266 64534584
620.1F4534584j452114j748699q31383m37462J777783J897884j155533k053524J08631
$$ 64534584 63082470 61333771 60502388 60064926 61842709 63740593 62585060 60531536 60640167
628.8F0640167K56455Q57822K212090J456936L5232k31201J163612l35602q90548r300
$$ 60640167 60896622 61754444 63966534 65423470 65458702 65227501 66391113 66055511 65164963 65155663
638.4F5155663l17208K78427n26191k337155k106331J833516J767425m58916J452256
$$ 65155663 64838455 65116882 64590691 62253536 60147205 61980721 63748146 63289230 64741486
647.1F4741486R0583q46824k54608k43386R81003J40015j296562n14893p8583P2628
$$ 64741486 64832069 63985245 63730637 63487251 64468254 64608269 63311707 62796814 62718231 62790859
656.8F2790859J588986O13350j543915j573059Q55987K284432m51386r75284l76534
$$ 62790859 64379845 64993195 63449280 61876221 62732208 65016640 64565254 63589970 63213436
665.4F3213436Q4122K159839J403809m929420j476040J757480J040352J28781k46693
$$ 63213436 63297558 65457397 66861206 61931786 60455746 62213226 63253578 63382359 63135666
674.1F3135666o69476J520066K2281q8897R30320K49298O39435n32005k19887k77542
$$ 63135666 62466190 63986256 64008537 63919640 64849960 65099258 65738693 65206688 64986801 64709259
683.8F4709259q88206k48875j50334m0538J011570J534744q65227j085258M98367L08365
$$ 64709259 63821053 63572178 63421844 63381306 64392876 65927620 65062393 63977135 64475502 64783867
693.4F4783867k64160k90886J252464J126244o68152j115799q67767k99084L64834
$$ 64783867 64519707 64228821 65481285 66607529 65939377 64823578 63955811 63656727 64021561
702.1F4021561k37564q41427M64809j57230o48213J539215j3732j312157J527298J004761
$$ 64021561 63783997 62942570 63407379 63250149 62601936 64141151 64127419 62815262 64342560 65347321
711.7F5347321o93955p21573j058567O21025Q62728m0649J677765J841804K54609j045502
$$ 65347321 64653366 63931793 62873226 63494251 64356979 64316330 65994095 67835899 68090508 67045006
721.4F7045006j604767m43405M84970k47353Q3138k3644j006370L60214M11652n95124
$$ 67045006 65440239 64996834 65481804 65234451 65317589 65293945 64287575 64647789 65059441 64464317
731F4464317J092560R24393j587044p07550R79187R27307J643372j69022k011795j47133
$$ 64464317 65556877 66481270 64894226 64186676 65165863 66093170 67736542 67567520 65555725 65408592
740.7F5408592R92432o12587j735527J206367J387322o97617M20456N04967j58684
$$ 65408592 66401024 65788437 64052910 65259277 66646599 65948982 66369438 66874405 66715721
749.3F6715721n20874m45335r97376j138431M88575M49928P20871P74841J09322J64345
$$ 66715721 66194847 65749512 64752136 63613705 64102280 64552208 65273079 66047920 66157242 66321587
759F6321587l95852p20878j012879J31455Q15536n64392o99180n96718j63124P75657
$$ 66321587 65925735 65204857 64191978 64323433 65138969 64574577 63875397 63278679 63115555 63891212
768.6F3891212N75203N6817R8968Q09624Q76480N47439M55063n51689m00467M02481
$$ 63891212 64466415 64523232 64622200 65431824 66308304 66855743 67310806 66759117 66358650 66761131
778.3F6761131m1710n04112q84453O74599J811752J191094J504524J57471j96274J98372
$$ 66761131 66719421 66215309 65330856 66005455 67817207 69008301 70512825 70670296 70474022 70672394
787.9G0672394j810105j830398J37764J363647Q08373q2520j28654q56430j05316O58294
$$ 70672394 68862289 67031891 67169655 68533302 69341675 69259155 69130501 68274071 68168755 68827049
797.6F8827049m06456L28667P39525R53k40165r61640l18573m8858K2636J170204o813
$$ 68827049 68420593 68749260 69488785 69489738 69249573 68287933 67969360 67920502 67943138 69113342 69106529
808.2F9106529m20242J397148J364769q7501p19422n56724k32010j90377l90251k44194
$$ 69106529 68686287 70083435 71448204 71360703 70641281 70084557 69852547 69662170 69271919 69027725
817.8F9027725n58464j50299J236687N42747m05662O11748R55070J20712p72720j734436
$$ 69027725 68469261 68318962 69555649 70098396 69692734 70304482 71259552 71380264 70607544 68873108
827.5F8873108m92775Q59680j18431L91769M10851q43910J66374J135452k14195j100296
$$ 68873108 68380333 69240013 69121582 69513351 69924202 69080292 69246666 70382118 70167923 69067627
837.1F9067627M95628O72676j159301j239678n74753J23398P90062k51648q82110J86584
$$ 69067627 69563255 70235931 69076630 67836952 67262199 67385597 68175659 67924011 67041901 67228485
846.8F7228485K32704l486P65525r666j008163O02203J336410K07825k51671o07345
$$ 67228485 67461189 67457703 68223228 68213562 67205399 67807602 69144012 69351837 69100166 68492821
856.4F8492821o3675O15204K66723o54762r37218R60289J213791j88278r41215r08745
$$ 68492821 68429146 69044350 69311073 68656311 67719093 68679382 69893173 69704895 68763680 67854935
866F7854935O49734J029663K03728q0681K75589K83074L44299R84276j11428j35521
$$ 67854935 68504669 69534332 69738060 69657379 69932968 70216042 70560341 71544617 71433189 71297668
875.7G1297668O46157q21495j267769K31209N92987k24030L65441P24960k13326m5303
$$ 71297668 71943825 71122330 69854561 70085770 70678757 70454727 70820168 71545128 71331802 71286499
885.3G1286499j49925j673287j091125M26529m87992m25041N12932M96407P91404k69683
$$ 71286499 71136574 69463287 68372162 68798691 68310699 67885658 68398590 68894997 69686401 69416718
895F9416718j201142j92169J224533J106949q56880r76555k86484q87535m53796o8222
$$ 69416718 68215576 68023407 69247940 70354889 69498009 68521454 68234970 67347435 66893639 66825417
904.6F6825417J38923M27613o01655m91531L84735P68158N1636j226776j29524k7070
$$ 66825417 66964340 67391953 66790298 66298767 66683502 67451660 67503296 66276520 66146996 66119926
914.3F6119926j128250o6948N49538J39854j85180q43826o01197N32265k97096p62509
$$ 66119926 64991676 64924728 65474266 65614120 65428940 64585114 63983917 64516182 64219086 63456577
923.9F3456577R03950J300262N1362j175667l79105L11653o2484L94210J68030M51485
$$ 63456577 64360527 65660789 65712151 64536484 64157379 64469032 64406548 64800758 64968788 65420273
933.6F5420273L4057p93922P52464J079003k19132r18113l51578N94749Q9272n66376
$$ 65420273 65454330 64660408 65412872 66491875 66272743 65354630 65003052 65597801 65687073 65120697
943.2F5120697j31882P00363N18914q316N06950J27075n37231o6582l33275n67901
$$ 65120697 64988815 65689178 66208092 66199776 66706726 66833801 66296570 66229988 65896713 65328812
952.8F5328812k11068J31134K96402o58935p30988n0110j16123L0964L5217n00171
$$ 65328812 65117744 65248878 65545280 64886345 64155357 64105247 63989124 64020088 64055305 63555134
962.5F3555134q42278l90167n86006o14636J89606j49761m06067m12945j79245k537
$$ 63555134 62712856 62322689 61736683 61122047 61311653 61161892 60755825 60342880 60163635 60161098
972.1F0161098m43534j00773K7473j50959m60869l74878j63116m04919O9672l12187
$$ 60161098 59717564 59616791 59644264 59493305 59032436 58657558 58494442 58089523 58159195 57847008
981.8E7847008k77310p011o23776m7466k3083j70402j94008m96239j61316l02677k79930
$$ 57847008 57569698 57562687 56938911 56891445 56868362 56697960 56503952 56007713 55846397 55543720 55263790
992.4E5263790J18504M79400K95075R8663J53477n98000l71734M96807K45292m61834
$$ 55263790 55382294 55861694 56156769 56255432 56408909 55810909 55439175 55935982 56181274 55719440
1002E5719440p61894m78538J79474M10183j81229J85604O57314k81410r60800m45351
$$ 55719440 54957546 54479008 54658482 55068665 54887436 55073040 55730354 55448944 54488144 54042793
1011.7E4042793R48704J152538m56005r96273P5989J86958r05731k08034J426242M38801
$$ 54042793 54991497 56144035 55688030 54691757 54767746 54954704 54048973 53840939 55267181 55705982
1021.3E5705982p01340k30907j64665K90161O17123L24237l61305r03629r4032N93013
$$ 55705982 55004642 54773735 54609070 54899231 55516354 55840591 55479286 54575657 54481625 55074638
1031E5074638P38457K08267J64788K46791l54179J15242l43162k68559M87003l5766
$$ 55074638 55813095 56021362 56186150 56432941 56078762 56194004 55850842 55582283 56069286 56033520
1040.6E6033520j62159k37713M13845j19137k65091J425587O02440o12648p21604j61483
$$ 56033520 55871361 55633648 56047493 55928356 55663265 57088852 57691292 57078644 56357040 56195557
1050.2E6195557L42956M6501N82638J14304j129422o24309R45808R24610k27355n6775
$$ 56195557 56538513 56585014 57167652 57281956 56152534 55528225 56474033 57398643 57171288 57114513
1059.9E7114513O43296O47834j0307n8269K11315l70701j88824L25096j59618N8666
$$ 57114513 57757809 58405643 58395336 58337067 58548382 58177681 57988857 58313953 58154335 58213001
1069.5E8213001M48651j95561K32392R0770p31540j35262J02989N60421m61216j885834
$$ 58213001 58661652 58466091 58698483 58789253 58057713 57922451 58025440 58585861 58124645 56238811
1079.2E6238811n18131N26718P46159K61837k06074J38218M7264L52143M90127L38379
$$ 56238811 55720680 56247398 56993557 57255394 57049320 57187538 57234802 57586945 58077072 58415451
1088.8E8415451m7298m88221n2871L204r0877J90689J92573J3683K21322P8010l81649
$$ 58415451 58368153 57879932 57827061 57830265 57739388 57930077 58122650 58136333 58357655 58435665 58054016
1099.4E8054016K77443K90093j72139M29745K96822l05058j6647L51902K1435l05771
$$ 58054016 58331459 58621552 58449413 58879158 59175980 58870922 58854275 59206177 59227612 58921841
1109.1E8921841m5044L18180j94569l53077O37425L21094j97494j76968k71854Q08689
$$ 58921841 58876797 59194977 59000408 58647331 59284756 59605850 59408356 59231388 58959534 59768223
1118.7E9768223L53340r54399M4552P27745K19185P8598L05973O8020n69329l04081
$$ 59768223 60121563 59167164 59211716 59939461 60158646 60237244 60543217 60611237 60041908 59737827
1128.4E9737827M25949J21968k15481J31359k83047k37838M58000k4590L10188N99263
$$ 59737827 60163776 60285744 60070263 60201622 59918575 59680737 60138737 60114147 60424335 61023598
1138F1023598m31202l64243o14471o61644M35196J94790j58333k56817o31229j83739
$$ 61023598 60592396 60228153 59613682 58952038 59387234 59582024 59423691 59166874 58535645 58351906
1147.6E8351906R0957N48714O34144m20845o50612o00243m73140K18258O5940j78627
$$ 58351906 58442863 58991577 59625721 59204876 58554264 57954021 57480881 57699139 57765079 57586452
1157.3E7586452M06350K95635l16158K74868Q95446K36386m25789l84533o3637L43315
$$ 57586452 57992802 58288437 57972279 58247147 59142593 59378979 58953190 58568657 58505020 58848335
1166.9E8848335K78183r7496j29127M9938N70885Q69789K50187l08426K71251O98170
$$ 58848335 59126518 59029022 58899895 58949833 59520718 60390507 60640694 60332268 60603519 61301689
1176.6F1301689L0602k1653K65633K1545j76876j19873L61210N56488O38596Q67962
$$ 61301689 61332291 61310638 61576271 61597816 61420940 61301067 61662277 62218765 62857361 63725323
1186.2F3725323L51322l56686l25309Q2099J26824P3795K22775q1974l48267N6618
$$ 63725323 64076645 63719959 63394650 63476749 63603573 63677368 63900143 63818169 63469902 63526520
1195.9F3526520L56544J59958M0276l563o2142K48627L49701K69539J79619l96866
$$ 63526520 63883064 64043022 64083298 64079735 64017593 64266220 64615921 64885460 65065079 64668213
1205.5F4668213m47327N1819J58600J34193J58402K6764Q9882L40194K22283J81701
$$ 64668213 64220886 64272705 64431305 64565498 64723900 64750664 64840546 65180740 65403023 65584724
1215.1F5584724k9792n09835k80098O4965M4525n57p4104j10817J57035M41956K88292
$$ 65584724 65554932 65045097 64764999 64829964 64874489 64873932 64799828 64689011 64846046 65288002 65576294
1225.8F5576294P3410J81366J94946q1795j95846m42612k28683J37817m29008j5412
$$ 65576294 65649704 65831070 66026016 65944221 65748375 65305763 65077080 65214897 64785889 64770477
1235.4F4770477O24222J49086k51907l23441K42706N24193K24793j00464l52081j29868
$$ 64770477 65394699 65543785 65291878 64968437 65211143 65735336 65960129 65859665 65507584 65377716
1245F5377716j44737l05649K8023M17068K82921P6958O7482o6147Q2321Q9981k71240
$$ 65377716 65232979 64927330 64955353 65372421 65655342 65732300 65799782 65733635 65815956 65905937 65634697
1255.7F5634697m07127p8148K42599K46071J97609j02837M0192L83270J77231J74599
$$ 65634697 65227570 65149422 65392021 65638092 65835701 65732864 65773056 66156326 66333557 66508156
1265.3F6508156J12114j02928J01593J70181l05512m71260k11563O3607K65281J82678
$$ 66508156 66620270 66517342 66618935 66789116 66483604 66012344 65800781 65864388 66129669 66312347
1274.9F6312347J40465J37413N5306O5376J13853J22742k25906l72917j01754K4170
$$ 66312347 66452812 66590225 66645531 66710907 66824760 66947502 66721596 66348679 66246925 66271095
1284.6F6271095P3113P774r5344j0178M1100Q6135J03325j62101k20551J08101J24603
$$ 66271095 66344208 66351982 66256638 66246460 66287560 66373695 66477020 66314919 66094368 66202469 66327072
1295.2F6327072j01127k06574l03070q4297L08952K08725J08711L28942J56639j67206
$$ 66327072 66225945 66019371 65716301 65632004 65940956 66149681 66258392 66587334 66743973 66576767
1304.8F6576767j44295k32109m89349l42140j3176K48092N30167L34724k20848J5312
$$ 66576767 66432472 66200363 65711014 65368874 65355698 65603790 66133957 66468681 66247833 66263145
1314.5F6263145K53182k35222j52382j39839n75996j03432k3583k25006J10276j6549
$$ 66263145 66516327 66281105 66128723 65988884 65412888 65309456 65285873 65060867 65171143 65154594
1324.1F5154594n622K39547K17606L37852l7323m76081k81838r1881j54762m69673
$$ 65154594 65148972 65388519 65606125 65943977 65906654 65430573 65148735 65056854 64902092 64432419
1333.8F4432419k38594Q5396N7563K16553P4959J06224O4079k67952j97632n5526K72079
$$ 64432419 64193825 64279221 64336784 64553337 64628296 64734520 64798599 64530647 64333015 64277489 64549568
1344.4F4549568o386n31280k47177J20754J84338J95167K44148K30034K13875K13547
$$ 64549568 64543182 64011902 63764725 63885479 64069817 64264984 64509132 64739166 64953041 65166588
1354F5166588J65947j08872p92541o67202R1797R079k18445J49402K61330J76743K71843
$$ 65166588 65332535 65223663 64431122 63763920 63855717 63864796 63646351 63795753 64057083 64233826 64505669
1364.6F4505669P7888k08534j23032j02401k69097l19603j39324O7982j55072j42242
$$ 64505669 64583557 64375023 64251991 64149590 63880493 63560890 63421566 63489548 63334476 63192234
1374.3F3192234M58912M06456K19299K23244R9037q697m34899o36539K4368J73538
$$ 63192234 63651146 64057602 64276901 64500145 64599182 64590485 64155586 63519047 63543415 63716953
1383.9F3716953j49757R8144J33507J86493M27082K39952L8307j8379O8917J07254
$$ 63716953 63567196 63665340 63798847 63985340 64412422 64652374 64690681 64672302 64741219 64848473
1393.6F4848473o1020l62938l36121J46340L69209l48686k06261R9670l303L87909
$$ 64848473 64787453 64424515 64088394 64234734 64603943 64255257 64048996 64148666 64145363 64533272
1403.2F4533272M37408j77505l36449j75278m13322k70199K06684J52893j22341l3554
$$ 64533272 64970680 64793175 64456726 64281448 63868126 63597927 63804611 63957504 63835163 63801609
1412.8F3801609K09873J85326q2153r8397O9092n5763m54346J9833J03454J74588J30233
$$ 63801609 64011482 64196808 64114655 64016258 64085350 64029587 63575241 63595074 63698528 63873116 64003349
1423.4F4003349l32256q514J92421K82802R5314l33652K68039L28957k33055l26092
$$ 64003349 63671093 63662579 63855000 64137802 64233116 63899464 64167503 64496460 64263405 63937313
1433.1F3937313l42281j70262o122L64452J49773J48350K05902J27792L10905Q1002
$$ 63937313 63595032 63424770 63418648 63783100 63932873 64081223 64287125 64414917 64725822 64806824
1442.7F4806824q6655J55068q8326m02390m89357k70099J87698J59733K67418M16832
$$ 64806824 64720169 64875237 64786911 64384521 63895164 63625065 63812763 63972496 64239914 64656746
1452.4F4656746K6489p728K33612j7556j014572n46127K86869L30193K30716k6359
$$ 64656746 64683235 64675507 64909119 64891563 63876991 63330864 63617733 63947926 64178642 64152283
1462F4152283O2591J89316K96730L88268K9739J50406O0562k83432l06107o64489k41501
$$ 64152283 64214874 64404190 64700920 65089188 65118927 65269333 65329895 65046463 64740356 64075867 63834366
1472.6F3834366R85657O12068J66862J9867L14591N25200N32615L77274K36427O1386
$$ 63834366 64820023 65432091 65598953 65618820 65933411 66458611 66991226 67368500 67604927 67666313
1482.3F7666313j05598k23198M8591J51726m3167m3358L83553K92717l69110P63481
$$ 67666313 67560715 67337517 67386108 67537834 67494667 67451309 67834862 68127579 67758469 68521950
1491.9F8521950O73134J54213k3934j79993p47J32614k41982j71798L93669L36708
$$ 68521950 69195084 69349297 69325363 69145370 69144623 69277237 69035255 68863457 69257126 69593834
1501.6F9593834O07902O34011K91885J108162r73946k739097J447655K46460j46218
$$ 69593834 70201736 70835747 71127632 72235794 71261848 68522751 69970406 70216866 70070648
1510.2G0070648J724M60984K08755J6556K998m4265L03917J6670N06614J45211p99752
$$ 70070648 70072372 70533356 70742111 70758667 70761665 70717400 71021317 71037987 71544601 71689812 70890060
1520.8G0890060M76395N4733j98158o64J87943o3011O530L89573M88655J39579j09512
$$ 70890060 71366455 71421188 71223030 71222366 71410309 71347298 71353828 71743401 72232056 72371635 72262123
1531.5G2262123L43872o95335m17732P94487k32110j17088K38136r12086j100983J364807
$$ 72262123 72605995 71910660 71492928 72287415 72055305 71938217 72176353 71264267 70163284 71528091
1541.1G1528091O01632P06588R56414m06205o64177K04628j03477j23108j44463J74645
$$ 71528091 72129723 72836311 73792725 73386520 72722343 72926971 72823494 72700386 72555923 72730568
1550.7G2730568J51657J11610R9472o39427L22396K69653n72868p17019k826202J949837
$$ 72730568 72882225 72993835 73093307 72453880 72776276 73045929 72473061 71756042 68929840 70879677
1560.4G0879677J710434M70169J62933k82593n69755Q1680P72827Q68363M55055l44994
$$ 70879677 72590111 73060280 73223213 72940620 72370865 72452545 73225372 74093735 74548790 74203796
1570G4203796o03950k02561j17004k4254K87560K17102p76779l8216L86848M41407
$$ 74203796 73599846 73397285 73280281 73256027 73543587 73760689 72983910 72945694 73332542 73773949
1579.7G3773949J63353k94876m35723r6519J2893j42494j64673k23152q5975K8167
$$ 73773949 73937302 73642426 73206703 73110184 73123077 72980583 72815910 72592758 72506783 72534950
1589.3G2534950m9270n2956R6184K94945o1036p5927N9318k96112q8600j33499l23380
$$ 72534950 72485680 72432724 72528908 72823853 72762817 72686890 72746208 72450096 72361496 72227997 71904617
1599.9G1904617k48710k29317k44438l18154N1232K96318J11915j50398p2273n67825
$$ 71904617 71655907 71426590 71182152 70863998 70915230 71211548 71323463 71173065 71100792 70532967
1609.6G0532967o38688K52228n0598m81720l05946K2499j45l64479N8769j16470j06903
$$ 70532967 69894279 70146507 70095909 69614189 69308243 69330742 69330597 68966118 69024887 68908417 68801514
1620.2F8801514q0063J7837l74916n47203N2437m04190l89572k32437K44239J23810
$$ 68801514 68721451 68739288 68364372 67817169 67869606 67465416 67075844 66843407 67087646 67211456
1629.8F7211456P9315J21270k97089j36055j79253j285484O23062N75051n80361k56370
$$ 67211456 67290771 67412041 67114952 66978897 66799644 65514160 66137222 66712273 66131912 65875542
1639.5F5875542J55960j19766K86743J22429K3056K49801j95945o1463m63173K0813
$$ 65875542 66031502 65911736 66198479 66320908 66343964 66593765 66397820 66336357 65873184 65893997
1649.1F5893997K42417J49520K31980m29962q72444N13320N71915L94920J48484n1049
$$ 65893997 66136414 66285934 66517914 66087952 65215508 65728828 66300743 66695663 66844147 66793098
1658.8F6793098J28899L97408M79667k0286n78682l9200l3066K50771L57254J37024
$$ 66793098 66921997 67319405 67799072 67778786 67200104 67160904 67127838 67378609 67735863 67872887
1668.4F7872887J54548L40180K69546j6624K19421J76834O607k63839J17683L57925
$$ 67872887 68027435 68367615 68637161 68620537 68839958 69016792 69023399 68759560 68877243 69235168
1678F9235168J16112J72341J03103M77837O79748n20576q67127L90213N34470M15436
$$ 69235168 69351280 69523621 69626724 70104561 70784309 70263733 69396606 69786819 70321289 70736725
1687.7G0736725K59041k3400k96379L34152M53751L96637L30673K55760o6299j07147
$$ 70736725 70995766 70972366 70675987 71010139 71463890 71860527 72191200 72446960 72380661 72273514
1697.3G2273514K70904K58210p1587n28732J98341K54623L24089M43535L88260J50292
$$ 72273514 72544418 72802628 72731041 72202309 72400650 72655273 72979362 73422897 73811157 73961449
1707G3961449P4394J59759k62275j46942L23181O6383k9610k67685j42425o4911q1238
$$ 73961449 74035843 74195602 73933327 73786385 74109566 74175949 74146339 73878654 73736229 73671318 73590080
1717.6G3590080J092499J80122J00892K12097K98378J08246q0918J72478l9169l3753
$$ 73590080 74682579 74862701 74963593 75175690 75474068 75582314 75501396 75673874 75634705 75600952
1727.2G5600952k510p1213J11534J92894L07175J93047j53191l05946M13551M34616
$$ 75600952 75598442 75527229 75638763 75831657 76138832 76331879 76178688 75872742 76286293 76720909
1736.9G6720909j49895k41775l46031j64452M14116K66449k19337M1267M52583M2526
$$ 76720909 76571014 76329239 75983208 75818756 76232872 76499321 76279984 76321251 76773834 76816360
1746.5G6816360k74780n9402K84363K91030n77468j40877O39183K90787K410K3919
$$ 76816360 76541580 76482178 76766541 77057571 76480103 76339226 76978409 77269196 77271606 77295525
1756.2G7295525O1790J76308M1466R3467J49246m42680k62970O0150J93566J30928
$$ 77295525 77357315 77533623 77575089 77668556 77817802 77375122 77112152 77172302 77365868 77496796
1765.8G7496796o6292N1460k63382J81000M71748J6930l77464N6053N93994K38701
$$ 77496796 77430504 77481964 77218582 77399582 77871330 77888260 77510796 77566849 78160843 78399544
1775.4G8399544n36270l15529L5316K92069L3569k86491J16729L26142J47743P034
$$ 78399544 77863274 77547745 77583061 77875130 77908699 77622208 77738937 78065079 78212822 78219856
1785.1G8219856o279j05194K9350K13112l2692l83804l30406l22632L72459O63277
$$ 78219856 78213577 78108383 78137733 78350845 78318153 77934349 77603943 77281311 77653770 78317047
1794.7G8317047L07556K7535K25982P1518n21583j41281K51556m9538J46866K0348
$$ 78317047 78624603 78652138 78878120 78949638 78428055 78286774 78538330 78488792 78635658 78656006
1804.4G8656006j20392l8475j4549J33499Q4267N1620n5130r804J53885J40709j10802
$$ 78656006 78535614 78497139 78482590 78616089 78700356 78751976 78696846 78687042 78840927 78981636 78870834
1815G8870834k27829K9930j51489K4956M02954P6630j05667L1974K30103J59660k60940
$$ 78870834 78643005 78672935 78521446 78546402 78949356 79025986 78920319 78952293 79182396 79342056 79081116
1825.6G9081116R803L556l29903k25021l22640m2038K57309J43357K24037J33728J85066
$$ 79081116 79090919 79094475 78764572 78539551 78216911 78174873 78432182 78575539 78799576 78933304 79118370
1836.2G9118370K88925j14837k9679j25824j74225j6113o9229l50685n20874M79118
$$ 79118370 79407295 79292458 79262779 79136955 78962730 78946617 78877388 78526703 78005829 78484947
1845.8G8484947M59206Q9340Q8158L20930J24474l40004k10655l8193L3043j52619
$$ 78484947 78944153 79033493 79121651 79442581 79567055 79227051 79016396 78978203 79011246 78858627
1855.5G8858627l21228J21781L21533K43835j1825j69289L1738J275j19309j4687N8312
$$ 78858627 78537399 78659180 78980713 79224548 79212723 79043434 79075172 79076447 78957138 78942451 79000763
1866.1G9000763j55548j38947L9437m7844J40609J30326j16043R6435K43431Q675l3051
$$ 79000763 78845215 78706268 78745705 78697861 78838470 78968796 78852753 78949188 79192619 79201294 79168243
1876.7G9168243j06285l3729r1377k10183R1317n2636o4033J90292J03302J19545L4210
$$ 79168243 79061958 79028229 78936852 78726669 78817986 78765350 78701317 78891609 78994911 79114456 79148666
1887.3G9148666P9392J08513l27545q4076J02035n9730K8854k24648j26754L86299
$$ 79148666 79228058 79336571 79009026 78924950 79026985 78967255 78996109 78771461 78644707 79031006
1896.9G9031006J38779R0408N8678o5911O8634k25647l34228j08307K7824J0720R3704
$$ 79031006 79169785 79260193 79318871 79252960 79321594 79095947 78761719 78653412 78681236 78691956 78785660
1907.6G8785660K94433J56929p9864q6952N7968j8715P3540k1073l47481j29043j94374
$$ 78785660 79080093 79237022 79157158 79070206 79128174 79109459 79182999 79161926 78814445 78685402 78491028
1918.2G8491028O9214K84012N8784L1761l7575K03011J33209j75300n0469J5824j42800
$$ 78491028 78560242 78844254 78903038 78934799 78897224 79100235 79233444 79058144 79007675 79023499 78880699
1928.8G8880699j43623M6036j59928k76382R0637L44421L18825q6815j79130J78154
$$ 78880699 78737076 78783112 78623184 78346802 78437439 78781860 79100685 79013870 78834740 79012894
1938.4G9012894Q8668r3704K5421j49116k61040R766k510Q7494N9623p0480n7991m5006
$$ 79012894 79101562 79007858 79033279 78884163 78623123 78632889 78630379 78717873 78777496 78707016 78649025 78604019
1950G8604019J21514P6667j05362j14685r2819J58913L24440O3194o6391p0038r6199
$$ 78604019 78725533 78802200 78696838 78582153 78489334 78648247 78972687 79035881 78969490 78899452 78803253
1960.6G8803253J31226J61865K6451j19369k27219m6196J4709J09879J7830k04537
$$ 78803253 78934479 79096344 79122795 79003426 78776207 78730011 78744720 78854599 78872429 78667892
1970.2G8667892P6676J95595j6457o6444k4140j3031L6919k3094j7662K00004j14090
$$ 78667892 78744568 78940163 78923706 78857262 78833122 78820091 78857010 78833916 78816254 79016258 78902168
1980.8G8902168l56407j05728l9108R2346M1229l9970J68121R7916K5360n150l25401
$$ 78902168 78545761 78440033 78400925 78493271 78534500 78494530 78662651 78760567 78785927 78780777 78455376
1991.5G8455376k66503J54732J79390P4570j93978k03796P9613Q5121J74393Q6662
$$ 78455376 78188873 78343605 78522995 78597565 78403587 78199791 78279404 78364525 78538918 78625580
2001.1G8625580p2876J14525l4142j42418q5472k26860n6816K1400j15921N5275J45913
$$ 78625580 78552704 78667229 78633087 78490669 78405197 78178337 78121521 78142921 78027000 78082275 78228188
2011.7G8228188J30195R6863j22597j96014j71387o8001R9724p7095j67969O9115P9895
$$ 78228188 78358383 78455246 78332649 78136635 77965248 77897247 77996971 77919876 77751907 77821022 77900917
2022.3G7900917q202J40984J06529j8524K6230j07330k03331j66352j45340K808R7984
$$ 77900917 77892715 78033699 78140228 78121704 78147934 78040604 77837273 77670921 77525581 77528389 77626373
2032.9G7626373R8587M4701R1644J47797j61110l40454j34895R84J17874J22467k09351
$$ 77626373 77724960 77769661 77861305 78009102 77847992 77507538 77372643 77373627 77491501 77613968 77404617
2043.5G7404617k73910L776O1158m7547o0974R6619J67404J32919k243j70738j47438
$$ 77404617 77130707 77134483 77195641 77148094 77087120 77183739 77351143 77484062 77481819 77311081 77163643
2054.1G7163643j06423m6508r1332n6045k3888p0030J62712J63460J42173m1297j36193
$$ 77163643 77057220 77010712 76919380 76863335 76839447 76769417 76932129 77095589 77237762 77196465 77060272
2064.7G7060272K91832N2826q7105K1386j13732n8327j85409n3284K31186J36147k7192
$$ 77060272 77352104 77404930 77317825 77339211 77225479 77167152 76981743 76928459 77159645 77295792 77268600
2075.4G7268600j18438j37924J3725J56021n5977k07542j93032L2936K34337P7j04134
$$ 77268600 77150162 77012238 77025963 77181984 77126007 76918465 76725433 76758369 76992706 76992783 76888649
2086G6888649N0140K73026J37199j83273j39008K6177J10878L2196k3842p8232n6946
$$ 76888649 76938789 77211815 77349014 77165741 77026733 77052910 77163788 77195984 77172142 77093910 77036964
2096.6G7036964j68617j71509K49024J52038j3221M8103k8122j78680k48688K7878
$$ 77036964 76868347 76696838 76945862 77097900 77084679 77132782 77104660 76925980 76677292 76705170
2106.2G6705170O7802N8113J7967p7888N432L059J56945J51321M8348j28548j15448
$$ 76705170 76772972 76831085 76849052 76771164 76776596 76779655 76936600 77087921 77136269 77007721 76892273
2116.8G6892273J18599r7214k25197k34802J12099L77151l7529j59713O233J64718
$$ 76892273 77010872 76913658 76688461 76453659 76565758 76942909 76905380 76745667 76751900 76916618
2126.5G6916618N8358q2283j32203j55860P5355R918q2924j05239j69846K0218K38594
$$ 76916618 76974976 76892693 76760490 76604630 76679985 76689903 76606979 76501740 76331894 76352112 76590706
2137.1G6590706L17489J18233n9997q6632p3105Q728N5138o5598j56563L1838K533
$$ 76590706 76908195 77026428 76966431 76879799 76806694 76815422 76870560 76804962 76648399 76680237 76682770
2147.7G6682770j59058j54884R6252L33466j0369o9664K10000M6409k05978k63321
$$ 76682770 76523712 76368828 76465080 76798546 76788177 76718513 76928513 76974922 76768944 76505623
2157.3G6505623j04149J40404K27592L2707k01187j49368K5841N6129k2194J15486
$$ 76505623 76401474 76541878 76769470 76802177 76600990 76451622 76477463 76533592 76511398 76626884
2167G6626884K87858L4812k56485j96540q8150k2324N7320J94572K33131R2171P9735
$$ 76626884 76914742 76949554 76693069 76496529 76408379 76386055 76443375 76637947 76871078 76963249 77042984
2177.6G7042984Q6349M9263r4863m4060J05675j52069m1817K1301o3583K67181J01997
$$ 77042984 77129333 77178596 77083733 77039673 77145348 76993279 76951462 76972763 76909180 77176361 77278358
2188.2G7278358r3208k2110j3176N6236R369J6098r0896q8135k6184j40900j15165
$$ 77278358 77185150 77163040 77149864 77206100 77215469 77231567 77140671 77052536 77026352 76885452 76770287
2198.8G6770287m8394L00324L69736P3059J01150m6623j32195n5565l8894J30768R0484
$$ 76770287 76721893 77022217 77391953 77465012 77566162 77519539 77387344 77331779 77292885 77423653 77514137
2209.4G7514137q5472j02821P950j2169l113K81761J95198q4984n6167n7793r2338
$$ 77514137 77428665 77325844 77333794 77321625 77318512 77600273 77795471 77710487 77654320 77596527 77504189
2220G7504189o9642j52031m1290J91963P1152K0882M6928O1691J42739n3070J4755
$$ 77504189 77434547 77282516 77241226 77433189 77504341 77525223 77572151 77633842 77776581 77723511 77738266
2230.6G7738266J7181j92009Q7014J49376j24466j22376Q6876J09757M8378L6018q1299
$$ 77738266 77755447 77563438 77650452 77799828 77675362 77552986 77639862 77749619 77797997 77834015 77752716
2241.2G7752716k0027L227k6451K4994M1611P2929q4122o5162O3347l3249m7020J47491
$$ 77752716 77732689 77735916 77709465 77734459 77776070 77848999 77764877 77699715 77763062 77729813 77682793 77830284
2252.8G7830284K46918m5868j44951Q164l8514j95381q2352K01302j01021j13113K71339
$$ 77830284 78077202 78031334 77886383 77894547 77856033 77660652 77578300 77779602 77678581 77565468 77836807
2263.4G7836807R7679P3586n226j77109P1228P2235j33186o8230M5227K9274O3912
$$ 77836807 77934486 78008072 78002846 77825737 77896965 77969200 77836014 77767784 77813011 77842285 77906197
2274G7906197K1041K4506O2676j56449k0866K32696R6138l1433K6680M8561k80128
$$ 77906197 77927238 77951744 78014420 77857971 77837105 78069801 78165939 78134506 78161186 78209747 77929619
2284.6G7929619k32796O7459n3055J2703K3941o851J88378K8335l8399J92597L4500
$$ 77929619 77696823 77764282 77711227 77723930 77747871 77741020 77929398 77957733 77919334 78111931 78146431
2295.2G8146431j44836o2264j81091j15471K2278M2282K50702K52929P7179j88125
$$ 78146431 78001595 77939331 77758240 77642769 77665047 77707329 77958031 78210960 78288139 78100014
2304.9G8100014j60782J36375q7501k51969J5366J96068k07443l79960K00425K95158
$$ 78100014 77939232 78075607 77988106 77736137 77751503 77947571 77740128 77360168 77560593 77855751
2314.5G7855751M0886M7638J06728L7017j13823l19961l82111N1110J60064J11038
$$ 77855751 77896637 77944275 78051003 78088020 77974197 77654236 77272125 77323235 77483299 77594337
2324.2G7594337N2430j81450m6265J39450J75011j7601l26958l64944K78610O26343
$$ 77594337 77646767 77465317 77419052 77558502 77733513 77715912 77388954 77024010 77302620 77928963
2333.8G7928963K21504k51671q56613j52763L27865o9664J03615o3011K11517K88208
$$ 77928963 78150467 77898796 77042183 76889420 77217285 77147621 77251236 77188225 77399742 77687950
2343.4G7687950N65j89522m11713K75376K21031k25342j48788K7824K62527K12258
$$ 77687950 77688515 77498993 77087280 77362656 77583687 77358345 77209557 77237381 77499908 77712166
2353.1G7712166M6448l36098o66000j15357L2898R4406Q19245L69697j68388J08932
$$ 77712166 77758614 77422516 76756516 76641159 76674057 76768463 77587708 77957405 77789017 77897949
2362.7G7897949o44417q59916j58112K59453O57989J08056l14415p233j66809l16727
$$ 77897949 77253532 76393616 76235504 76494957 77152946 77261002 76946587 76939354 76772545 76455818
2372.4G6455818k41485K96119O08780L3356m700K22290L1365m0665M723L4263q4625
$$ 76455818 76214333 76510452 77119232 77152588 77147888 77370178 77401543 77360878 77365601 77399864 77315239
2383G7315239k0935P5508j24023j23513j12083j85341j11908M9332Q4640j09695K2583
$$ 77315239 77294304 77369812 77245789 77122276 77010193 76824852 76712944 76762276 76846916 76737221 76759804
2393.6G6759804K92015J85600o1279k25929p1709J35216p8171j11191J59111O5926
$$ 76759804 77051819 77237419 77176140 76950211 76878502 77013718 76935547 76824356 76983467 77049393
2403.2G7049393q9348r4803M1481J30959k3j8654k54761k22656J47049P9376R926p6950
$$ 77049393 76960045 76865242 76906723 77037682 77037659 77019005 76764244 76541588 76688637 76768013 76777939 76700989
2414.8G6700989j05118m5074j33553q6952m7669M1115J28822J00388Q9897j44638l15834
$$ 76700989 76595871 76550797 76417244 76330292 76282623 76323738 76452560 76552948 76642845 76498207 76182373
2425.4G6182373j13777K3056Q9775Q7128n6916n1956o2904L7865O6368j2123O0119
$$ 76182373 76068596 76091652 76181427 76268555 76211639 76159683 76096779 76134644 76201012 76188889 76249008
2436G6249008k46597j51299J93116o3820j8006J39283j6129j49261j21567k3117n0217
$$ 76249008 76002411 75851112 76044228 75980408 75962402 76101685 76085556 75936295 75814728 75791611 75741394
2446.6G5741394M2801J32210q4343j97472j17370j34766l2967m5021J3092L73474J99715
$$ 75741394 75784195 75916405 75832062 75634590 75517220 75382454 75349487 75304466 75317558 75691032 75890747
2457.2G5890747r0019j77078k77756j46637p0091p2449j04446J5777J40015Q6998J66557
$$ 75890747 75800728 75623650 75345894 75199257 75129166 75056717 74952271 74968048 75108063 75195061 75361618
2467.8G5361618K815j96571j5869J92688J00792k34612l46367k59849j15868M4655
$$ 75361618 75364433 75167862 75151993 75344681 75445473 75210861 74864494 74604645 74488777 74533432
2477.5G4533432P2708J18569L1738j02883J62949L23067K6527j04019j37131k38517
$$ 74533432 74606140 74724709 74756447 74653564 74816513 75139580 75166107 75062088 74924957 74686440
2487.1G4686440K7496J9569k62855r1095q8799P1198L47206j3718j75689p111J16157
$$ 74686440 74713936 74733505 74470650 74379555 74290756 74361954 74709160 74695442 74519753 74512642 74628799
2497.7G4628799n7312j31980R2231j72195j20781P4074j16379J7097O7215j350R6542
$$ 74628799 74571487 74439507 74531738 74359543 74238762 74312836 74196457 74213554 74280769 74279419 74375961
2508.3G4375961K39395R4849j89072j67770j17004q5060m9508J5206m8302o5597P5195
$$ 74375961 74615356 74710205 74521133 74353363 74236359 74151299 74101791 74116997 74068695 74003098 74078293
2519G4078293M6570R3437l2028q7151J35101Q3397j12137k61863j88034m9286N3428
$$ 74078293 74124863 74218300 74186272 74099121 74234222 74317619 74205482 73943619 73755585 73706299 73759727
2529.6G3759727J16959J9829l4004k617J36154J7044k63992j51558l36n890j8730j09665
$$ 73759727 73876686 73896515 73862511 73859894 73996048 74013092 73749100 73597542 73597206 73591316 73572586 73462921
2541.1G3462921r9426Q0955J27541Q4457J42632R1583j46034j12564l0083j62483n5496
$$ 73462921 73363495 73444450 73571991 73656448 73799080 73890663 73744629 73632065 73601982 73439499 73384003
2551.7G3384003j31714k05437o4857N6671L47618Q2245j78025r0110q8188J06582j38809
$$ 73384003 73252289 73046852 72981995 73038666 73386284 73468529 73290504 73200394 73112206 73218788 73079979
2562.4G3079979k07733J52847L0739r6588k5009o7742J2230J75392j11419j98639J63147
$$ 73079979 72872246 73025093 73055832 72959244 72934235 72866493 72878723 73054115 72942696 72744057 72907204
2573G2907204O1065j10107L9947N448j48239j19805j76956j51276O3355Q4351J0391
$$ 72907204 72968269 72858162 72898109 72903557 72755318 72635513 72458557 72307281 72370636 72454987 72465378
2583.6G2465378m2198J86790K47482q4121j00121m1931j74255j82656J14983J33713
$$ 72465378 72423180 72609970 72857452 72773331 72673210 72631279 72457024 72274368 72389351 72523064
2593.2G2523064p4128L8895L0838l288q186n3566j01769j94847m8523P0778l7911j26144
$$ 72523064 72448936 72487831 72518669 72515381 72507195 72453629 72351860 72157013 72108490 72179268 72141357 72015213
2604.8G2015213j6876j5312L2669K14477q339k4856o378j74576P5020Q7516j11145
$$ 72015213 71998337 71983025 72015694 72230171 72221832 72196976 72190598 72016022 72091042 72178558 72067413
2615.4G2067413r5550n0774n287r2834p3426L9917r5428j44875n4558j04972n1934
$$ 72067413 71971863 71921089 71915802 71822968 71749542 71789459 71694031 71549156 71494598 71389626 71337692
2626G1337692L7789j08376j42914M6395K8190N425J23016o2660k27417p0595R6779
$$ 71337692 71375481 71267105 71124191 71170586 71198776 71204201 71327217 71264557 71037140 70966545 71063324
2636.6G1063324M96j22368J7067n5214j83311j25939j01677J3039M9232j6883o8390
$$ 71063324 71063820 70941452 70958519 70903305 70719994 70594055 70492378 70505417 70554649 70537766 70469376
2647.2G0469376J0215J14746p8323k15111l3073R4345p1007k19147j66648l5393Q0002
$$ 70469376 70479591 70594337 70516014 70300903 70267830 70362175 70291168 70072021 69905373 69869980 69949982
2657.8F9949982J04301J13381n3406k72858k5162J75301j53427j29433O8878j53000
$$ 69949982 70054283 70167664 70114258 69841400 69816238 69991539 69838112 69708679 69777557 69624557
2667.5F9624557n8807K7222n5626J11412R7488m2915k18895j51390j6960j30829L9268
$$ 69624557 69565750 69592972 69537346 69648758 69746246 69703331 69484436 69333046 69316086 69185257 69224525
2678.1F9224525L4958j12831n8105j00777R8595J48109j35361p3219J25328J09947
$$ 69224525 69259483 69146652 69088547 68987770 69086365 69234474 69099113 69025894 69151222 69261169
2687.7F9261169L0869o7741j56563p9354n348L6301K7161j28357m9714J5038o8596
$$ 69261169 69292038 69224297 69067734 68988380 68983032 69019333 69046494 68918137 68868423 68883461 68814865
2698.3F8814865k1988m2991n6733j26602j71615K2453J70822N7640j22749j08124j01128
$$ 68814865 68792877 68749886 68693153 68566551 68394936 68417389 68588211 68645851 68523102 68414978 68313850
2708.9F8313850L1739J33598l4004K7565O7673m8775q1223q0780r8099j96731j54236
$$ 68313850 68345589 68479187 68445183 68472748 68540421 68491646 68410423 68329643 68231544 68034813 67880577
2719.5F7880577j686K7214l5507J5785M9789q8439k9656J70631Q4237k17011k37213
$$ 67880577 67878891 67906105 67870598 67886383 67936172 67847733 67818077 67988708 68072945 67855934 67618721
2730.2F7618721o7757l120K6672q4022j18874P8819J37536n2498j47423j13731o218
$$ 67618721 67550964 67547844 67574516 67490494 67371620 67450439 67587975 67535477 67388054 67274323 67268105
2740.8F7268105J05438m4426n2635P1960K0508l5759l4653j5129j13678o4445P2807
$$ 67268105 67373543 67329117 67276482 67348442 67368950 67333191 67298538 67283409 67169731 67105286 67178093
2751.4F7178093N8006o1538r3819L9307j34507j80298M4388J47461J05744k05361j54220
$$ 67178093 67236099 67174561 67080742 67120049 66985542 66805244 66849632 66997093 67102837 66897476 66743256
2762F6743256Q0162o882r0820j20163L8658J29516m5120q4259K3842R9838N913j83136
$$ 66743256 66823418 66816536 66725716 66605553 66644211 66773727 66728607 66644348 66668190 66768028 66773941 66590805
2773.5F6590805j34613l4401O8359O2767k00065j18759R048n0537l029O3004J29532
$$ 66590805 66456192 66421791 66490150 66552917 66352852 66234093 66243141 66192604 66189575 66252579 66382111
2784.2F6382111q5930k21260j02654J13053K09083j39198j70288j7006j08895l1814
$$ 66382111 66296181 66074921 65972267 66085320 66294403 66155205 65984917 65967911 65859016 65827202
2793.8F5827202l6514j30051N1468O2828j21033k754n0774q1215J23734l5980j94489
$$ 65827202 65790688 65660637 65712105 65774933 65653900 65651146 65600372 65519157 65642891 65606911 65412422
2804.4F5412422k4109Q6563J1139J00j88515k32125P7141L3669N2093K2621j75140
$$ 65412422 65388313 65474876 65486015 65486115 65297600 65065475 65142616 65176285 65228378 65250999 65075859
2815F5075859j23352p7194J07544O2530k05894r8946j350j11374j07979j22292j37908
$$ 65075859 64952507 64875313 64982857 65045387 64839493 64740547 64739197 64627823 64519844 64397552 64259644
2825.6F4259644J12785J12671j98593j93245O592K1575j19628j16879J22417M6761
$$ 64259644 64372429 64485100 64286507 64093262 64099854 64121429 64001801 63884922 64007339 64054100
2835.3F4054100k16839N4619J06312j95408j47621k3030K9847j59527k93049n6492
$$ 64054100 63837261 63891880 63998192 63802784 63655163 63632133 63661980 63502453 63209404 63152912
2844.9F3152912J13659n8117j96861m3709n7095j25274j36471j60259k10079l0785
$$ 63152912 63266571 63208454 63011593 62967884 62910789 62785515 62649044 62488785 62278706 62247921
2854.6F2247921J73893j29452J5946R2620j56738q5407j97136p9601L780k7161l2611
$$ 62247921 62421814 62292362 62308308 62400928 62244190 62158783 61961647 61882046 61885826 61858665 61826054
2865.2F1826054j19736J4763q1700r3803j1169j56075j75457p908k1366l29884j98585
$$ 61826054 61706318 61721081 61639381 61545578 61534409 61378334 61202877 61194969 61173603 60843719 60645134
2875.8F0645134R350m9862J19106M3682k44117j66256l8456P003l0433k93797j92150
$$ 60645134 60654484 60604622 60723728 60767410 60523293 60357037 60318581 60325584 60295151 60001354 59809204
2886.4E9809204L5412l6518J7795Q0140P7812k9610j87675j88355q5338N0605J40450
$$ 59809204 59844616 59808098 59825893 59906033 59983845 59954235 59766560 59578205 59492867 59543472 59683922
2897E9683922J73145R407j74778r918M0401k53234K7114K72347j62129j78951j83056
$$ 59683922 59857067 59866474 59691696 59681778 59722179 59468945 59496059 59768406 59606277 59427326 59244270
2907.6E9244270j62487J53965K2091j29818j12400p5798o2794k1949J13220j08647
$$ 59244270 59081783 59235748 59257839 59128021 59015621 58939823 58877029 58855080 58968300 58859653
2917.2E8859653m68647k28321K13467O6917j11759k2163R4311J3668k68620r3334K23652
$$ 58859653 58391006 58162685 58376152 58443069 58331310 58309147 58403458 58417126 58148506 58055172 58278824
2927.8E8278824K59079K7702k17171j51119o6093P70J53153K79384j8634l10128J6976
$$ 58278824 58537903 58565605 58348434 58197315 58131222 58131992 58285145 58564529 58545895 58235767 58252743
2938.5E8252743K82070K38949K1240k06200j9642K49852J93123J8901q7013P0141K16568
$$ 58252743 58534813 58773762 58795002 58588802 58569160 58819012 59012135 59031036 58944023 59014164 59230732
2949.1E9230732J25210K07889K3857l17546k9538L56259L59501J49032q2523j23825
$$ 59230732 59355942 59563831 59587688 59270142 59240604 59596863 59956364 60105396 60022873 59899048
2958.7E9899048J07036K35241J9188j78917j34704J35589L35278J60545j0368P9929
$$ 59899048 60006084 60241325 60260513 60081596 59946892 60082481 60417759 60578304 60567936 60647865
2968.3F0647865M3095l9696J30799K77420J18660j38192j57940N3868K69268J73252
$$ 60647865 60690960 60651264 60782063 61059483 61178143 61039951 60882011 60935879 61205147 61378399
2978F1378399K7462m3808j50326j6792J41159L13316J53572j81125K5924J19866J6567
$$ 61378399 61405861 61362053 61211727 61194935 61336094 61649410 61802982 61621857 61647781 61767647 61784214
2988.6F1784214L799L1636K9457O5857J34670j25469j39477O1066N0708K6200M7867
$$ 61784214 61788013 61819649 61849106 61914963 62049633 61924164 61784687 61845753 61896461 61922661 61970528
2999.2F1970528R6347j7952p1311j6018O1233P0046j213l1693q1760M9118J43142J63281
$$ 61970528 62066875 62048923 61977612 61961594 62022827 62092873 62091660 62059967 61978207 62027325 62170467 62333748
3010.8F2333748J5434k93098j60363M242j29730K6642J19438k53418J3008K68887k03140
$$ 62333748 62349182 62056084 61895721 61899963 61770233 61796875 61916313 61662895 61675903 61944790 61741650
3021.4F1741650l04387j82682J26389K8030k78030J48991K02182n2024q0868j57006
$$ 61741650 61437263 61254581 61380970 61409000 61130970 61279961 61482143 61430119 61349251 61192245
3031F1192245k00908N3539K5139l40668n7792R8156k9870k2j06526j79653j43166J14720
$$ 61192245 60991337 61044876 61070015 60729347 60671555 60769711 60739841 60739819 60633293 60453640 60310474 60425194
3042.6F0425194k8401k57080J71788K12871j80099j35941j06201k62177p8872p37k0629
$$ 60425194 60396793 60139713 60311501 60524372 60344273 60208332 60102131 59839954 59761082 59760345 59739716
3053.2E9739716M4193m5746k3903p0103j27544r4852p0195K9866l0690j83517j57433
$$ 59739716 59783909 59738163 59714260 59644157 59516613 59421761 59351566 59381432 59350742 59167225 59009792
3063.8E9009792Q7067O6608j97586j97326j58509p3925J07643O5915n7923r9415p3860
$$ 59009792 59096859 59163467 58965881 58768555 58610046 58536121 58643764 58709679 58651756 58552341 58478481
3074.4E8478481j8058j21613r8393J39935M8641j40987q4248j7032M0870k8866j66240
$$ 58478481 58460423 58338810 58240417 58380352 58428993 58288006 58203758 58186726 58227596 58198730 58032490
3085E8032490l9963p9338k35676M2206J47808r2785j97285j02073Q5598J10935j09180
$$ 58032490 57992527 57913189 57677513 57719719 57867527 57774742 57577457 57475384 57560982 57671917 57562737
3095.6E7562737k67109j01273j0658j06781p3544K1721l155J0376R1130p7427j36170
$$ 57562737 57295628 57194355 57183697 57076916 57003372 57025093 57021938 57032314 57123444 57046017 56909847
3106.2E6909847m0828l2166p0728j70147o207M3095l3890q8444j55479K8164p3132
$$ 56909847 56869019 56836853 56766125 56595978 56589771 56632866 56598976 56510532 56355053 56383217 56310085
3116.9E6310085j42315o6551r8167J29364O2370j82983J7357L1742k54975j53976p301
$$ 56310085 56167770 56101219 56003052 56132416 56194786 56011803 56029160 56060902 55805927 55651951 55644650
3127.5E5644650J2493K5516j17981q4728j16413o8173J26423L8967n4050l3699O6566
$$ 55644650 55657143 55682659 55564678 55479950 55363537 55295364 55421787 55460754 55406704 55373005 55439571
3138.1E5439571r6527l16757j25347J71406J7379l05236l9433J45516K1991j11061
$$ 55439571 55343044 55026287 54900940 55072346 55089725 54784489 54745056 54890572 54912563 54801502
3147.7E4801502j44409J40858Q3622r2575n8m760j67195k53685j07738l5378J08712
$$ 54801502 54657093 54797951 54881573 54788998 54788940 54784180 54616985 54363300 54255562 54220184 54328896
3158.3E4328896J28322j14563m2480J19755k522k61616k63836q9714J7670J64379J39702
$$ 54328896 54457218 54342655 54300175 54419930 54417408 54155792 53891956 53802242 53819912 53984291 54123993
3168.9E4123993J6056k140r4605j28162N3310P3662j60515k68226j01628J62793J08371
$$ 54123993 54140049 54137909 54043304 53915142 53968452 54042114 53881599 53613373 53511745 53674538 53782909
3179.5E3782909j58611l02357j86317N8178M0096R0969R6905j90430j71322M0886L3905
$$ 53782909 53624298 53321941 53135624 53193802 53233898 53324867 53421772 53231342 53060020 53100906 53134811
3190.1E3134811j91436j31497J52203Q9584q9706o3530P3776j95553k65503K8752q400
$$ 53134811 52943375 52811878 52964081 53053665 52963959 52900429 52974205 52778652 52513149 52541901 52533501
3200.8E2533501O5632k9583l7137J04115Q240j0594j82552n3249L8204K418N5413r9343
$$ 52533501 52599133 52569550 52532413 52636528 52644768 52634174 52451622 52398373 52436577 52438995 52494408 52395065
3212.3E2395065J27354N4291k69661j63941M1939j2680k33063o7516p8155J6536R6085
$$ 52395065 52522419 52576710 52307049 52143108 52185047 52172367 51939304 51871788 51793633 51810169 51906254
3222.9E1906254j50124j8070M7005Q6818L2036k0447J0720j41289K598R6271J0632
$$ 51906254 51756130 51738060 51785065 51871883 51903919 51883472 51894192 51752903 51755501 51851772 51862404
3233.5E1862404j56540j98078K060M6844K5543J5797M1653j12580j05865Q2607j66679
$$ 51862404 51705864 51507786 51509846 51556690 51582233 51598030 51639683 51527103 51421238 51503845 51337166
3244.2E1337166k79778O539J28521l1758p930J31664n8094j23875J1128o6624j74507
$$ 51337166 51057388 51063927 51192448 51160690 51152760 51284424 51226330 51102455 51113583 51046959 50872452
3254.8E0872452r8313n2974N7735K15264J12648p0961j39489j53866j75014J6655J97479
$$ 50872452 50774139 50721165 50778900 50994164 51106812 51035851 50896362 50742496 50567482 50584137 50781616
3265.4E0781616L3055n2521n7755k0740J16993L9314k7527q533k22458k27638R6286
$$ 50781616 50814671 50762150 50704395 50683655 50800648 50839962 50812435 50803902 50581444 50353806 50450092
3276E0450092P2689j40449r8568p313O8894R6035j3215j03153j02394o1855M4864J53042
$$ 50450092 50522781 50382332 50283764 50276451 50345345 50441380 50428165 50325012 50222618 50160763 50205627 50358669
3287.5E0358669N3086j21903l4637L3287n9319p8132q027Q6308n7598k17636n6912
$$ 50358669 50411755 50289852 50255215 50288502 50229183 50151051 50143024 50229332 50171734 49954098 49897186
3298.2D9897186J38184M6444j08341l4359j12366n1956J00376o5445n4791j07395m7844
$$ 49897186 50035370 50081814 49973473 49939114 49826748 49774792 49875168 49809723 49754932 49647537 49599693
3308.8D9599693R7077j41953j54110m5799P7152K14295J133j64429p6542J3767J91475
$$ 49599693 49696770 49554817 49400707 49354908 49432060 49646355 49647488 49483059 49406517 49420284 49611759
3319.4D9611759K11151j97685l28491m1985O7540j03783k24487n8651Q0108O7433O134
$$ 49611759 49822910 49625225 49296734 49254749 49322289 49218506 48994019 48935368 49015476 49082909 49089043
3330D9089043n1262m8073N6511J58638q4400l19695j54495M6673P0076J21879J6373
$$ 49089043 49037781 48989708 49046219 49204857 49120457 48800762 48646267 48692940 48763016 48884895 48901268
3340.6D8901268k26254j21845m8912r2167q758J90464K45861j63666j25938Q5922n1254
$$ 48901268 48675014 48553169 48504257 48412090 48403332 48593796 48839657 48675991 48550053 48635975 48584721
3351.2D8584721k3266j65875j43635j00349k07992r4479q8154J50272K94930J09825
$$ 48584721 48561455 48395580 48251945 48151596 47943604 47849125 47760971 47911243 48206173 48315998
3360.8D8315998N474j31218j01326m6551M8821O7875j21651q5380q8990m3213R8248
$$ 48315998 48321472 48190254 48088928 48042377 48091198 48159073 48037422 47952042 47863052 47819839 47918087
3371.4D7918087n1811L0319J28700k10777j87618j3779m9347P2304L082n6358l5881
$$ 47918087 47866276 47896595 48025295 47814518 47626900 47613121 47563774 47636078 47639160 47582802 47546921
3382.1D7546921j36444n6191O0417J65879Q5605j16832n7118k335k00199k62367m4327
$$ 47546921 47410477 47354286 47414703 47580582 47666187 47549355 47492237 47489902 47289703 47027336 46983009
3392.7D6983009J09650J92081p9471k14321K17178Q5411k05147j11145L3337J79012
$$ 46983009 47092659 47284740 47205269 46990948 47208126 47293537 47088390 46977245 47010582 47189594
3402.3D7189594M3633j48602j57158M3419J69258l6216r8023j3599j35376k13234j6396
$$ 47189594 47233227 47084625 46927467 46970886 47140144 47103928 47005905 46992306 46856930 46643696 46627300
3412.9D6627300K54261K36363k05670m22748m8512L46596J98048j45710k5402Q3301
$$ 46627300 46881561 47117924 46912254 46489506 46440994 46787590 46985638 46839928 46814526 46897827
3422.6D6897827N0934q9451k73540J7387K49729J05629j02138j96915p7126P2621M0584
$$ 46897827 46948761 46859310 46585770 46603157 46852886 46958515 46856377 46659462 46582336 46654957 46695541
3433.2D6695541M0024L7148j79081o6456J16886O9061k2518j74152j15074m2229O8893
$$ 46695541 46735565 46772713 46593632 46527176 46644062 46713123 46690605 46516453 46401379 46359150 46428043
3443.8D6428043n2589r2670J67385k4525J2104J33434P3277R8705j8951m8108l0944
$$ 46428043 46375454 46282784 46450169 46425644 46437748 46571182 46644459 46743164 46724213 46676105 46645161
3454.4D6645161R742O5518O1497r8027k10991k8469J72489J56178j61465j52591J25053
$$ 46645161 46654903 46720421 46781918 46683891 46472900 46444431 46616920 46773098 46611633 46459042 46584095
3465D6584095K01218m208k39777j9416J10126J01486J14697M829j02394l9635K07920
$$ 46584095 46785313 46781105 46541328 46521912 46632038 46733524 46848221 46853050 46750656 46711021 46918941
3475.6D6918941N6771j33721n115M5673P199M1313m6166j12484K30721K06116q7620
$$ 46918941 46975712 46841991 46836876 46882549 46889748 46931061 46884895 46772411 47003132 47209248 47121628
3486.2D7121628l9967p2323j85135j05762J05038J93580J39164p9605j57505L193L3573
$$ 47121628 47081661 47009338 46824203 46718441 46823479 47017059 47156223 47076618 46919113 46922306 46955879
3496.8D6955879J68907J25466l4714n9769K4857J82693q9008j39496J78646M5704j04046
$$ 46955879 47124786 47250252 47215538 47155769 47180626 47363319 47274311 47134815 47313461 47359165 47255119
3507.4D7255119O9332L8750r1713P1564P0274m8961K0355P7694j0506o3972p0927P6401
$$ 47255119 47324451 47363201 47271488 47343052 47413326 47364365 47384720 47462414 47451908 47387936 47317009 47393410
3519D7393410J21517P488J16818k0363K5619N6252j06812J35014m0474O4182J28197
$$ 47393410 47514927 47522415 47639233 47618870 47644489 47700741 47593929 47728943 47688469 47752651 47880848
3529.6D7880848k56199n8567J86726K42679N1277L2723N4783m2626J41171p9418k28699
$$ 47880848 47624649 47566082 47752808 47995487 48046764 48079487 48134270 48091644 48232815 48153397 47924698
3540.2D7924698j3893J20067J0186M2827J39305p7552J18549M4407Q320J30996R945
$$ 47924698 47910805 48030872 48041058 48083885 48223190 48145638 48264187 48308594 48316914 48447910 48457855
3550.8D8457855O7421j86363j63448P4134K20051K77386K0004o3797j39515p686L15098
$$ 48457855 48525276 48338913 48175465 48249599 48469650 48747036 48767040 48703243 48563728 48556042 48871140
3561.4D8871140K20554q7273M479K20756k62497l62877j82155K17830M11133J26026
$$ 48871140 49091694 49004421 49008900 49229656 48967159 48604282 48422127 48639957 49051090 49177116
3571.1D9177116K01954J27278L9943n4641r2827J77009k5955o0268j4900J35006L16055
$$ 49177116 49379070 49506348 49546291 49491650 49398823 49575832 49549877 49489609 49474709 49609715 49925770
3581.7D9925770J39667P7221K7561K34909l2268m54159J89289N3406q1955K8248K64263
$$ 49925770 50065437 50142658 50170219 50405128 50372860 49918701 50107990 50161396 50079441 50107689 50371952
3592.3E0371952r361j25954L07530p3727Q3557J67667P5695L49377J15917p1941r6005
$$ 50371952 50362591 50236637 50544167 50470440 50553997 50721664 50797359 51146736 51262653 51190712 51094707
3602.9E1094707R3365L01052K26628j55129k28657O05175l9230l60943K66716k39109
$$ 51094707 51188072 51489124 51715752 51560623 51331966 51937141 51897911 51536968 51803684 51564575
3612.5E1564575R2728O41567j35563j54995J17821Q7093J75228o4392J59592M11407
$$ 51564575 51657303 52298870 52163307 52008312 52126133 52213226 52388454 52324062 52483654 52895061
3622.2E2895061J87539M5189m1897j9203K04917N48237M6051j200786M05895N97393
$$ 52895061 53082600 53127789 53085892 53066689 53271606 53819843 53865894 52665108 53071003 53668396
3631.8E3668396K91798j8547R9163L50299J88767J3664p40K46498M8882k8706K28012
$$ 53668396 53960194 53941647 54040810 54391109 54579876 54593540 54592800 54839298 54888180 54859474 55087486
3642.4E5087486P7530J45832L23334L86028l64330n26585O66935L24684m87739j69560
$$ 55087486 55165016 55310848 55634182 56020210 55655880 55129295 55796230 56120914 55633175 55463615
3652.1E5463615N05303M98630O51272O74870r17694k0733N01365R5437M5448r5822
$$ 55463615 55968918 56467548 57118820 57793690 56875996 56855263 57356628 57452065 57497513 57401691
3661.7E7401691K1916J43604K90959J94271l2143K77737L29376J17206J13945n86231
$$ 57401691 57423607 57567211 57858170 58052441 58020298 58298035 58627411 58744617 58858562 58272331
3671.4E8272331j30398O91140J091095k5910k079586O69499P88601K66414l6613P5195
$$ 58272331 58141933 58833073 59924168 59898258 57818672 58488171 59276772 59543186 59506573 59581768
3681E9581768J09692q557J74527L33099R0958L46485P71061m27674m74422O87275l66997
$$ 59581768 59691460 59682903 59857430 60190529 60281487 60627972 61399033 60971359 60496937 61184212 60817215
3691.6F0817215m00459J48327L2081K80007J56166k0401r1198K6222N17815K27268
$$ 60817215 60416756 60565083 60597164 60877171 61033337 61012936 60921738 60947960 61465775 61693043
3701.3F1693043o55110k69066L44338L65704J39209j23291L01773M85115p74486N25341
$$ 61693043 61037933 60768867 61113205 61478909 61618118 61494827 61796600 62281715 61507229 62032570
3710.9F2032570M54712j618248M02744L95859K30961K45830O7490L8448l08975M1660
$$ 62032570 62487282 60869034 61271778 61667637 61898598 62144428 62211918 62250366 61941391 61983051
3720.5F1983051M53896j86810l74645L46073M7188J3622l0910l35888N0152J44310
$$ 61983051 62436947 62250137 61875492 62221565 62268753 62282375 62251465 61915577 61965729 62110039
3730.2F2110039M82925k7504m95113R21635N45341q59062m00261n2883r0908l3730
$$ 62110039 62592964 62565460 62070347 62991982 63537323 62678261 62278000 62225117 62134209 62100479
3739.8F2100479K62676P4467K82909Q16689j334644j414959J164558Q93677Q18546
$$ 62100479 62363155 62437622 62720531 63537220 62202576 60787617 61952175 62845852 63664398
3748.5F3664398n55248j128002J186283L6888q19584K15839M67694K74639p76131J27285
$$ 63664398 63109150 61981148 63167431 63204319 62384735 62600574 63068268 63342907 62566776 62694061
3758.2F2694061N83531m01032k07615J61911J33290J48994K98908m76288n67340L54625
$$ 62694061 63277592 62876560 62668945 62830856 62964146 63113140 63412048 62935760 62368420 62723045
3767.8F2723045M23912L1834o26625J53351L01227l887n7552O9511L28041O8329K06116
$$ 62723045 63146957 63178791 62552166 62705517 63006744 63002857 62945305 63014816 63342857 63411186 63617302
3778.4F3617302O1005p78115J00979K73769P3933n5370k35901J07204L0568j70239
$$ 63617302 63678307 62900192 63001171 63274940 63348873 63293503 63057602 63164806 63195374 63025135
3788F3025135R0118L06538M5063j23310j00620j8952L43136L42148k19036o24001j10881
$$ 63025135 63115253 63421791 63466854 63343544 63242924 63223972 63567108 63909256 63690220 63066219 62955338
3798.7F2955338N47786M79626p64298j065837K21611M82463P41360P66133j096772
$$ 62955338 63503124 63982750 63218452 62152615 62374226 62856689 63598049 64364182 63267410
3807.3F3267410n36792N44891K84199N0117m3846q7326P408O25534O821j462059K75451
$$ 63267410 62730618 63275509 63559708 63609825 63565979 63478653 63486061 64111595 64118416 62656357 62931808
3817.9F2931808M19358Q47374J024421j835880p69989L65246N20256L01846o592l69725
$$ 62931808 63351166 64198540 65222961 63387081 62617092 62982338 63502594 63804440 63797848 63428123
3827.6F3428123l5480K59651K09606k7641o34628K84725O69910m76448l50471K44739
$$ 63428123 63392643 63652294 63861900 63834259 63199631 63484356 64154266 63677818 63327347 63572086
3837.2F3572086p33535L69911Q59585o26099j46542M59576r7214k47783J98146J07861
$$ 63572086 62838551 63208462 64068047 63441948 63295406 63754982 63657768 63409985 63608131 63715992
3846.9F3715992o8153K48519j25534K8099K81888q71972l11027j686802J054306J154598
$$ 63715992 63647839 63896358 63770824 63798923 64080811 63208839 62897812 61211010 62265316 63419914
3856.5F3419914k85263j34430M39736L81317N5763m98024p6080L27625o99806l46764
$$ 63419914 63134651 63000221 63439957 63821274 63877037 63379013 63302933 63630558 62930752 62583988
3866.2F2583988P67048N31502L27278r28570o70517N75299L97045K23076o40141J27110
$$ 62583988 63351036 63882538 64209816 63281246 62610729 63186028 63583073 63806149 63166008 63293118
3875.8F3293118K22728k84260K65107N81966j67255n79522Q7422j84586K33773O65031
$$ 63293118 63515846 63231586 63496693 64078659 63911404 63331882 63419304 63234718 63468491 64133522
3885.4F4133522j078976p2319L97374K87700N39128l69381j248127K34649O76281J9432
$$ 64133522 63054546 62982227 63379601 63667301 64206429 63837048 62588921 62823570 63499851 63519283
3895.1F3519283k6958l498K05677J96979j055599L32737K97508l24592O14715l03947
$$ 63519283 63492325 63488827 63694504 63891483 62835884 63168621 63466129 63141537 63756252 63452305
3904.7F3452305l51208J48953R3811N6953j18359J4111n3017m4654J37149k3132j38531
$$ 63452305 63101097 63250050 63343861 63400814 63282455 63296566 63243549 63198895 63336044 63312912 63174381
3915.3F3174381J78524j07860l35472L93516L4752k50183K18174J14082Q2882k27638
$$ 63174381 63352905 63245045 62909573 63303089 63337841 63087658 63305832 63419914 63502796 63275158
3925F3275158l19767M8325J40064K04590k5860j6564L20858j70028n15934l6946P5528
$$ 63275158 62955391 63003716 63143780 63348370 63322510 63305946 63626804 63456776 62940842 62903896 62979424
3935.6F2979424J15211J24550k7813j02295l07404K4937L98930k2320j46546m7348
$$ 62979424 63094635 63219185 63191372 63089077 62781673 62806610 63205540 63183220 63036674 62989326
3945.2F2989326J71032J69701l54137M078K45609k10678k1824m093j25828J11519J16512
$$ 62989326 63160358 63330059 62975922 62980000 63225609 63014931 62993107 62989014 62863186 62974705 63091217
3955.8F3091217m1748j60446R4276K53304K5677j20820k60631m5464L0091j01155J09062
$$ 63091217 63049469 62889023 62983299 63236603 63262280 63141460 62880829 62835365 62865456 62764301 62873363
3966.5F2873363K52163O3809l57174k74010J31634J07433l1887M494O4968Q0727K3308
$$ 62873363 63125526 63189335 62832161 62558151 62689785 62797218 62765331 62769825 62834793 62915520 62938828
3977.1F2938828j07457J56494J53847k39673p0347N7716K9614j62213j82838J57051
$$ 62938828 62831371 62987865 63141712 62902039 62831692 62889408 62919022 62756809 62573971 62731022
3986.7F2731022m0039j05728Q4552j174o1944m333K3025o5891j613N3981p7625r6329
$$ 62731022 62690983 62585255 62669807 62668633 62606689 62602356 62625381 62559490 62557877 62611858 62534233 62437904
3998.3F2437904J57936K72469
$$ 62437904 62595840 62868309
4000.2F2868309
$$ 62868309
##END=$$ End of the data block
