##TITLE=$$ Begin of the data block
##JCAMP-DX=5.00 $$ ACD/SpecManager v 10.08
##SPECTROMETER/DATA SYSTEM=Varian
##DATE=19 Mar 2013 10:04:32
##DATA TYPE=INFRARED SPECTRUM
##DATA CLASS=XYDATA
##ORIGIN=
##OWNER=
##NPOINTS=3735
##FIRSTX=399.26403809
##LASTX=4000.35498047
##MAXX=4000.35498047
##MINX=399.26403809
##MAXY=99.96529388
##MINY=15.30414200
##XFACTOR=1.0000000000
##YFACTOR=0.000000100000000
##FIRSTY=55.68252945
##DELTAX=0.96440572
##XUNITS=1/CM
##YUNITS=TRANSMITTANCE
##XYDATA=(X++(Y..Y))
399.3E56825294K82745781J60081864l72520867k20431861k2460785m4343262L6778526
$$ 556825294 839571075 999652939 627132072 406700211 384239426 339896164 376674690
406C76674690R4707108K3372078R1756286P9424134O0686493J43129196q412094j04953080
$$ 376674690 471381798 494753876 586510162 665934296 726620789 869749985 861337891 756384811
413.7G56384811j66350021r0131798J08655167J69139595l94336472k30319862L93038406
$$ 756384811 590034790 499902992 608558159 777697754 383361282 153041420 546079826
420.5E46079826O224785l0196228P5706520P3581734l5685005j23782196J64290428
$$ 546079826 552304611 522108383 597814903 671396637 635711632 511929436 676219864
427.2F76219864K02087707j05054016p6211319L3407746k5351105j33164902n8474159
$$ 676219864 878307571 773253555 697042236 730449982 705098877 571933975 513459816
434E13459816M4734802Q1491585l3794022q0924987K7544441P4569778J24418831j0698166
$$ 513459816 558194618 639686203 605892181 524967194 552511635 627081413 751500244 740802078
441.7G40802078q3986435P3419495k4880982q8408851P1268883N2475586j53935013
$$ 740802078 656815643 730235138 705354156 616945305 688214188 740689774 586754761
448.4E86754761o3275795M9624290P6458206M3205719j18415870j0262680N0290489
$$ 586754761 523478966 573103256 649561462 692767181 574351311 564088631 614379120
455.2F14379120k0634422N93147K0161552J6048126j0894393j9514771p443428J0987320
$$ 614379120 593744698 594337845 614499397 630547523 619653130 600138359 592694931 603682251
462.9F03682251o801147L0196838R2736206p6777344k4451370P5038376j05133057
$$ 603682251 596881104 627077942 719814148 643036804 618585434 693623810 588490753
469.7E88490753j21092186J8747444J23069687k2318802l168068L294678J787186J63884544
$$ 588490753 467398567 486146011 609215698 586896896 583728828 587023506 588810692 752695236
477.4G52695236K2006302j37643471o7402343n8558236j8978920O3791123M6536674
$$ 752695236 774701538 637058067 569655724 511097488 492118568 555909691 602446365
484.1F02446365K7328720L1240311p0532455m9106179M1315041r382477l5687599j9673805
$$ 602446365 629775085 661015396 590482941 541376762 582691803 573309326 537621727 517947922
491.8E17947922o939698p388572N8294601Q3620110p518654J688652N975189p3790741
$$ 517947922 511008224 503619652 561914253 645534363 638015709 639704361 645679550 571888809
499.6E71888809l8605957L5494995n381584n4294662K6312904N8922768L7927704M734878
$$ 571888809 533282852 568777847 563396263 509101601 535414505 594337273 632264977 636999855
507.3F36999855J967850K2835579l5989151l5601044o121750r304733K5642090r571495
$$ 636999855 638967705 661803284 625814133 590213089 584091339 574786606 600428696 590857201
515E90857201l2325478L9231796L2814369m131355R197579M3128013N7400742m1875763
$$ 590857201 558531723 597763519 630577888 626446533 635644112 678772125 736172867 694297104
522.7F94297104q6855316J1643638L5014687M421539j3101654o0095291l7272186K3661346
$$ 694297104 607441788 619085426 654100113 658521652 645419998 585324707 548052521 571713867
530.4E71713867P533493j7744331j07536J9857978R719887J988869n680123P71904
$$ 571713867 579247360 561503029 561395493 581253471 590973358 592962227 587282104 588054008
538.1E88054008J3656273J093293K4020042J3319283k1234856J5704155O667023l8704300
$$ 588054008 601710281 602803574 626823616 640142899 618908043 634612198 641279221 602574921
545.9F02574921j2673035L0581627J1105194m2238693o483231L4187317j0561409k7771034
$$ 602574921 589901886 620483513 631588707 589350014 582866783 617054100 606492691 578721657
553.6E78721657j1892929r659615J9813805N4836082K8687744p642212j4967193j2047196
$$ 578721657 566828728 557169113 576982918 631819000 660506744 652864532 637897339 625850143
561.3F25850143j179084j4525376j7390175K511902j0125923O770249K8855400k8269043
$$ 625850143 624671059 610145683 592755508 595267410 585141487 591911736 620767136 592498093
569E92498093k3027954J0720100M090157K4037437M395409l1091042n591660K6911278
$$ 592498093 569470139 580190239 584280396 608317833 612713242 581622200 576030540 602941818
576.7F02941818M893341j3637848n162849m185448J7290764J1693611q351936J193809
$$ 602941818 607835159 594197311 589034462 584849014 602139778 613833389 605481453 606675262
584.4F06675262K329102J9102783K1120453l0528564m6034203N12314J8872528J7170982
$$ 606675262 609004364 628107147 649227600 618699036 572664833 573177147 592049675 609220657
592.1F09220657K7049752J6373710K054062l0223083l1946144M959831K6970863J2659149
$$ 609220657 636270409 652644119 654698181 624475098 592528954 597488785 624459648 637118797
599.9F37118797k9756584n969734J7247620k154465j036987P616767J0155907Q503609
$$ 637118797 607362213 601392479 618640099 616485634 615448647 623065414 633221321 641724930
607.6F41724930j399918k3723182r304619R708442M691735L039589m769173P787819
$$ 641724930 640325012 616601830 607297211 617005653 621697388 624736977 619967804 627755623
615.3F27755623R5596j9591865j8619271J2578011K7256164j4321975M168663J9161148
$$ 627755623 627851219 608259354 589640083 602218094 629474258 615152283 619320946 638482094
623F38482094l491364q215446j1759682M513512N693664j905479j8164215p56149K7534332
$$ 638482094 634990730 626775284 615015602 619529114 625222778 623317299 605153084 604396935 631931267
631.7F31931267R502525K169190n388146m73556m207573k00501J6000366N213852P632218
$$ 631931267 641433792 643602982 638214836 637741280 633533707 633333206 649333572 654547424 662179642
640.4F62179642j7768860j9329071K024765q272553m498787J3575249K8473587j1380920
$$ 662179642 644410782 625081711 627106476 618833923 614335136 627910385 656383972 645003052
648.1F45003052k8386460J9141846J5978699L563766P92084j2786331P882385m660721
$$ 645003052 616616592 635758438 651737137 655300903 656092987 643306656 651189041 646528320
655.8F46528320k8197975K5094261K8965836j6500473j6660767j6270675j2431069
$$ 646528320 618330345 643424606 672390442 655889969 639229202 622958527 610527458
662.5F10527458O500435J8615685n79033l582764L0993500K2102203k0754013j2919464
$$ 610527458 617027893 635643578 635064545 631481781 662475281 684577484 663823471 650904007
670.3F50904007j6091576J729737M154396k895661M310074Q846817r386215J046982
$$ 650904007 634812431 636542168 640696564 637800903 642110977 650957794 641571579 642618561
678F42618561J2436294k818374L274154j2052078k1426659K199250O678734K401847
$$ 642618561 655054855 652236481 655510635 643458557 622031898 624231148 630909882 633311729
685.7F33311729j705284p418060O689148J2268143j6448136j0611076J6559524L738060
$$ 633311729 631606445 624188385 630877533 643145676 626697540 616086464 632645988 636384048
693.4F36384048l662J4885331P304000m475402m114380n825425L84522Q660507j558456
$$ 636384048 636380386 651265717 658569717 654094315 649979935 644154510 644539032 653199539 651641083
702.1F51641083o770630m884377l585357o654053j2990990Q416786J6895867m188728
$$ 651641083 644870453 639986076 636400719 629746666 616755676 625172462 642068329 637879601
709.8F37879601n081215J531753P491989k413559n422249J6055031K008362j6709633
$$ 637879601 632798386 634330139 641822128 639408569 633986320 650041351 652049713 635340080
717.5F35340080p962951L422393J0415535Q738633J928939j1675491p478294M981880
$$ 635340080 627377129 630799522 641215057 649953690 651882629 640207138 632728844 637710724
725.2F37710724P140655L735123o482315J86310L854675J769486P717819J1408768
$$ 637710724 644851379 648586502 642104187 642290497 646145172 647914658 655632477 667041245
733F67041245J1041412o86264j232376j156693n219345p03659q058014n423202J1774597
$$ 667041245 678082657 677396393 676164017 675007324 669787979 669084320 661026306 655603104 667377701
741.6F67377701Q181076k862015k21481K66723J523667o114502j6220551m940490m652253
$$ 667377701 675558777 672696762 672475281 672742004 674265671 668151169 651930618 646990128 642337875
750.3F42337875n096244L308219L807374P193145r78622k222824R140167k014771j0851974
$$ 642337875 637241631 640549850 644357224 651550369 650571747 648348923 657489090 655474319 644622345
759F44622345j170273J059952L363495Q717651K663269m624481j0580139k125168J0861664
$$ 644622345 643452072 644512024 647875519 656593170 659256439 654631958 644051819 641926651 652788315
767.7F52788315K521744n10788l764344q625106P227172J7784501R229278n284042
$$ 652788315 655310059 654799271 651034927 642409821 649636993 667421494 676650772 671366730
775.4F71366730r389954j577682P648697M321823p010041l648605R18427O197204J2273255
$$ 671366730 661976776 660399094 668047791 672369614 665359573 661710968 662629395 668826599 681099854
784.1F81099854M847564n91125N51376N460892M309692o002579p897796N69000O094818
$$ 681099854 685947418 685356293 685907669 691368561 695678253 689675674 681777878 682346878 688441696
792.7F88441696n466995j5667191o312713P730713J3999862J2024613M610367n12543
$$ 688441696 682974701 667307510 660994797 668725510 682725372 694749985 699360352 698847809
800.5F98847809j918717j0363922j284637R378509r824752j0044632M162979J433410
$$ 698847809 696929092 686565170 685280533 694659042 684834290 674789658 678952637 680386047
808.2F80386047L792954J3735657P587432M57917n2567k938537j345826r646988J601639
$$ 680386047 684179001 697914658 705502090 705960007 705907440 702968903 701623077 691976089 693577728
816.9F93577728J0892182o215134P48444K136459K802429P625427l649749J450882
$$ 693577728 704469910 698254776 699003220 701139679 703942108 711567535 707917786 709368668
824.6G09368668K853927j2756347r666748K660446k459565M374314Q989944m92935
$$ 709368668 712222595 699466248 689799500 692459946 690000381 694374695 703364639 702871704
832.3G02871704n92499j520004O720886L333817j0627442j2441406J013870P449341
$$ 702871704 702279205 700759201 707480087 710813904 700186462 687745056 688758926 696208267
840F96208267q249664p865677r635315l506927M508590N6000L632507j66015O170883
$$ 696208267 687958603 680092926 670457611 666950684 671459274 671515274 675147781 674981766 681152649
848.7F81152649K967300j179580L112411n044708q363648l861770J544342k974396
$$ 681152649 684119949 682940369 686052780 681008072 672644424 668782654 670326996 667352600
856.4F67352600J1683731Q122254k274476J5408783K393113j3342972j2435990Q696137
$$ 667352600 679036331 687158585 684884109 700292892 702686005 689343033 676907043 685603180
864.1F85603180J2963028J210403K738419j1182785j122589L134079P369461J0660553
$$ 685603180 698566208 699776611 702515030 691332245 690209656 693343735 700713196 711373749
871.8G11373749K650909J4054489q301696j6501236l148957K9221l704453j1046905
$$ 711373749 714024658 728079147 719777451 703276215 700127258 700156479 696452026 685405121
879.5F85405121J759796M270401J0488892P253189l997727M831772K24304p132950
$$ 685405121 687164917 691435318 701924210 709177399 705179672 710011444 710235748 703102798
887.3G03102798j0236358q193054J922836O041794o505204o253738J2771835P180710
$$ 703102798 692866440 684673386 686596222 692638016 686132812 679879074 692650909 699831619
895F99831619r589920j1735916j747665O099548N342178p921142j3717880L999481
$$ 699831619 690241699 678505783 676758118 682857666 688199844 680278702 666560822 670560303
902.7F70560303N812149n908356o587601N651398P614899O08978L962250n309906j5319214
$$ 670560303 676372452 670464096 663876495 669527893 677142792 677751770 681714020 676404114 661084900
911.4F61084900q657684Q472595J1395111k394333q486252j1941986j280594Q598023
$$ 661084900 652427216 660899811 672294922 669900589 661414337 649472351 648191757 656789780
919.1F56789780k064896q195801K57721O812439L835907k932587m077758Q40072m537887
$$ 656789780 654724884 646529083 646786804 653599243 657435150 654502563 650424805 651264877 646726990
927.8F46726990k014389N835418M323502J382904p639236j151200M493027l947449
$$ 646726990 644712601 650548019 654871521 656254425 648615189 647463989 651957016 648009567
935.5F48009567K973709Q514481m931870q514175K777939L455887P991333N793304
$$ 648009567 650983276 659497757 654565887 646051712 648829651 652285538 660276871 666070175
943.2F66070175m283600m79583k954331O69327P885055j736831q118286k11258Q88138
$$ 666070175 661786575 661306992 658352661 659021988 666907043 665170212 657051926 656840668 657728806
951.9F57728806k480469k782822p187042j047974k730713l384933L7193l084526R058685
$$ 657728806 655248337 652465515 645278473 644230499 641499786 638114853 638152046 635067520 644126205
960.6F44126205k015304j3197098o3972r46885m768600k645454J711311o457939q992005
$$ 644126205 642110901 628913803 628849831 627902946 623134346 620488892 622200203 615742264 606750259
969.2F06750259L579064K959823j842117o288071o347618j488266j992149p456856
$$ 606750259 610329323 613289146 611447029 605158958 598811340 597323074 595330925 587874069
976.9E87874069o384659K28959l825341n908813k75994M294777r69162n919990K784805
$$ 587874069 581489410 581718369 577893028 571984215 571708221 576002998 575033836 569113846 571898651
985.6E71898651J487198l283539k9106j858711o286545o592979l329125J731110R148407
$$ 571898651 573385849 570102310 570073204 568214493 561927948 555334969 552005844 553736954 562885361
994.3E62885361P246818l96347l769684l898239k205200j442528L836479p6637m199600
$$ 562885361 570132179 569735832 565966148 562067909 559862709 558420181 562256660 562180023 557980423
1003E57980423M643364Q37440k353630j404037l175964N878944O12373p098350K015381
$$ 557980423 562623787 563461227 561107597 559703560 556527596 562406540 563018913 555920563 557935944
1011.7E57935944N2108j535034J786881l145523n070916j615409l742218o682702P073479
$$ 557935944 557988052 556453018 558239899 555094376 550023460 548408051 544665833 537983131 545056610
1020.3E45056610J0139580k06642N409851K237854m744301m051590l181038l59268
$$ 545056610 555196190 554989548 560399399 562637253 557892952 553841362 550660324 550301056
1028.1E50301056m009209k060928O873169N384178o111794r38377J1872978O9542o288605
$$ 550301056 546291847 544230919 551104088 556488266 550376472 549438095 561311073 561380615 555092010
1036.7E55092010K915612N048027k845650l872604R388313P388496l942642m821167
$$ 555092010 558007622 563055649 560209999 556337395 565725708 573114204 569171562 564350395
1044.5E64350395K232361L297119o032257m616699M61388M752883M107666P00455L49846
$$ 564350395 566582756 569879875 563847618 559230919 559692307 564445190 568552856 569253311 569603157
1053.1E69603157j0607986l957825J2057609Q117714n864601r296837P235680P895126
$$ 569603157 558995171 555037346 567094955 575212669 569348068 560051231 567286911 575182037
1060.9E75182037N49660J279144K309342L342628k096595Q323287N021477n171432
$$ 575182037 575731697 577010841 579320183 582662811 580566216 588889503 593910980 588739548
1068.6E88739548P523460K451096m012375l469811k584457K49634p665024r956207
$$ 588739548 596263008 598714104 594701729 591231918 588647461 588897095 581232071 571275864
1076.3E71275864k255059J325913l438797m121628j096687K478409O578979L983040
$$ 571275864 569020805 570346718 566907921 562786293 561689606 564168015 570746994 574730034
1084E74730034k372170o802940J045074O176072P045936M593239n839424k501030J718292
$$ 574730034 572357864 565554924 566599998 572776070 579822006 584415245 578575821 576074791 577793083
1092.7E77793083K698593l581810l946418J0630912K529030n139198p28226L533745
$$ 577793083 580491676 576909866 572963448 583594360 586123390 580984192 580255966 583789711
1100.4E83789711R993095O560364k757683q245391j264344M17900k896728j086655
$$ 583789711 593782806 600343170 597585487 589340096 588075752 588493652 585596924 584510269
1108.1E84510269k813759K196045L261719P19833N50003n16471J945457J442146N737915
$$ 584510269 581696510 583892555 587154274 587874107 588424110 587907639 589853096 591295242 597033157
1116.8E97033157M439469j557083M356918K401237k433433M92821L258972K046661
$$ 597033157 601472626 599915543 604272461 606673698 604240265 604733086 607992058 610038719
1124.5F10038719j880646m99916k992553k247811J200562m856911k818565M89197K15873
$$ 610038719 608158073 607658157 604665604 602417793 603618355 598761444 595942879 596432076 596647949
1133.2E96647949M773522L730011l36151J455955K467232l988075o296998r85183L714294
$$ 596647949 601421471 605151482 604815331 606271286 608738518 604750443 598453445 597468262 601182556
1141.9F01182556L78151m306831m122925o976242O71692O063041m90226K378616J678352
$$ 601182556 601560707 597253876 593130951 586154709 586826401 592889442 592399216 594777832 596456184
1150.5E96456184m489288o515350o475220k556534K659531K186394q07877L714104
$$ 596456184 591966896 585451546 578976326 576419792 579079323 581265717 580457840 584171944
1158.3E84171944m76418n184402M355888M611435j921005l578568m66385O056366L862725
$$ 584171944 583695526 578511124 582867012 587478447 585557442 581978874 581512489 587568855 591431580
1166.9E91431580m348565l3493L182755j855736N630379P342491L577118P068024K092895
$$ 591431580 587083015 587049522 590232277 588376541 594006920 601349411 604926529 611994553 614087448
1175.6F14087448P50275K991333l155785l188667O362839N384979k469254J17722N191002
$$ 614087448 614837723 617829056 614673271 611484604 617847443 623232422 620763168 620880890 626071892
1184.3F26071892O628723L3379n959702J962280O799927N111160K447129k295990k868996
$$ 626071892 632700615 632733994 626774292 628736572 635536499 640647659 643094788 640798798 637929802
1193F37929802l879852P78045N255928j310043N722K132034n2032J461944K546921
$$ 637929802 634049950 634827995 640083923 638773880 638779602 640911636 640859604 642321548 644868469
1201.6F44868469L514328k81448k647629l561935j266861L971405N19943M9973K878417
$$ 644868469 648382797 648101349 645453720 641891785 640624924 644596329 645116272 645166245 648044662
1210.3F48044662J494294J225204K748032K230911L192139L998336l077926m062576
$$ 648044662 649538956 650764160 653512192 655743103 658935242 662933578 659855652 655793076
1218F55793076j530304k892380m79355J997223L052215K795334j159973j610870N637970
$$ 655793076 654262772 651370392 650891037 652888260 655940475 658735809 657575836 655964966 661602936
1226.7F61602936J495666p183227l145905J73645L7308l456192m431686n8899M025497
$$ 661602936 663098602 655915375 652769470 652943115 652980423 649524231 645092545 645033646 649059143
1235.4F49059143O738586J975174j455993j500092o41556K187500K220078N49622k460404
$$ 649059143 655797729 657772903 656316910 654816818 654175262 656362762 658582840 659132462 656672058
1244.1F56672058m782486k550049K557602J153260j51597K335434J799622L298798
$$ 656672058 651889572 649339523 651897125 653050385 652898788 655234222 657033844 660332642
1251.8F60332642r76334k713242L403092P11288m961776l474427K98920J356888L548584
$$ 660332642 659356308 656643066 660046158 660757446 655795670 652321243 652620163 653977051 657525635
1260.5F57525635K994461J718597L827286J336136k434921j191636L320084K280045
$$ 657525635 660520096 662238693 666065979 667402115 664967194 663775558 667095642 669375687
1268.2F69375687L37066k431183n683136p50579o11649N88150N461731M589081L182907
$$ 669375687 669712753 667281570 661598434 660847855 660236206 660824356 666286087 670875168 674058075
1276.9F74058075j283569k661744k287521k169266l45459m753418l462600M164734
$$ 674058075 672774506 670112762 667825241 665655975 665310516 660557098 657094498 661259232
1284.6F61259232K941207J21842L112793L570099K88543K20337P62787l334350m582138
$$ 661259232 664200439 664322281 667435074 671005173 671293716 671514053 672276840 668942490 664360352
1293.3F64360352P2326j84326j854477q24356k948532J8692M786529K101670J738205
$$ 664360352 664432678 664248352 662393875 661569519 658620987 658639679 663426208 665527878 667266083
1301.9F67266083L652878J88446k262116k868347l700867j851654m49371J4267J94855
$$ 667266083 670918961 671107407 668845291 665976944 662276077 660424423 659975052 659989319 660184174
1310.6F60184174L4866k83890r36584M510193M528808j637421L18909k4338n063018
$$ 660184174 660219040 659935150 658998566 663508759 668037567 666400146 666719055 666694717 661631699
1319.3F61631699p852250m473266K377624Q60672N98832L005447m81796j31836J376190
$$ 661631699 653779449 649306183 651683807 652544479 653143311 656148758 655666962 655535126 656911316
1328F56911316j081543j519775k88926p68966l173523m324570k253723j378937J528168
$$ 656911316 655829773 654309998 654021072 653252106 650078583 645754013 643500290 642121353 643649521
1336.7F43649521L545227L6774J463241R66110k910995k090988J592560N054168l133697
$$ 643649521 647194748 647231522 648694763 649660873 646749878 644658890 646251450 651305618 648171921
1345.3F48171921p112580j28021K53601r69543L5324L580704N744934K690353K457352
$$ 648171921 641059341 640931320 641184921 640215378 640250702 643831406 649576340 652266693 654724045
1354F54724045l15018l430710m426498o582451k349701j42975j408500K594566J653557
$$ 654724045 654409027 650978317 646551819 639969368 637619667 637476692 636068192 638662758 640316315
1362.7F40316315L988495N540618j505126l810959k295609l460274j525535J601410
$$ 640316315 644304810 649845428 648340302 644529343 642233734 638773460 637247925 638849335
1370.4F38849335J590881l478432n495185R54856M858017N579415K641372p40890L24249
$$ 638849335 640440216 636961784 631466599 632421455 637279472 642858887 645500259 644759369 645083618
1379.1F45083618j746216j764297M08554j93558Q66852j125412l569374j344643K166329
$$ 645083618 643337402 641573105 641981659 641788101 642654953 641529541 637960167 636615524 638781853
1387.8F38781853L565864M994965M685669j835022j762085L371124l231125q175201
$$ 638781853 642347717 647342682 652028351 650193329 648431244 651802368 648571243 640396042
1395.5F40396042O97098L307037L25623n043068R59968J124726M21600N166702L633499
$$ 640396042 641093140 644400177 644725800 639682732 640642700 641767426 642189026 647355728 650989227
1404.2F50989227j609115k861939j731338l446656k619247n17960j972770l14560J509933
$$ 650989227 649380112 646518173 644786835 641340179 638720932 638202972 636230202 635915642 637425575
1412.8F37425575k98385k05918K194481N172577L163757l166122n595741J709022j310768
$$ 637425575 637127190 636921272 639115753 644288330 647452087 644285965 638690224 640399246 639088478
1421.5F39088478l739014j679992K870102M374733k34528k10800L701706Q99124l094711
$$ 639088478 635349464 633669472 636539574 640914307 640679779 640468979 644170685 645069809 641975098
1430.2F41975098r08661J206817j39465l669968k626190L03040K802353K880783k51694
$$ 641975098 641066437 642273254 642133789 638463821 635837631 636140671 638943024 641823807 641572113
1438.9F41572113n38940M866638L926391j126480j205826O8360j331558m933319m814606
$$ 641572113 641033173 645899811 649826202 648699722 647493896 647562256 646230698 641297379 636482773
1447.6F36482773k772942L146858N844956J503448R92508R86634J330642M760437k469024
$$ 636482773 633709831 636856689 642701645 644205093 645197601 646184235 647514877 652275314 649806290
1456.2F49806290j0954743M402924P62329j009445J388321p24564J303253L337937
$$ 649806290 638851547 643254471 644016800 643007355 644395676 643671112 644974365 648312302
1464F48312302k362824J557465K993393J169281J586227J36185p99179m420166n670166
$$ 648312302 645949478 647506943 650500336 651669617 653255844 653392029 652592850 648172684 642502518
1472.6F42502518P102508N016098J340103M469910M563828M737320M752960L412246
$$ 642502518 649605026 654621124 655961227 660431137 664994965 669732285 674485245 677897491
1480.3F77897491K785569k009659k341156j954346j186066r43527k810287M966812
$$ 677897491 680683060 678673401 676332245 674377899 673191833 672248306 669438019 674404831
1488.1F74404831P384796M7531n53512O637649L970642K428818K968750j087723m089203
$$ 674404831 681789627 681837158 681283646 687921295 691891937 694320755 697289505 696201782 692112579
1496.7F92112579K534256j725082o53458L731385J1291M521561P357101M071274O538544
$$ 692112579 694646835 692921753 692268295 695999680 696010971 700532532 707889633 711960907 718499451
1505.4G18499451m202652j0665665l117905K897263L277969j329574L233185J129684
$$ 718499451 714296799 703631134 700513229 703410492 706688461 705358887 708592072 709721756
1513.1G09721756l64685J102066L937836J0940475n765762j940460J217575n776291
$$ 709721756 709357071 710459137 714396973 725337448 719571686 717631226 718848801 713072510
1520.8G13072510k501984J206818M196701N649185J708832m249573n12009J567383
$$ 713072510 710570526 711777344 715974045 721623230 723332062 719082489 718570480 720137863
1528.6G20137863L805390M246139M42429J201553l013000o466523L613053l80783J224136
$$ 720137863 723943253 728189392 728631821 729833374 726820374 720353851 723966904 723586121 724810257
1537.2G24810257M103622j8735809j1692734J7972718P49435P847672O864013m632797
$$ 724810257 728913879 710178070 698485336 716458054 717207489 725055161 731919174 727286377
1545G27286377k530136M479370K893677J667251o54220l024292j681137n23529j017151
$$ 727286377 724756241 729235611 732129288 733796539 733142319 730118027 728436890 727913361 726896210
1553.6G26896210k543106R173965N948563J891784J8366623r666137l0401307M746933
$$ 726896210 724353104 733527069 739475632 741367416 759734039 750067902 719666595 724413528
1561.4G24413528N261994K426987j069489l625183K344665O840973M695435M274139
$$ 724413528 729675522 732102509 731033020 727407837 729752502 736593475 741288910 745563049
1569.1G45563049o081543n846862J495132j757202k018967K369003j500854r351959
$$ 745563049 739481506 733634644 735129776 733372574 731353607 733722610 732221756 722869797
1576.8G22869797R503479N712509K98004P47910k317658j241608J028290j441192k681046
$$ 722869797 732373276 738085785 738383789 739131699 736814041 735572433 736600723 735159531 732478485
1585.5G32478485r69238Q21686k181168j713715Q03528J4344k313386N40696K633743
$$ 732478485 731509247 732330933 730149765 728436050 729239578 729253922 726940536 727481232 730114975
1594.1G30114975o54449j50452k789993r44901q4915n519638m303131j690827k019958
$$ 730114975 729460526 729310074 726520081 725575180 725490265 719970627 715667496 713976669 711956711
1602.8G11956711j811905K353439k41623l609848Q75016J739959k996902n894623n87845
$$ 711956711 710144806 712498245 712256622 708646774 709521790 711261749 708264847 702370224 701782379
1611.5G01782379m0970k200241j805191j153869K07138l178406J04141l1204l544769
$$ 701782379 701741409 699541168 697735977 696582108 696789246 693610840 693714981 693683777 690139008
1620.2F90139008l323670J569748P4692n817413j449433l156662l330307m453888J800080
$$ 690139008 686815338 688385086 688459778 682642365 681192932 678036270 674705963 670252075 672052155
1628.9F72052155K590560j321792j13449N89142K184372k831192k3894577P561111
$$ 672052155 674642715 673320923 673207474 673796616 675980988 673149796 649255219 656816330
1636.6F56816330Q671188r59625q66623Q04596P6981N70373l056793m61807K988052
$$ 656816330 665487518 664527893 663661270 664465866 664542847 665113220 662056427 661594620 664582672
1645.3F64582672k189712k76032k864990r88083K392654L723145L592071J6569291
$$ 664582672 662392960 662116928 659251938 658263855 660656509 664379654 667971725 684541016
1653F84541016j4198685j1911469P961808O339492Q3237k262573K74506L804397K224503
$$ 684541016 670342331 658430862 666392670 672732162 672815399 670552826 670827332 674631729 676856232
1661.6F76856232k073136l906555J366272J906128J120071K948075L022842k375641
$$ 676856232 674783096 670876541 672242813 674148941 675269012 678217087 681239929 678864288
1669.4F78864288K452317O083679L4714J176986L720856Q57086l416443J629029K819671
$$ 678864288 681316605 687400284 687434998 688611984 692332840 693189926 689773483 691402512 694222183
1678F94222183J814270L497391J998825L661041O219025N95016o137771k214279M421692
$$ 694222183 696036453 699533844 701532669 705193710 711412735 712007751 705869980 703655701 708077393
1686.7G08077393L297882P80105J979904j774444J259994K861557K726136L195800
$$ 708077393 711375275 712155380 714135284 712360840 713620834 716482391 719208527 722404327
1694.4G22404327k329330o949768N159149P748184O765976j150589o412201N259629
$$ 722404327 720074997 713125229 718284378 726032562 732798538 731647949 725235748 730495377
1702.1G30495377L833847J065368J112976R26209L396606L498078j086426k342072
$$ 730495377 734329224 735394592 736507568 737433777 740830383 744328461 743242035 740899963
1709.9G40899963M78592K826691K521896K112809k588273l258667K029267k367478
$$ 740899963 741378555 744205246 746727142 748839951 746251678 742993011 745022278 742654800
1717.6G42654800L377610N508880N59006N08499K907334K416610n14221J423187J626206
$$ 742654800 746032410 751541290 752100296 752608795 755516129 757932739 757418518 758841705 760467911
1726.3G60467911p39823j813354P83234Q86154n62516M288407L181534j0868454n998230
$$ 760467911 759728088 757914734 758697968 759584122 759021606 763310013 766491547 755623093 749624863
1734.9G49624863J1066589M699783j848755j423416m528122K88010M734039J556626
$$ 749624863 760691452 765391235 763542480 762119064 757590942 757878952 762612991 764169617
1742.7G64169617l55759L782730N393448K68784k13776J08490r95712L087082l631974
$$ 764169617 763813858 767596588 772990036 773258820 773045044 773153534 772157822 775244904 771612930
1751.3G71612930n654297L030091L039245M05426j284866n26199O021728J728745j381989
$$ 771612930 765958633 768988724 772027969 772433395 771148529 770622330 776644058 778372803 776990814
1760G76990814M725800j833573n464019J191406K969208J928253j081085J466827m248123
$$ 776990814 781716614 779883041 774419022 775610428 778579636 780507889 779426804 780893631 776645508
1768.7G76645508p74307L945694l69034K34146l30124M113388K762222l062973j018142
$$ 776645508 775871201 779816895 779447861 779682007 779351883 783465271 786227493 783164520 782146378
1777.4G82146378o86264K45285m75846j258468J918487K703247J681442J540375q47397
$$ 782146378 781460114 781705399 781229553 779971085 781889572 784592819 786274261 787814636 786967239
1786G86967239j548233J079407P22351p66754k808838j934204l29590J241608K889633
$$ 786967239 785419006 786498413 787220764 786454010 783645172 781710968 781381378 782622986 785512619
1794.7G85512619J635895P41882J306000J986847j236267j568909P02209j789016j330719
$$ 785512619 787148514 787890396 789196396 791183243 789946976 788378067 789080276 787291260 785960541
1803.4G85960541j095581N74722k74353J744690L761825l7078J283340j319809J789017
$$ 785960541 784864960 785439682 785165329 786910019 790671844 790634766 791918106 790598297 792387314
1812.1G92387314K347946j387329m5624k889786j787033l07541J310883M83551j378326
$$ 792387314 794735260 793347931 793302307 790412521 788625488 788317947 789628830 790112381 788734055
1820.8G88734055J858596N68161L962860M948807n086059k694397J635742n08499l321305
$$ 788734055 790592651 791160812 795123672 800072479 794986420 792292023 793927765 793419266 790097961
1829.4G90097961n022049o57119M411621M350815K114410K696533J645890j552735
$$ 790097961 785075912 784418793 788830414 793181229 795295639 797992172 799638062 798085327
1837.2G98085327k960968J477203k16140l578949k936020j438980m92630k216797L394012
$$ 798085327 795124359 796601562 796385422 792806473 789870453 788431473 787938843 785722046 789116058
1845.8G89116058L921128Q48159j162719J437072L937226j734238l988724q47473L22724
$$ 789116058 793037186 793885345 792722626 794159698 798096924 796362686 792373962 791526489 791849213
1854.5G91849213o2027R5062R36356k08436J461030K020339k81524q91037o98319l58734
$$ 791849213 791787186 791882248 792818604 792610168 794071198 796091537 795810013 794918976 794220657 793861923
1864.2G93861923m78363P69730j008682m209061j012573K617874J088180K68936K348557
$$ 793861923 793383560 794153290 793144608 788935547 787922974 790540848 791629028 791897964 794246521
1872.8G94246521K648926k028961k063904J327514Q3542k52762p69271j468354K60315
$$ 794246521 796895447 794866486 792802582 794130096 794213638 793960876 793191605 791723251 791983566
1881.5G91983566p07016j517029n39398K008286L401871J192779r2621l64914j341095
$$ 791983566 791276550 789759521 789220123 791228409 794630280 795823059 795730438 795365524 794024429
1890.2G94024429n19638m02374l71094Q51441k034073j880570K080689J336365K849121
$$ 794024429 793504791 793102417 792731323 793582764 791548691 789668121 791748810 793085175 795934296
1898.9G95934296J606521q77075p095q40836j335220l259964j694946J752319J290970
$$ 795934296 797540817 796663742 796656647 795815811 794480591 791220627 789525681 791278000 792568970
1907.6G92568970P91855J028595L57971j040497L48663K06375j008453m044p70568
$$ 792568970 793360825 794389420 794747391 793706894 794055557 794261932 793253479 793249435 792478867
1916.2G92478867j897583j662827l67584K20032J394577J631774J227646m98886Q9646
$$ 792478867 790581284 788918457 788550873 788770905 790165482 791797256 793024902 792526016 792615662
1924.9G92615662J264190k187652p47147J278458M9438R59702j374741k819748o48422
$$ 792615662 793879852 791692200 790945053 792223511 792272949 793232651 791857910 789038162 788389740
1933.6G88389740K229919K918168O35528j543350j180420Q00476k89688j346054j859207
$$ 788389740 790619659 793537827 794173355 792630005 791449585 792250061 791960373 790614319 788755112
1942.3G88755112n81436J667861m08935j548233J144562L399124J016998k430038j953888
$$ 788755112 788173676 789841537 789432602 787884369 789028931 792428055 793445053 791015015 789061127
1951G89061127J143112J351471j634369m97055J518860j28708p1793J483307o73218
$$ 789061127 790204239 791555710 789921341 789424286 790943146 790814438 790742645 792225952 791552734
1959.6G91552734l74450J311187r75341R36355P8354j600113J852341j57623j375733
$$ 791552734 791178284 792489471 791514130 792450485 792528839 790928726 792781067 792623444 791247711
1968.3G91247711J624603J426087j229630j543731j4191P84988O10505m85917R9411
$$ 791247711 792872314 794298401 793068771 791525040 791510849 792295837 792906342 792420425 792519836
1977G92519836m34494O4927j18256j768036k51541j722794j495590L82462P71484K312775
$$ 792519836 792085342 792150269 792032013 790263977 790012436 788289642 786794052 787176514 787947998 790260773
1986.6G90260773P92770L78189P80640M1656J43662j497193j898651j4724J336593
$$ 790260773 791053543 791431732 792212372 792254028 792397690 790900497 789001846 788987122 790323715
1995.3G90323715N10712j264725j075897Q98514J946640L23257j766205o89087p30514
$$ 790323715 790834427 789569702 788493805 789392319 791338959 791662216 789896011 789206924 788476410
2004G88476410k437058q14895j20926O10351l14483k045822J626510K099686J044922
$$ 788476410 786039352 785224457 785103531 785713882 785399399 783353577 784980087 787079773 788124695
2012.7G88124695R39331o83441k81449j125564k639313k023773o05698o03790j051560
$$ 788124695 789064026 788380585 788099136 786973572 784334259 782310486 781704788 781100998 780049438
2021.3G80049438Q7204J081849K239532J131134J100998J829147j259765k951126k716217
$$ 780049438 780136642 781218491 783458023 784589157 785690155 787519302 786259537 783308411 780592194
2030G80592194p20673J510544Q34045j491775l744583j507721J462478J472779J593551
$$ 780592194 779871521 781382065 782216110 780724335 776979752 775472031 776934509 778407288 780000839
2038.7G80000839J087952K85416j200486j492614j20469j441574j345977L76663j65024
$$ 780000839 781088791 781374207 780173721 778681107 778560638 777119064 775773087 776149750 775984726
2047.4G75984726Q04596J052246j056747p6905O45447o02646j2894j217422k531357
$$ 775984726 776789322 777841568 776784821 776707916 777353363 776750717 776737823 775520401 772989044
2056.1G72989044K19727J412201o04248o82984J067810O62079O71616J840133M11072
$$ 772989044 773208771 774620972 774016724 773333740 774401550 775063629 775735245 777575378 777986450
2064.7G77986450o89926n33676j487503j335678O48041L68042j799088l70407J577606
$$ 777986450 777296524 776762848 775275345 773939667 774587708 774955750 773156662 772786255 774363861
2073.4G74363861J29547m47235R26285K242508J668320k880326l992615K78550J36642
$$ 774363861 774493408 774046173 774972458 777214966 778883286 776002960 772010345 772288895 772425537
2082.1G72425537n93872J307220J584397k8305j080246K133255K139969k448197l028793
$$ 772425537 771831665 773138885 774723282 774694977 773614731 775747986 777887955 775439758 772410965
2090.8G72410965O50787K370835n52445j196975j14136r6436l57513j354828O87J665267
$$ 772410965 773061752 775432587 774880142 773683167 773569031 773472595 773115082 771760254 771760941 773426208
2100.4G73426208J782609Q31527L51486j225814l271866n80750J213303K18658p64618
$$ 773426208 775208817 776040344 776391830 775166016 771894150 771313400 772526703 772745361 771980743
2109.1G71980743p76977o91910j63345L451614L003769j393738l218384K72675L523331
$$ 771980743 771203766 770511856 770348511 773800125 776803894 775410156 772191772 772464447 775987778
2117.8G75987778n10788k777176j166077N40314N58929k482376m91256L648910J085968
$$ 775987778 775476990 772699814 771533737 772074051 772632980 770150604 769659348 773308258 774394226
2126.5G74394226k477951p56302J159058p8049o76804J56250q42056k364502l81469
$$ 774394226 771916275 771159973 772319031 772240982 771564178 771720428 770878372 768513870 768132401
2135.1G68132401J823425J573791P43256J35117q07724J055984L327713j369171k550202
$$ 768132401 769955826 771529617 772272873 772407990 771600266 772656250 775983963 774614792 772064590
2143.8G72064590q95004k488708N74035L49961j240769J472931J338883J427993J099701
$$ 772064590 771169586 768680878 769254913 769604874 768364105 769837036 771175919 772603912 773703613
2152.5G73703613o35605q98895n52368j21841p54242j237564o35148M5166O85349J024322
$$ 773703613 773068008 772169113 771616745 771494904 770740662 769503098 768867950 768913116 769598465 770622787
2162.1G70622787K11792l2119J535949M08173p70721K007064J2284l140717l8452M96674
$$ 770622787 770834579 770802460 772338409 772746582 771975861 773982925 773995209 770854492 770816040 771312714
2171.8G71312714o41251P53326P42035J5793P21054N9281K12555L187027q64640k706909
$$ 771312714 770671463 771424789 772166824 772182617 772903671 772962952 773175507 776362534 775497894 772790985
2181.4G72790985J646042k02560K26745j03683r26667J866227k06757O89011J872863
$$ 772790985 774437027 774234467 774461212 774357529 773430862 775297089 775090332 775779343 777652206
2190.1G77652206J110383J116714j693802j313705Q1787M7989j330338j932526J68839
$$ 777652206 778762589 779879303 778185501 776871796 776953583 777001572 775671234 773738708 773907547
2198.8G73907547l967L47137J238709K489013K314072j681366j842117K28424M82178
$$ 773907547 773903580 774250717 775489426 777978439 780292511 778611145 776769028 776997452 777479630
2207.5G77479630P9345k81524R72366J484070r12018k150574R98154L029251K004242
$$ 777479630 777558975 777277451 778249817 779733887 778821869 776671295 777669449 780698700 782702942
2216.1G82702942P10449o43158m10919r3460p45163j608963j323319K12098K01263
$$ 782702942 783413391 782770233 782359314 782265854 781520691 779911728 778588409 778800507 779001770
2224.8G79001770N60226Q47168P06635J627350K89078p39365l70483j104279L84064
$$ 779001770 779561996 780409164 781115799 782743149 783032227 782292862 781922379 780818100 781202164
2233.5G81202164O73294j748047m35944l56216j044159J626511Q78677R03778J795807
$$ 781202164 781875458 780127411 779691467 779335251 778291092 779917603 780796280 781700058 783495865
2242.2G83495865k28577J89820m68674j410141n38483J63574P28684j480179q88367
$$ 783495865 783267288 783457108 782988434 781578293 781039810 781203384 781932068 780451889 779563522
2250.9G79563522J968003J295471J424179k0828k025605J895142K241592k795791k061615
$$ 779563522 781531525 782826996 784251175 784230347 782204742 784099884 786341476 783545685 781484070
2259.5G81484070L43323J9149M3183M16870J583099J621475o0653j142044n21088O50177
$$ 781484070 781827393 781846542 781889725 782306595 783889694 785511169 785450516 784308472 783787384 784437561
2269.2G84437561P26776N17731m6616q45031j188050j477127m59061J139451K75039
$$ 784437561 785164337 785682068 785635452 784790421 783602371 782125244 781666183 782805634 783080673
2277.9G83080673O70777K431335J85394j603775j792679j047821J368561K33460j444397
$$ 783080673 783751450 786182785 786368179 784764404 782971725 781923904 783292465 783525925 782081528
2286.5G82081528n05371J016159K056808p19299j501541K216110K263184k8229j789398
$$ 782081528 781576157 782592316 784649124 783929825 782428284 784644394 786907578 786879349 785089951
2295.2G85089951o91987J054917k876434j385270J803131p74993J005554Q46710j028900
$$ 785089951 784397964 785452881 782576447 781191177 782994308 782219315 783224869 784071579 783042679
2303.9G83042679J51214J023941J201935r50851j208038N9967K464523N05142l998032
$$ 783042679 783193893 784217834 785419769 784468918 783260880 783320847 785785370 786290512 782292480
2312.6G82292480j06582R00345p25174J414566J134109k373581k383957J720200K329559
$$ 782292480 782185898 783086243 782361069 783775635 784909744 782536163 780152206 781872406 784201965
2321.3G84201965M54026l730927k819366p1640k264557j604233m96140J611023J048127
$$ 784201965 784655991 780925064 778105698 778034058 775769501 774165268 773669128 775280151 776328278
2329.9G76328278J325607M245529K156220j906510n491180k953186L28598L224411
$$ 776328278 777653885 781899414 784055634 782149124 776657944 773704758 774033356 777257767
2337.7G77257767N5542j989136N744705J317673m704819l883667J025467O357422J029587
$$ 777257767 777313309 775324173 781068878 782386551 777681732 773798065 774823532 781180954 782210541
2346.3G82210541k328491j071015j835708l559418k21405K562179K702942Q128662
$$ 782210541 779882050 778811035 776975327 773415909 773194504 775756683 778459625 786588287
2354.1G86588287J578598r652938m711075K365341l26004j108322j12610k717285J312866
$$ 786588287 788166885 778513947 773802872 776168213 775842209 774733887 774621277 771903992 773216858
2362.7G73216858P87048l737869k155533L439179M197616K07520J275558K201996o24390
$$ 773216858 774003906 770266037 768110504 771549683 775747299 775954819 777230377 779432373 778807983
2371.4G78807983m363861k434692J269302Q88748M74015J308670J334457j631698k097397
$$ 778807983 774444122 772009430 773278732 774167480 774641495 775950165 777284622 775652924 773555527
2380.1G73555527p5302J527633K114868J75324n93491p79266j506577j478958k31476
$$ 773555527 773480225 775007858 777122726 777298050 776704559 775925293 774418716 772939758 772708282
2388.8G72708282j66702j06811J896286J200638J318283N80368r38416k66189j875992
$$ 772708282 772541580 772434769 774331055 775531693 776849976 777430344 776491928 776225739 774349747
2397.4G74349747m21906L29056k117615k46200J665268L22570J76468J066742M62113
$$ 774349747 773927841 774256897 772139282 771893082 773558350 773880920 774057388 775124130 775586243
2406.1G75586243j6632p18689J22757q02079k715835M14505j65024j994629l281O34308
$$ 775586243 775569611 774850922 774973679 774171600 771455765 771870270 771705246 769710617 769707336 770341644
2415.8G70341644l74222j368789P99103K792587J415634r85794j696548o17371j439133
$$ 770341644 769967422 768598633 769397736 772190323 773605957 772620163 770923615 770306244 768867111
2424.5G68867111k490845l10287J861877J139908o40793j146087J078720J7853j650162
$$ 768867111 766376266 766065979 767927856 769067764 768426971 767280884 768359604 768377457 766727295
2433.1G66727295J055374k74124j869354k439576j281662K435074l49426j138840K561875
$$ 766727295 767782669 767508545 765639191 763199615 761917953 764353027 764003601 762864761 765426636
2441.8G65426636K323303p95746j815338K14081q55026j564866N07584K51312r47113
$$ 765426636 767749939 766954193 765138855 765352936 764497910 762933044 763440628 763691940 762744827
2450.5G62744827o74209J20010l21197j801301j319580M38996j72272m54254M94919
$$ 762744827 762070618 762190628 761869431 760068130 758748550 759187546 759015274 758561020 759055939
2459.2G59055939J505813k39410l775406p14569Q90350j914673n55419J109695P50885
$$ 759055939 760561752 760322342 756546936 755832367 756722717 754808044 754252625 755362320 756113205
2467.8G56113205j33514J04827Q78678M99191m65012m11529J69830k025528k374496
$$ 756113205 755979691 756084518 756963196 757462387 756997375 756585846 756755676 754730148 752355652
2476.5G52355652r15146m91486J705017J179047j392670K01416K835541J165085j295090
$$ 752355652 751440506 750949020 752654037 753833084 752440414 752641830 755477371 756642456 755347366
2485.2G55347366j382064k207413j395416M16412N15213K25983o87943P00531J596603
$$ 755347366 753965302 751757889 750362473 750778885 751294098 751520081 750832138 751532669 753129272
2493.9G53129272L92457j60904j602021q58535o06690q67844Q41752j087037j600112
$$ 753129272 753521729 753360825 751758804 750900269 750293579 749425735 750267487 749180450 747580338
2502.6G47580338Q16268O03257l28827K50244R61151K63138o0578L56064N20249n13153
$$ 747580338 748396606 748999863 748671036 748921280 749882431 750145569 750084991 750441055 750961304 750448151
2512.2G50448151j397477q86154K01416P61338j152573j900253r90830J001129K867432
$$ 750448151 749050674 748164520 748365936 749127274 747974701 746074448 745083618 746084747 748952179
2520.9G48952179P28073k83050O10733q54111k495346o27823K73361j664200j888275
$$ 748952179 749680252 749397202 750007935 749153824 746658478 746030655 746304016 744639816 742751541
2529.6G42751541k70233K112808K85340k10190J681595j025391j552277o84433p26089
$$ 742751541 742481308 744594116 744879456 744669266 746350861 745325470 743773193 743088760 742362671
2538.2G42362671j363678k26898R14764j537094o61468j97297J583481L334885q71964
$$ 742362671 740998993 740772095 741686859 740149765 739488297 739291000 740874481 744209366 743337402
2546.9G43337402r71985J183930p43485j544723k12402k513352k745895n0202J331177
$$ 743337402 742365417 743549347 742805862 741261139 741048737 738535385 735789490 735739288 737070465
2555.6G37070465K710114j070786j625061K16904J58615J824417j133423j795883j356964
$$ 737070465 739780579 738709793 737084732 737301636 737460251 739284668 738151245 736355362 734998398
2564.3G34998398j151352K109604O74438j711960j91345J095200k554703j335449L095627
$$ 734998398 733847046 735956650 736631088 734919128 734727783 735822983 733268280 731932831 735028458
2573G35028458J10550j26419O01577j275177j612777j186142j96991l88871J080933
$$ 735028458 735139008 735012589 735614166 734338989 732726212 731540070 731343079 730954208 732035141
2581.6G32035141J599884r51538r31168J420899J262893j098175p26928q61130k457275
$$ 732035141 733635025 732683487 731752319 733173218 734436111 733337936 732611008 731749878 729292603
2590.3G29292603q15583J863404J393737j276397j938095m27781K852097L177185j100082
$$ 729292603 728477020 730340424 731734161 730457764 728519669 728091888 730943985 734121170 733021088
2599G33021088k455445k832184j799316J227951L56140m17938M05502o47049j312484
$$ 733021088 730565643 727733459 725934143 727162094 727518234 727100296 727505798 726858749 725546265
2607.7G25546265M86297K21710q06808J554031J601410J24741o55670j655579j796036
$$ 725546265 726032562 726254272 725447464 727001495 728602905 728727646 728071976 726416397 724620361
2616.4G24620361k35824J326980j846695j569900J112671j349182j371384m0436r58557
$$ 724620361 724384537 725711517 723864822 722294922 723407593 722058411 720687027 720646591 719688034
2625G19688034j499557K80609L84063q53805M82178R842J67694L66745n98526l57972
$$ 719688034 718188477 718469086 718853149 717999344 718481522 718491364 718659058 719025803 718427277 718069305
2634.7G18069305j04751L25928j177216j120682J65863M01230l97339k446670j217194
$$ 718069305 717964554 718290482 717113266 715992584 716158447 716559677 716162338 713715668 712498474
2643.4G12498474m63638q33969K56729J09253l56751P27158O84204j881027k086334
$$ 712498474 712034836 711200867 711457596 711566849 711210098 711937256 712621460 710740433 708654099
2652G08654099j316605j400223o57501Q34198J245575o4697j067582k110824J398697
$$ 708654099 707337494 705937271 705279770 706113968 707359543 707294846 706227264 704116440 705515137
2660.7G05515137K766876j121903m89959p65686j828308j905594j231690Q20694N5695
$$ 705515137 708282013 707160110 706670151 705904465 704076157 702170563 700938873 701759567 701815262
2669.4G01815262n12467o21948O34689J056061p59887n21164l89634L42713k62528
$$ 701815262 701302795 700680847 701315536 702371597 701611710 701090546 700700912 701043625 700781097
2678.1G00781097j998291j475753n66178L32337Q7127N45197J592636J063461O0730
$$ 700781097 698782806 697307053 696740875 697073212 697160339 697705536 699298172 700361633 700422363
2686.8G00422363j908645j326065M22515j030502n92422p05872k257385K62985Q58612
$$ 700422363 698513718 697187653 697610168 696579666 695987244 695281372 693023987 693286972 694145584
2695.4F94145584r75342n05905J379624J760253r92202j874008j31302L5171j755752
$$ 694145584 693170242 692664337 694043961 695804214 694812012 692938004 692806702 692841873 691086121
2704.1F91086121q16727J453476j64261j570282j464004M69131J946793n13230p71484
$$ 691086121 690269394 691722870 691558609 689988327 688524323 688993454 690940247 690427017 689655533
2712.8F89655533J718216Q7509l041000j30387Q98895j830749k75879J31073j845474
$$ 689655533 691373749 691461258 688420258 688289871 689188766 687358017 687082138 687213211 685367737
2721.5F85367737k137604M68063J452103K08511J546174M97512j806488k590713r12628
$$ 685367737 683230133 683698196 685150299 685358810 686904984 687402496 685596008 683005295 682092667
2730.2F82092667M25338j515960J541061J089630l855438p34406J259842J5564K71454
$$ 682092667 682518005 681002045 682543106 683632736 679777298 679042892 680302734 680318298 680589752
2738.8F80589752o77109K4338O46973j165390p19834N39399K44064N9204m61731m6921
$$ 680589752 679912643 679936981 680583954 679418564 678698730 679238129 679482193 679541397 679079666 679032745
2748.5F79032745Q51136O06384K71301k79159o92521j495208j974945n81284p16171
$$ 679032745 679883881 680490265 680761566 680482407 679789886 678294678 676319733 675738449 675022278
2757.2F75022278j617203J20316N01022j181946k29950J392517l61557j896209M06951
$$ 675022278 673405075 673525391 674026413 672844467 672614517 674007034 673645477 671749268 672156219
2765.8F72156219K085801R13467j90430j063156q25348N07660o6681j259536j527710
$$ 672156219 674242020 675155487 674965057 673901901 673076553 673584213 673517532 672257996 670730286
2774.5F70730286o12030J405563N03845o11801K12860j555023k628098j280288K52990
$$ 670730286 670118256 671523819 672027664 671415863 671628723 670073700 667445602 666165314 666418304
2783.2F66418304J764451J909179m23889j984634N94558j15280k646179o05392N16281
$$ 666418304 668182755 670091934 669668045 667683411 668277969 668162689 665516510 664911118 665427399
2791.9F65427399K15912m17252J95084Q8577j377411k14386j154785o39954P84073
$$ 665427399 665643311 665226059 665421143 665509720 664132309 663917923 662763138 662123184 662907257
2800.5F62907257o78635j37634j454239j477585L71247o1569J178970k19040k508240
$$ 662907257 662228622 662090988 660636749 659159164 659530411 659468842 660647812 660428772 657920532
2809.2F57920532q41980M82178Q69675n06363j890717L28751J131058j125260j182785
$$ 657920532 657078552 657560730 658430405 657924042 656033325 656362076 657493134 656367874 655185089
2817.9F55185089l29208j164551r45587m76685j424408q32596Q22449L85590n73502
$$ 655185089 654855881 653691330 652745743 652269058 650844650 650012054 650834503 651220093 650646591
2826.6F50646591l88870q39386p11823k5939r22165j029282j796799j431884J771240
$$ 650646591 650257721 649418335 648706512 648680573 647758408 646729126 644932327 643500443 645271683
2835.3F45271683L29284q96835R35211m49600j933670j731567r71375r91440j156120
$$ 645271683 645600967 644704132 645639343 645189743 643256073 641524506 640553131 639561691 638405571
2843.9F38405571K76604N68885j636886l302155m07142L43551k135124M21486n89752
$$ 638405571 638682175 639251060 637614174 634312019 633904877 634248428 632113304 632534790 631945038
2852.6F31945038l321228J426430J994323p23037J58958j225739j821632m74510j547012
$$ 631945038 628623810 630050240 632044563 631321526 631480484 630254745 628433113 627958603 626411591
2861.3F26411591k637825j38245K263756n95589k294083j586036j355248l89137j278343
$$ 626411591 623773766 623635521 625899277 625303688 623009605 621423569 620068321 619679184 618400841
2870F18400841m32816P47071j050377j762810j465187j144066k427254j982269O95343
$$ 618400841 617968025 618715096 617664719 615901909 614436722 613292656 610865402 608883133 609578476
2878.7F09578476P42416M34647K80495j31607p28569j076584N66215N12963j936074
$$ 609578476 610320892 610755539 611036034 610904427 610175858 609099274 609665489 610178452 608242378
2887.3F08242378k499618J47628K110177j384774m124221j014901J117554J353683
$$ 608242378 605742760 605890388 608000565 606615791 602491570 601476669 602594223 603947906
2895.1F03947906R27392j386147j619759q39347j543999L08647K358208k11563j199341
$$ 603947906 604875298 603489151 601869392 601030045 599486046 599794693 602152901 601941338 600741997
2903.7F00741997l72505p04079P34978l07541j469879L48854N0048j135444J52778
$$ 600741997 600369492 599665413 600400391 600092850 598622971 598971825 599021873 597886429 598039207
2912.4E98039207J379548k081528k871895k99797k13470J022605j268730k771682J98211
$$ 598039207 599418755 597337227 594465332 594165535 593952065 594974670 593705940 590934258 591132469
2921.1E91132469k011108l421898O79588K631455N37567o20766J195526K370148j42975
$$ 591132469 589121361 585699463 586379051 589010506 589548073 588927307 590122833 592492981 592350006
2929.8E92350006k770157j562881J1902q50182j497955P18727K818985J959991N77202
$$ 592350006 589579849 588016968 588028870 587178688 585680733 586399460 589218445 591178436 591755638
2938.5E91755638N19829J550636O72760j875915j31302K832260J332169j83182k30026
$$ 591755638 592275467 593826103 594498863 592622948 592491646 595323906 596656075 596472893 596242867
2947.1E96242867Q52623J758613R2468O90422O96488n71098L1929l27340L039284M780235
$$ 596242867 597095490 598854103 598946571 599636993 600333481 599762383 599794312 599466972 602506256 607286491
2956.8F07286491L99819j447945q79898J19400q48083j368180K215462K520714J231155
$$ 607286491 607686310 606238365 605358467 605477867 604629784 603261604 605477066 607997780 609228935
2965.5F09228935K655754J730004m07067n95665O29311Q99658L73535O99158p96242
$$ 609228935 611884689 613614693 613207626 612611961 613241272 614140930 614514465 615213623 614417381
2974.1F14417381O65627M221725J112099k034645L81470L273887J945915j654396j695251
$$ 614417381 615083008 619304733 620416832 618382187 618763657 622037544 623983459 622329063 620633812
2982.8F20633812J526604K082710j946411j849938J768303J040802M26216J343384
$$ 620633812 622160416 624243126 622296715 620446777 622215080 623255882 623682098 625025482
2990.5F25025482L48740o60057N37910J504441J366157J399269p41310k402420l82080
$$ 625025482 625374222 624714165 625252075 626756516 628122673 629521942 628780632 626378212 625996132
2999.2F25996132Q44269o85425r37920N42336M64325J30882P79724J309700J824913
$$ 625996132 626840401 626154976 625217056 625759392 626223717 626354599 627134323 628444023 630268936
3007.9F30268936P69386j662674p49626R71489j695594k169457M01688N16166l15399
$$ 630268936 631038322 629375648 628626022 629597511 627901917 625732460 626134148 626650314 626334915
3016.6F26334915k325592j519661K176895p61604l957939j108246J364098K647857
$$ 626334915 624009323 622489662 624666557 623904953 619947014 618838768 620202866 622850723
3024.3F22850723P39098j939545j22337J227913n47829j780510j324615j820298K02065
$$ 622850723 623589821 621650276 621527939 622755852 622208023 620427513 619102898 617282600 617484665
3033F17484665J646080j361351j615257k420884k899055N21584J575393l91426p44858
$$ 617484665 619130745 617769394 616154137 613733253 610834198 611355782 612931175 612539749 611794891
3041.6F11794891K77710j410942l23906N87807j176453n30929j292458p44552j862946
$$ 611794891 612072601 610661659 610337753 610925560 609749107 609218178 607925720 607181168 605318222
3050.3F05318222k341728j65634j93405J618118k82097q70895l80784j768913J285210
$$ 605318222 602976494 602810860 602617455 604235573 603953476 603082581 602701797 600932884 602218094
3059F02218094q54569j236267J250153j715660j858711O60171J011887k443543j729660
$$ 602218094 601363525 600127258 601377411 599661751 597803040 598463211 599475098 597031555 595301895
3067.7E95301895K085304q02269k120361R4338r27163k557563j225129J299668J450195
$$ 595301895 597387199 596584930 594464569 594558907 593631744 591074181 589849052 591148720 592598915
3076.4E92598915n47905o69556o15959j336937P79610J014061j092453k235680l026161
$$ 592598915 592051010 591381454 590765495 589428558 590208168 591222229 590129776 587894096 584867935
3085E84867935j786766l12042J0681N4932P95059M78325j749726j232757J92909O1226
$$ 584867935 583081169 582769127 582779808 582834740 583629799 584108124 582358398 581125641 581318550 581379776
3094.7E81379776n76057j642151p78885J194725J022644j401711k144889r08967o72149
$$ 581379776 580803719 579161568 578382683 579577408 580600052 579198341 577053452 576144485 575472336
3103.4E75472336l30582J35727J23520p12776m63753R36546j243858k759285j904678
$$ 575472336 575141754 575277481 575401001 574688225 574224472 575161018 573917160 571157875 569253197
3112E69253197k12479L063049J184388j881180q61321m74395q25158j265678j79215
$$ 569253197 569040718 572103767 573288155 571406975 570545654 570071259 569246101 567980423 567801208
3120.7E67801208k44255j904640K35596J519928j327286k310181L3494O40373o52733
$$ 567801208 567556953 565652313 565887909 567407837 566080551 563770370 563803864 564444237 563791504
3129.4E63791504l39661P85637p99408k660713j295319N82276J657600q9607k223015
$$ 563791504 563451843 564237480 563438072 560777359 559482040 560064316 561721916 561632309 559409294
3138.1E59409294k301216o04706J931076r75990j806908J229019p40470k425957j403847
$$ 559409294 557108078 556503372 558434448 557458458 555651550 556880569 556140099 553714142 552310295
3146.8E52310295N31921Q49381J65710J039734M42543j098632j644516p57142p21397
$$ 552310295 552842216 553691597 553857307 554897041 555339584 554240952 552596436 551839294 551117897
3155.4E51117897j068039J006889J865960r1362k116394k748909q10738L05786j379623
$$ 551117897 550049858 551056747 552922707 552831345 550714951 547966042 547155304 547461090 546081467
3164.1E46081467l17307m40864j236344N72205p71828m17175L54233L52287N68504
$$ 546081467 545764160 545323296 544086952 544659157 543887329 543470154 543824387 544176674 544745178
3172.8E44745178j542282m61693m67910q55065J11771k39144J261216L32603j562271
$$ 544745178 543202896 542741203 542273293 541418228 541529999 541290855 542552071 542884674 541322403
3181.5E41322403r24721l77388j663132k562828p20024K153435K528915p03620k267380
$$ 541322403 540397682 540020294 538357162 535794334 535074310 537227745 539756660 539053040 536785660
3190.1E36785660j664200J118545J549454j147575n90706r48334j52588q51059k085876
$$ 536785660 535121460 536240005 537789459 536641884 536051178 535102844 534950256 534099197 532013321
3198.8E32013321M47998J30081j81312r48067L1052J439857p36427q75740p07856j667251
$$ 532013321 532461319 532591400 532410088 531462021 531493073 532932930 532196503 531320763 530612907 528945656
3208.5E28945656j968079J088066K153511q9950r74121j451111k32201j545906j257095
$$ 528945656 526977577 528065643 530219154 530129204 529155083 527703972 527471771 525925865 524668770
3217.2E24668770m94957k441521K66915O05087j1254J018677k32773M32663O88858
$$ 524668770 524173813 521732292 521999207 522604294 522593040 523611717 523378944 523811607 524500465
3225.8E24500465k37121Q6250l1853Q09784J398011j402817k057495j260910j637116
$$ 524500465 524263344 524349594 524317741 525127525 526525536 525122719 523065224 521804314 520167198
3234.5E20167198l41453L50074J76354q97141l4103J001739j054496k33193N31311
$$ 520167198 519825745 520175819 520352173 519455032 519420929 520422668 519368172 519134979 519666290
3243.2E19666290n88951j81579O37474p2976o59561j09443m04511q38623j813393q30917
$$ 519666290 519077339 518895760 519533234 519460258 518800697 518691254 518286743 517448120 515634727 514803810
3252.8E14803810P32575P70301N80788j387901j561432q25806Q34122J688957j08566
$$ 514803810 515536385 516306686 516887474 515499573 513938141 513112335 513946457 515635414 515526848
3261.5E15526848m83513j650772K53677J411934n93529k88658j580581j008454K67182
$$ 515526848 515043335 513392563 513646240 515058174 514464645 514175987 512595406 511586952 511854134
3270.2E11854134p0000P78885O47430r39979j781922M5662j578369j514358L594398
$$ 511854134 511784134 512563019 513210449 512270470 510488548 510534210 508955841 507441483 511035881
3278.9E11035881J776924j873207j771278l92990P00683j62773J03607j002807j48621
$$ 511035881 512812805 510939598 509168320 508775330 509476013 509313240 509416847 508414040 508265419
3287.5E08265419K227211j569901k736892P60765J225395J30196K09350j421013k982139
$$ 508265419 510492630 508922729 506185837 506946602 508171997 508302193 508511543 507090530 504108391
3296.2E04108391m53453o59333j491470K132530K440224l33137j879349j091805P73773
$$ 504108391 503654938 502995605 501504135 503636665 506076889 505743752 503864403 502772598 503546371
3304.9E03546371N86396k70386j612511j652984P18574J37673L9787K595177M93126
$$ 503546371 504132767 503862381 502249870 500596886 501315460 501453133 501492920 504088097 504581223
3313.6E04581223k228699j743660j381531q87604j134529J022644K313004m43154j024589
$$ 504581223 502352524 500608864 499227333 498339729 497205200 498227844 500540848 500097694 499073105
3322.3D99073105j811524o90040J493187j170082j037636M22058j45378M59862p69349
$$ 499073105 497261581 496571541 498064728 496894646 495857010 496279068 496133690 496593552 495824203
3330.9D95824203n81436J596260M32663j958961p77550J681519J59340j165505r98802
$$ 495824203 495242767 496839027 497271690 495312729 494535179 496216698 496376038 495210533 494211731
3339.6D94211731o50673n57671j840095J25008M71763L21694K359771j249199k760810
$$ 494211731 493561058 493003387 491163292 491288300 491760063 492081757 494441528 493192329 490431519
3348.3D90431519l31307r51614n81055J371079j271210l579102m74357N99174K088967
$$ 490431519 490100212 489148598 488567543 489938622 488667412 485088310 484613953 485213127 487302094
3357D87302094J306877k748032r50241L29056o10657k36778M69818J37215K46162J735725
$$ 487302094 488608971 485860939 484910698 485239754 484629097 484392319 484862137 484999352 485245514 486981239
3366.6D86981239m66423k721138j432571J933098R75189k520828o44265n90896p49817
$$ 486981239 486514816 483793678 482361107 484294205 485269394 482748566 482104301 481513405 480763588
3375.3D80763588P29332J10474m81148o42166P04116p94868k538185q81386n9318J446991
$$ 480763588 481492920 481603394 481122246 480480080 481184196 480389328 477851143 476969757 476910439 478357430
3384.9D78357430K469062J890030O22254j150513j331711k319031l360138j525993
$$ 478357430 480826492 482716522 483338776 482188263 480856552 478537521 475177383 473651390
3392.7D73651390Q29201K874222J116829k494545j538353J58996K021790J67083l983917
$$ 473651390 474480591 477354813 478471642 475977097 474438744 474597740 476619530 476786613 472802696
3401.3D72802696j384811J505356K172088Q59642p35092Q29811l80554j628418n81283
$$ 472802696 471417885 472923241 475095329 475954971 475219879 476049690 475669136 474040718 473459435
3410D73459435k316285k344589J197472K090072J390534l61786k849617j439705R68094
$$ 473459435 471143150 468798561 469996033 472086105 473476639 473114853 470265236 468825531 469793625
3418.7D69793625J434860j85432K99377K424889N2490j510353j655083k040481L88336
$$ 469793625 471228485 471043053 471342430 473767319 473819809 472309456 470654373 468613892 469002228
3427.4D69002228L076782J185837l539887k636680K673492L071137k26441j032104
$$ 469002228 472079010 473264847 469724960 467088280 469761772 472832909 472606468 471574364
3435.1D71574364j173859l56750J614646M45748M03061l03803l031730k043343J65443
$$ 471574364 470400505 470043755 471658401 472104149 472507210 472203407 469171677 467128334 467293777
3443.8D67293777J240807J297569L63884j077194j60141J539040o70433p10602K306518
$$ 467293777 468534584 469832153 470196037 469118843 468958702 470497742 469827309 469116707 471423225
3452.5D71423225K15607k009773J650657K232972j709442j742707J08185J130982N79261
$$ 471423225 471638832 469629059 471279716 473512688 471803246 470060539 470168724 471299706 471878967
3461.1D71878967j506920r97238J109696O36749j541557p29065J702919J266136M22172
$$ 471878967 470372047 469374809 470484505 471121254 469579697 468850632 470553551 471819687 472241859
3469.8D72241859N53627J35918j201286j855660n30586J49040J79215P16247k3727
$$ 472241859 472795486 472931404 471730118 469874458 469343872 469492912 469672127 470388374 470364647
3478.5D70364647K28119J017799M11492k13852k64435K591209L187905m4098p69806
$$ 470364647 470592766 471610565 472022057 471808205 471543770 474134979 477322884 477278786 476508980
3487.2D76508980j699486j494980K77367j07041N71328O39114j225319j242294N94215
$$ 476508980 474809494 473314514 473591881 473484840 474056168 474695282 473469963 472227669 472821884
3495.8D72821884J396370M38233o35643o06881N40161k21481j787643K26745L239365
$$ 472821884 474218254 474656487 474020844 473413963 473954124 473732643 471945000 472171745 475411110
3504.5D75411110J853790k197685o01578N122376M043960k972641k522087R02710p08885
$$ 475411110 477264900 475067215 474465637 479588013 483631973 480659332 478137245 479039955 478331070
3513.2D78331070l66669M48761j430664K41623J232987N69305N34744Q37860J211357
$$ 478331070 477964401 478413162 476982498 477224121 478457108 479026413 479561157 480399017 481610374
3521.9D81610374j103096k840995l50800K591858N81474P84302K748413j260223r0065
$$ 481610374 480507278 477666283 477315483 479907341 480488815 481273117 484021530 482761307 482671242
3530.6D82671242L52134M25568J322670j250458K428818J753235k806053N2948K01568
$$ 482671242 483023376 483448944 484771614 483521156 485949974 487703209 484897156 484950104 485151672
3539.2D85151672j076278J252708L584557q80394k517624J376877R97619J297608K142067
$$ 485151672 484075394 485328102 488912659 488032265 485514641 486891518 487889137 489186745 491328812
3547.9D91328812N91545j398850J003266n1957m911766j223564N16281L818932K132149
$$ 491328812 491920357 490521507 491524773 491472816 486561050 485337486 485853767 489672699 491804848
3556.6D91804848p67708J997757M53300L005257J173973k497101j358871p78809L550072
$$ 491804848 491037140 493034897 493488197 496493454 497667427 495170326 493811455 493032646 496582718
3565.3D96582718j905632l392143M598770p2937l31803P83997K034950J978836J844178
$$ 496582718 494677086 491284943 495883713 495810776 495478973 496262970 498297920 500276756 502120934
3574E02120934k68288k954254M51851J800422R19686j633721j946640K023278K753753
$$ 502120934 501852646 498898392 499350243 501150665 502070351 500436630 498489990 500513268 503267021
3582.6E03267021J141052O12183K076225k183075k167511K855454j521530K228164
$$ 503267021 504408073 505020256 507096481 504913406 502745895 505601349 504079819 506307983
3590.4E06307983M102631L118057k20184l934898n56717J567955M169845J130371l074073
$$ 506307983 510410614 513528671 513308487 509373589 508816872 510384827 514554672 515685043 512610970
3599E12610970J203537J812515K095604L213653N27649p96623J960182J957092m234199
$$ 512610970 513814507 515627022 517722626 520936279 521463928 520667305 522627487 524584579 520350380
3607.7E20350380J194878M738121p71485K922020q964l549462L257485J1902K972641
$$ 520350380 521545258 526283379 525511894 528433914 528424950 524875488 528132973 528144875 531117516
3616.4E31117516M900589j506386j41640j407928j91918J504250J419258M437904L070603
$$ 531117516 536018105 534511719 534370079 532962151 532770233 534274483 535693741 540131645 543202248
3625.1E43202248r00956r02023N451622N516586j0238609r49783M837303Q172874R04084
$$ 543202248 542301292 541399269 546850891 552367477 542128868 541179085 546016388 554189262 555093346
3633.8E55093346n655175Q81691J618271K839203J582794j299858L87917J749878J112632
$$ 555093346 549438171 550319862 551938133 554777336 556360130 555060272 555448189 557198067 558310699
3642.4E58310699n59120N7335M189644N614471l424034k332649N373421K442245m207687
$$ 558310699 557751579 557808914 561998558 567613029 564188995 561856346 567229767 569672012 565464325
3651.1E65464325k271614O129379M176331L614235M293747n150567J185685L264541
$$ 565464325 563192711 569322090 573498421 577112656 581406403 576255836 577441521 580706062
3658.8E80706062K695847J268043j052436K580566j61972Q19397L404312m58260L116913
$$ 580706062 583401909 584669952 583617516 586198082 586036110 586855507 590259819 589801559 592918472
3667.5E92918472K977066q22754L80822p277794K945709P948227P826881L747712j5066529
$$ 592918472 595895538 595072784 595453606 588175812 591121521 599069748 606896629 610644341 595577812
3676.2E95577812Q25730P691536N481071k936058j082382K664757K9678Q21113J601601
$$ 595577812 596403542 604095078 609576149 606640091 605557709 608222466 608252144 609073257 610674858
3684.9F10674858J146622L244247N933914o999588m525032J0587273m771652l857079
$$ 610674858 611821480 615065727 620999641 614000053 609475021 620062294 615290642 611433563
3692.6F11433563L832131J514244L871574K796707Q61588l543968l336144K718773
$$ 611433563 615265694 616779938 620651512 623448219 624309807 620765839 617429695 620148468
3700.3F20148468L553162O88438k078819K316017J727142P56912j111907k55776N008354
$$ 620148468 623701630 624390068 622311249 624627266 626354408 627111320 625999413 625743637 630751991
3709F30751991n082512M339600N223885j3521805M643440L072929o4048O0272J43814
$$ 630751991 625669479 630009079 635232964 621711159 626354599 629427528 629363480 629423752 629567566
3717.7F29567566J369286l078919o96716O072273O21719m688606L242493j51634j594620
$$ 629567566 630936852 627857933 627161217 633233490 633855209 629166603 632409096 632257462 630662842
3726.3F30662842j242981N93147K344246o83670Q714142N264282j3917541n94178k21901
$$ 630662842 629419861 630013008 632357254 631673584 640387726 645652008 631734467 631140289 630918388
3735F30918388k207069p24907L477936M295082J810188j106300n792771K777253J0508957
$$ 630918388 628711319 627986412 631464348 635759430 637569618 636463318 630670547 633447800 643956757
3743.7F43956757o699982j3683815Q315468M027137O653710J621475j0615044O933403
$$ 643956757 637256775 623572960 631888428 635915565 642569275 644190750 633575706 640509109
3751.4F40509109p777786l831558P415581M985618J741333p127761L220367P951126
$$ 640509109 632731323 628899765 636315346 641300964 643042297 635914536 639134903 647086029
3759.1F47086029o812744o749344L923454M103508m25796K391357k874603k585106
$$ 647086029 640273285 633523941 637447395 641550903 641125107 643516464 640641861 638056755
3766.8F38056755M955864K753525l690567q510132M102859L252945j372337K88429
$$ 638056755 643012619 645766144 642075577 633565445 637668304 640921249 639548912 639837341
3774.5F39837341J212769K067337J73416K004318q85696o835785K878036L288193K618637
$$ 639837341 641050110 643117447 643290863 645295181 644409485 637573700 640451736 643739929 646358566
3783.2F46358566K131348m526672l468094L68194J518097J722717M883p01523q23822
$$ 646358566 648489914 643963242 640495148 640863342 642381439 644104156 644109039 643407516 642583694
3791.9F42583694m23889P27082K453155L995667k563706p711639J58806O308250Q236465
$$ 642583694 642159805 642886887 645340042 649335709 646772003 639060364 639219170 645527420 653763885
3800.6F53763885o541595j2233429M897194K928505M252167N007858j1301575k586441
$$ 653763885 647222290 634988861 639886055 642814560 647066727 652074585 640773010 638186569
3808.3F38186569M985733O80619m97895Q10089K475739K323456O418152J107635j6852226
$$ 638186569 643172302 643852921 643355026 644165115 646640854 648964310 655382462 656490097 639637871
3817F39637871L406944N642242M756699M526138j3895416j682892L594513K894898
$$ 639637871 643044815 648687057 653443756 657969894 644074478 642391586 645986099 648880997
3824.7F48880997J489639m300308n119705K111511K029037K282868J340484o560974
$$ 648880997 650370636 646070328 640950623 643062134 645091171 647374039 648714523 642153549
3832.4F42153549M440766P401733o837769j786804O535645j2100983n158348J4355736
$$ 642153549 646594315 653996048 647158279 645371475 651907120 639806137 634647789 649003525
3840.1F49003525M67682l157349O199341j382294o218262j087799J455078Q48160r04007
$$ 649003525 649471207 646313858 652513199 651130905 644912643 643824844 645279922 646128082 645224075
3848.8F45224075j284408J326065L274231N480270J3607330k7345275n447541J2647171
$$ 645224075 643939667 645265732 648539963 654020233 667627563 640282288 634834747 647481918
3856.5F47481918j188430m267121K668534K967376L904038l610230p34024P163391
$$ 647481918 646293488 642026367 644694901 647662277 651566315 647956085 647222061 654385452
3864.2F54385452p649078q939705M487495P690506R267807o674575j2293168J817399
$$ 654385452 646736374 637796669 642284164 649974670 659242477 652567902 640274734 642092133
3871.9F42092133O265029M947587q097992J83334K475433q31756J080932J554108m302521
$$ 642092133 648357162 653304749 645206757 645390091 647865524 647033768 648114700 649668808 645366287
3880.6F45366287m850616L422165J13144K185897M510651q245926Q83179J586456Q96073
$$ 645366287 640515671 643937836 644050980 646236877 650747528 642501602 643384781 644971237 645867310
3889.3F45867310M177169n03158p733231n79376L527298R38263K303162j006928R10950
$$ 645867310 650044479 649541321 641808090 641228714 644756012 645694275 647997437 646990509 647901459
3898F47901459L512344j2177582M564514N190506p036438N881196o81305n602265j839218
$$ 647901459 651413803 639236221 643800735 648991241 641954803 647835999 647154694 641552429 639713211
3906.7F39713211P43027L061523O65970J104202r00116k735290j0300K295685K281570
$$ 639713211 640456238 643517761 644183731 645287933 644387817 641652527 641642227 643937912 646219482
3915.3F46219482M52881k187500j158752M349060j51596m343643L206024J570892l19366
$$ 646219482 646672363 644484863 643326111 647675171 647523575 643179932 646385956 647956848 647637482
3924F47637482j556321l606491K49482j060181J148682K956466j864853o63223j144638
$$ 647637482 646081161 642474670 642724152 641663971 642812653 645769119 643904266 643241043 642096405
3932.7F42096405l190918J36948K280502N14221P45239K364655q46863j237564K916412
$$ 642096405 638905487 639042435 641322937 641837158 642582397 644947052 644100189 642862625 645779037
3941.4F45779037J949997l674774l235550j541443J862488L925171p36618J128388
$$ 645779037 647729034 644054260 640818710 639277267 641139755 645064926 644328308 645456696
3949.1F45456696j53122n970498M70429J615334j503029J768379K162323j076737j824264
$$ 645456696 645303574 639333076 639803505 641418839 639915810 641684189 643846512 642769775 640945511
3957.8F40945511n75028m35333J555710J286240m115677o71730K911415q78906o4011
$$ 640945511 640370483 639935150 641490860 642777100 638661423 637989693 640901108 640022202 639958191
3966.5F39958191J373062K89383j562042o22902K812233k13089n77240K7923l179931
$$ 639958191 641331253 641620636 640058594 639435692 642247925 642034836 641457596 641485519 638305588
3975.1F38305588q42018J680641J360779k73285o19660j44195p04766m40101m00048
$$ 638305588 637463570 639144211 640504990 640231705 639612045 639467850 638763084 638322983 637922935
3983.8F37922935J449585L27149j665459L74451J88866r05152q25386M7455J134987
$$ 637922935 639372520 639699669 638034210 638408661 638597527 637692375 636866989 636914444 638049431
3992.5F38049431j24169j090927J513825J993027K42538N9662J39847J47934
$$ 638049431 637925262 636834335 638348160 640341187 640583725 640643387 640783234 640931168
4000.2F40931168
$$ 640931168
##END=$$ End of the data block
