##TITLE=$$ Begin of the data block
##JCAMP-DX=5.00 $$ ACD/SpecManager v 10.08
##SPECTROMETER/DATA SYSTEM=Varian
##DATE=19 Mar 2013 10:04:26
##DATA TYPE=INFRARED SPECTRUM
##DATA CLASS=XYDATA
##ORIGIN=
##OWNER=
##NPOINTS=3735
##FIRSTX=399.26403809
##LASTX=4000.35498047
##MAXX=4000.35498047
##MINX=399.26403809
##MAXY=91.99309540
##MINY=37.50233841
##XFACTOR=1.0000000000
##YFACTOR=0.000000100000000
##FIRSTY=49.98777390
##DELTAX=0.96440572
##XUNITS=1/CM
##YUNITS=TRANSMITTANCE
##XYDATA=(X++(Y..Y))
399.3D99877739R0954628Q4748230p8856392j20466728n2679711N2501069l9008599
$$ 499877739 590832367 675580597 596724205 476257477 423577766 476078835 437070236
406D37070236K4539948R2691154J51977959K13651657o1174774k44804955M0446205
$$ 437070236 461610184 554301338 706279297 919930954 858756180 613951225 654397430
412.8F54397430K24142304n6875076o1835709K018433L0741806k371903k41290932
$$ 654397430 878539734 821664658 759828949 761847382 792589188 790217285 548926353
419.5E48926353J3054200J1819648J34808121N39780j33022042N9125939k1802254
$$ 548926353 561980553 573800201 708608322 709148102 576126060 635251999 613449745
426.3F13449745J01341210Q5285492j43925248j07039795k8092155K2023888M3140907
$$ 613449745 714790955 800076447 656151199 549111404 521019249 543043137 586184044
433E86184044R4982262k5678559j6579094R2742882J3139267q7725906r8434182O6350403
$$ 586184044 681166306 655487747 638908653 731651535 744790802 657064896 558630714 624981117
440.7F24981117n7141075j92816658N1232987J38491401K3106003M2403107K8029556
$$ 624981117 567840042 375023384 426256371 564747772 587853775 630256882 658286438
447.5F58286438j15326614k4979363M4233055L0676651Q0462570M5085297r7753982
$$ 658286438 542959824 517980461 562213516 592890167 673352737 718438034 620684052
454.2F20684052m8823319R2666855k3273621k7670479O3730355K3870468L8773117
$$ 620684052 571860733 664527588 641253967 613583488 677313843 701184311 739957428
461G39957428j24776955m5662231O6673202Q4311333J19717636k0239715j03323899
$$ 739957428 615180473 569518242 636191444 720502777 840220413 819980698 716656799
467.7G16656799j57036361j13017807k5904122O3981514J18831673l9664421L0763893
$$ 716656799 559620438 446602631 420698509 484680023 603511696 563847275 594611168
474.5E94611168M1035080L080635j096077o8191719J924782L3127594J3626136J7797661
$$ 594611168 635646248 638726883 637630806 569439087 571363869 604491463 618117599 635915260
482.2F35915260o5571747j11685714L5299034J56810608O2617492Q812027M7687531
$$ 635915260 570343513 458657799 493956833 650767441 713384933 722196960 769884491
489G69884491o6239166o2685547l8049469p8950730j9687385N9295959J24086113M2265778
$$ 769884491 703645325 640959778 602910309 523959579 504272194 563568153 687654266 729920044
496.7G29920044n9625168K0345612l8641129r0581665l3851967j6015281j1302376
$$ 729920044 670294876 690640488 651999359 561417694 527565727 511550446 500248070
503.4E00248070m5908051m250488J12545357P6281128k8563614n474625j0560074j505546
$$ 500248070 454340019 450089531 562634888 638916016 610352402 604877777 594317703 592812157
511.1E92812157J9038353j9364701J5924530L5730973J3138656k9575996p8254357
$$ 592812157 611850510 592485809 608410339 644141312 657279968 627703972 549449615
517.9E49449615M386483K6786537K5710373M4142456j4928436p381211J3295594k6586190
$$ 549449615 553836098 580622635 606333008 650475464 635547028 628165817 641461411 614875221
525.6F14875221k2915077N570K1086082n720520l3679733J8386421p69234l7872047
$$ 614875221 591960144 591965714 613051796 607331276 573651543 592037964 591268730 553396683
533.3E53396683o30951N959434J0835724J6828728n2033r347114j2087631J8676452
$$ 553396683 552765732 558725166 569560890 586389618 586337585 576990471 564902840 583579292
541E83579292M7775231Q635482l4231872r843903J767502j4949112O664467J0879631
$$ 583579292 631354523 639990005 605758133 595914230 597681732 582732620 589397087 600276718
548.7F00276718m185638J5064697K5837975L702430p193985j8577194j3438759J5907326
$$ 600276718 596091080 611155777 636993752 640696182 633502197 614925003 601486244 617393570
556.5F17393570R239540L77846j0013809k8038636J4654198K1246033k7852326J832772
$$ 617393570 626633110 627010956 616997147 588958511 603612709 624858742 597006416 598839188
564.2E98839188J8088264n870933K6957473M029312m5227546p83501J0685120l0152359
$$ 598839188 616927452 611056519 638013992 642043304 596815758 596032257 606717377 576565018
571.9E76565018q356819K8143272J8422012j5952072j2630958K1861076n436020k2903328
$$ 576565018 568208199 596351471 614773483 598821411 586190453 608051529 602615509 579712181
579.6E79712181J6680832K1121941j7100335l1230125J6989174K2538414j8573990
$$ 579712181 596393013 617514954 600414619 569184494 586173668 608712082 590138092
586.4E90138092J5641670J4698334j3323860P003708L843841k9225349j5492287K5008278
$$ 590138092 605779762 620478096 607154236 614157944 618001785 588776436 573284149 598292427
594.1E98292427J0244331l168373J5124665P898826J574173k973785j3120308j5545883
$$ 598292427 608536758 605368385 620493050 628391876 629966049 626992264 613871956 598326073
601.8E98326073M036712J7037468P113953J623650j5425225r769478J1766472R524422
$$ 598326073 602362785 619400253 626514206 628137856 612712631 602943153 614709625 624234047
609.5F24234047P056618K104149j5435677k2038155l46450O62002k96478K4860115
$$ 624234047 631290665 633394814 617959137 595920982 595574532 596236534 595940056 620800171
617.2F20800171O933327j4133492N257034K6339341p096138k7597351R034385l108940
$$ 620800171 627733498 613600006 618857040 645196381 638100243 610502892 619537277 616428337
624.9F16428337o527862R499816j5124626J137276K3643799J9357643M902573j1884156
$$ 616428337 609900475 619400291 604275665 605412941 629056740 648414383 653316956 641432800
632.7F41432800j0208664R581986K0239487k0249482k1798057J5774383J5505867q47015
$$ 641432800 631224136 640806122 661045609 640796127 618998070 634772453 650278320 649431305
640.4F49431305j8514137j4532585J2765464K7176781N932007j1354370j3721428j2341805
$$ 649431305 630917168 616384583 629150047 656326828 662258835 650904465 637183037 624841232
648.1F24841232P601128j991959j3935013l995361N357895O708183N466729R640731
$$ 624841232 632442360 630450401 616515388 612520027 617877922 624586105 630052834 639693565
655.8F39693565j4617157p295570J5408096L613625O9885m445381R838486J2532272
$$ 639693565 625076408 617780838 633188934 636802559 636872444 632427063 642265549 654797821
663.5F54797821n774155j7983741j4507523K0112991L4481240k3551483j8761521j9564705
$$ 654797821 649023666 631039925 616532402 636645393 671126633 647575150 628813629 609248924
671.2F09248924O267548J5140800O092606J905441J0897064j057281j5229302M381447
$$ 609248924 615516472 630657272 636749878 638655319 649552383 648495102 633265800 637647247
678.9F37647247K500077O301574J3970871o938095k2248649r526101J6418763Q891678
$$ 637647247 640147324 646448898 660419769 653481674 631233025 621706924 638125687 647017365
686.7F47017365j3040658p594223R312439J2054634J724549m934769K687302J4671249
$$ 647017365 633976707 626382484 635694923 647749557 649474106 644539337 647226639 661897888
694.4F61897888k263717j7607956l419228Q250160R550171p127838j4724617l037186
$$ 661897888 659634171 642026215 638606987 646857147 656407318 649279480 634554863 631517677
702.1F31517677K115135L750153N62897J667785l149337k739678Q124886n447693j2580872
$$ 631517677 633632812 637382965 637945862 639613647 636464310 633724632 641849518 636401825 623820953
710.8F23820953O22368Q248520J218147m596099k961159n195160M026451J2017212
$$ 623820953 624443321 632691841 633909988 629313889 626352730 621157570 625184021 637201233
718.5F37201233J6395187J0395432j1437760n464935J2340698P843781j5101318q792878
$$ 637201233 653596420 663991852 652554092 647089157 659429855 667273636 652172318 643379440
726.2F43379440k3422p657814J3810768J5456391l438492j0571366p100830L503800
$$ 643379440 643356018 635698204 649508972 664965363 661526871 650955505 643854675 647358475
733.9F47358475K714538J2282715Q171311o777878k828827q05206o243744j578980
$$ 647358475 650073013 662355728 670527039 663749161 660920334 660115128 653871384 652292404
741.6F52292404J1944199m82254p909928L45841M706955O303940j642533L086090o768036
$$ 652292404 664236603 663754349 655844421 656190262 660897217 667201157 665558624 668644714 661876678
750.3F61876678j3079071N36042K16217M875564n052719j3256607N381928O611099
$$ 661876678 648797607 649333649 649549866 654425430 649372711 636116104 641498032 648109131
758F48109131j1548615l439178J6398392M692382m39453l129577j1400872r85679o569977
$$ 648109131 636560516 633121338 649519730 654212112 653772659 650643082 639242210 638256531 631686554
766.7F31686554q921814R513245J7447891N707550l526154N919571J3761444Q461609
$$ 631686554 622764740 632277985 649725876 655433426 651907272 657826843 671588287 680049896
774.4F80049896m733734m290161l19672o834869k609329M641952Q839112O585159O422043
$$ 680049896 675316162 671026001 670706329 663871460 661262131 665904083 674743195 681328354 687750397
783.1F87750397P733154n856628r298554k612457J402206l804855o162262O742401
$$ 687750397 695483551 689626923 680328369 677715912 679118118 675313263 669151001 675893402
790.8F75893402K205353p31964Q686142O665878l889618j1870422J097870J1379852
$$ 675893402 678098755 677366791 686052933 692718811 688829193 676958771 678056641 689436493
798.5F89436493J1657867J0628052n719452j3467712l958740L758239k565612k698365
$$ 689436493 701094360 711722412 706002960 692535248 688576508 692334747 689769135 687070770
806.2F87070770O829529J763916L372269R995880R267273M207611j1842346j2017136
$$ 687070770 693900299 695664215 699036484 709032364 718299637 722507248 710664902 698647766
814F98647766q757477p523651J0307617O955033k179108J496506J382522k101211j0131149
$$ 698647766 689890289 682366638 692674255 699629288 697450180 698946686 700329208 698227997 688096848
822.6F88096848m5014L509369m15573J826782m169464N381393L289566j415481M323501
$$ 688096848 688051834 691561203 691145630 692972412 688802948 694184341 697473907 696058426 700381927
831.3G00381927l255004l869019k834320K138519J1036682J1892014n388565j9310913
$$ 700381927 697126923 693257904 690423584 692562103 703598785 715490799 710102234 690791321
839F90791321j3493118l147126R197846J597061L49579m705124j1211319J1843262
$$ 690791321 677298203 674151077 683348923 684945984 685295563 680590439 669379120 681222382
846.8F81222382J5979614O810226j0599441k0572434j1572952K77710J4814987N040283
$$ 681222382 697201996 704012222 693412781 672840347 661267395 661545105 676360092 681400375
854.5F81400375m426651j180801P366943P247849n416718l115463J372910q14820j561126
$$ 681400375 676973724 675792923 683159866 690407715 684990997 681875534 683248444 682433624 680872498
863.1F80872498J1279068P909164j956482K597199j513367N25513j052704N760269
$$ 680872498 692151566 700060730 698104248 700701447 699188080 699713593 698660889 704421158
870.9G04421158M764404o012497k649994k522354O477432N233002K748718o807632
$$ 704421158 709185562 703173065 700523071 698000717 704478149 709711151 712459869 705652237
878.6G05652237j4839172J587753L836593N196991J0440140J1850662j262054j3838043
$$ 705652237 690813065 692400818 696237411 701434402 711874542 723725204 722463150 708625107
886.3G08625107j1304703r752197K272644J840668m155579n876236R88235J4923707
$$ 708625107 697320404 687568207 689840851 691681519 687525940 681649704 682637939 697561646
894F97561646M243621j4971466j2415466J1501389N870742j4155121n295791K682266
$$ 697561646 701805267 686833801 674418335 685919724 691790466 677635345 672339554 675021820
901.7F75021820R59702n986863p031478k958222N700531M630814j249619Q355026M056626
$$ 675021820 675981522 669994659 662963181 660004959 665705490 670336304 669086685 677441711 681498337
910.4F81498337q961868r720688N41076J26038n046539l550721p855377k720184N900345
$$ 681498337 672536469 662815781 663356857 663482895 658436356 654885635 647030258 644310074 650210419
919.1F50210419J1248855k253723j2931900Q37555J609497J279450K417297j69067
$$ 650210419 661459274 659205551 646273651 647111206 648720703 650000153 652417450 652248383
926.8F52248383n212555m506913J763382k644271J531066K362061J127853L42865k760009
$$ 652248383 647035828 642528915 644292297 641648026 643179092 645541153 646669006 647011871 644251862
935.5F44251862P713470R864960j169586r958878q3237Q837509M691620k153396j0408402
$$ 644251862 651965332 661830292 660660706 650701828 650618591 659456100 664147720 661994324 651585922
944.2F51585922J922608P887268L271026N602188j998062m535370k990112m412460
$$ 651585922 653508530 661395798 664666824 670269012 668270950 663735580 660745468 656333008
951.9F56333008n984345m027786K56119n694657m069557K676468k331009J947975R407273
$$ 656333008 650348663 646320877 646576996 640882339 636812782 639489250 637158241 639106216 648513489
960.6F48513489m085922j5171357r934730q543167m388581O477509m31671p551041
$$ 648513489 644427567 629256210 619321480 610778313 606389732 612867241 612435570 604884529
968.3F04884529N205040N831146q436699r142303k433662l726273J033058P673912
$$ 604884529 610089569 615920715 607484016 598341713 595908051 592181778 593214836 600888748
976F00888748k354202r221687m698334l45345l458061n871925R53178k666054q062019
$$ 600888748 598534546 589312859 584614525 584269180 580811119 574939194 575892372 573226318 565164299
984.7E65164299m9553M021492l990211m081879N309563r90715l947144J696434k117119
$$ 565164299 565114746 569136238 565146027 561064148 566373711 565382996 561435852 563132286 561015167
993.3E61015167l905525L382607J0277786j943588j3238297q632507K398452R808388
$$ 561015167 557109642 560492249 570770035 568826447 555588150 546955643 549354095 559162483
1001.1E59162483l7002j30997K524109n504952l115654l67813J708946L687897K314377
$$ 559162483 559125481 558994484 561518593 556013641 552897987 552530174 554239120 557927017 560241394
1009.7E60241394m1504l807907o169319l421707K686462k58598k098961j16959n994644
$$ 560241394 560199890 556391983 550222664 546800957 549487419 549228821 547129860 547012901 541018257
1018.4E41018257j712952J2813302P245941p039261J372909R739762L150978m222450
$$ 541018257 539305305 552118607 559364548 552325287 553698196 563437958 566588936 562366486
1026.1E62366486q215638q624572k415390R883499P187500n686836n485535l49236
$$ 562366486 554150848 545526276 543110886 552994385 560181885 554495049 549009514 548660278
1033.8E48660278M185982Q093910L553772n706634o21453M862671J9799K473297o31676
$$ 548660278 552846260 560940170 564493942 558787308 558165855 563028526 563048325 565521622 564889946
1042.5E64889946l828583j581230L0212R372292L357086p973518j146279M099160J261749
$$ 564889946 561061363 559480133 559510345 568882637 572239723 564266205 563119926 567219086 568480835
1051.2E68480835k970161r61686m95338l643494J438294N818062L298187J462478L780213
$$ 568480835 565510674 564548988 564053650 560410156 561848450 567666512 570964699 572427177 576207390
1059.9E76207390N708809N324897K730103k078094j831665P06176N25399m28086K332268
$$ 576207390 581916199 587241096 589971199 587893105 586061440 586767616 587293015 586864929 589197197
1068.6E89197197J312408j422462L195114r99412k634430L625030p92312k104149n24979
$$ 589197197 590509605 589087143 592282257 591282845 588648415 592273445 591481133 589376984 588852005
1077.2E88852005p511711j1427879l903542M260635n23033l31688J0068474J854057
$$ 588852005 581340294 569912415 566008873 570269508 569746475 569414787 579483261 581337318
1085E81337318q285751K014694M429589k774773k121925l53890N500946J0007363R4146
$$ 581337318 573051567 575066261 579495850 576721077 574599152 574245262 579746208 589753571 589847717
1093.6E89847717m161300J020240j670684J987762M428101k960396K838058J419449
$$ 589847717 585686417 586706657 585035973 587023735 591451836 588491440 591329498 592748947
1101.4E92748947q571815r23729K019615o11572K435073J245041K127838p19566k899361
$$ 592748947 584177132 583253403 585273018 584661446 587096519 588341560 590469398 589749832 586850471
1110E86850471L643075J974868r18693R03091R46617J310311J145553k079467j727562
$$ 586850471 590493546 592468414 591549721 592452812 593399429 594709740 595855293 593775826 592048264
1118.7E92048264M962196k798233n492897O948433O457176M210663O66122M60663L449211
$$ 592048264 597010460 594212227 588719330 595667763 602124939 606335602 607001724 607462387 610911598
1127.4F10911598m830284o700058l228798K936249O704178o01769k707557P23762m38309
$$ 610911598 606081314 599381256 596152458 599088707 605792885 605191116 602483559 603207321 602769012
1136.1F02769012K685547O612358j237716n523911r771118r521065N430794P199822
$$ 602769012 605454559 612066917 610829201 605305290 595534172 586013107 591443901 598643723
1143.8E98643723r09653l573342m105911m690895k287750O694412L678360k384529
$$ 598643723 597734070 594160728 590054817 585363922 583076172 589770584 593448944 591064415
1151.5E91064415J987152m229469q487282J181374M32090k109604M838944K432938
$$ 591064415 593051567 588822098 580334816 581516190 581948280 579838676 584677620 587110558
1159.2E87110558l123093K131996O668472p66258l270912J363068j309853N54962K773590
$$ 587110558 583987465 586119461 592787933 592021675 588750763 590113831 588803978 589358940 592132530
1167.9E92132530K452431n49965n539894J720848O336670N558662M450531L409920
$$ 592132530 594584961 594034996 588495102 590215950 596552620 602111282 606561813 609971733
1175.6F09971733M878616K667847K545014j75553k020759J922340L009338l48930j484871
$$ 609971733 614850349 617518196 620063210 619887657 617866898 619789238 622798576 622449646 620964775
1184.3F20964775M788246O112595J624183P49207K457047J897773J060219J92337k395477
$$ 620964775 625753021 631865616 633489799 634239006 636696053 638593826 639654045 639846382 637450905
1193F37450905O57883Q15544m91639J948243J453476M578781L267135j575927j034394
$$ 637450905 638108788 638924332 638432693 640380936 641834412 646413193 649680328 648104401 647070007
1201.6F47070007k597351n62820K069397j479416P52106L094787m213409n173683L625602
$$ 647070007 644472656 643909836 645979233 644499817 645251923 648346710 644133301 638959618 642585220
1210.3F42585220L760300J891480O304855M533691J430435M01459l690033m760360
$$ 642585220 646345520 648237000 654541855 659075546 660505981 660907440 657217407 652457047
1218F52457047j679917j804657k471161M801941N310822m27246l91922K103347N427170
$$ 652457047 650777130 648972473 646501312 651303253 656614075 656186829 655794907 657898254 663325424
1226.7F63325424N70221l132248k272033k190629o82144l742675m051972q30841M573593
$$ 663325424 663895645 660763397 658491364 656300735 655618591 651875916 647823944 646993103 651566696
1235.4F51566696N019150J218414J409683k632522p40509J720047P93075J677857k595825
$$ 651566696 656585846 657804260 659213943 656581421 655840912 657560959 658354034 660031891 657436066
1244.1F57436066n041123m594345m13666K857514K550125J084137J827316Q170395
$$ 657436066 652394943 647800598 647386932 650244446 652794571 653878708 655706024 663876419
1251.8F63876419K711029m716797j187057j69297k278366j725311M17786O63757Q99658
$$ 663876419 666587448 661870651 660683594 660514297 658235931 656510620 656928406 657592163 658491821
1260.5F58491821J134720J619797K415161K047730L94134j26572K330246M79966k804261
$$ 658491821 659626541 661246338 663661499 665709229 666103363 665976791 668307037 668787003 665982742
1269.2F65982742l146362o03638n10635j610031K995758L429870L087540K077789j471710
$$ 665982742 662836380 662232742 661722107 660112076 663107834 666537704 669625244 671703033 670231323
1277.8F70231323m39987j231766p01294j60751k378693j153488J879196K074662n55878
$$ 670231323 669791336 668559570 667858276 667697525 665318832 664165344 666044540 668119202 667563324
1286.5F67563324k08130J115799K396622J732177l127136l891067j889038j056977
$$ 667563324 667355194 668470993 670867615 672599792 669472656 665581589 663692551 662635574
1294.2F62635574r88998j584396J6403M66385P83310L170318K511215N00489l04642
$$ 662635574 661646576 660062180 660078583 660544968 661328278 664498596 667009811 667510300 667205658
1302.9F67205658l18909P706l083725m346085o18362j77002p30286L221894L150406
$$ 667205658 666886749 666894455 663810730 659464645 658846283 658669281 657938995 661160889 664311295
1311.6F64311295J50375L00140Q95996L595353M876098P9422o083450p070923m708786
$$ 664311295 664461670 664761810 665657806 669253159 674129257 674208679 668125229 661054306 656345520
1320.3F56345520m176178J13220K063523j086426j226502K313080O537781L301010
$$ 656345520 652169342 652282562 654346085 653259659 652033157 654346237 660884018 664185028
1328F64185028j046219l162918o572037m245453j428756j241837K60468L71933k35062
$$ 664185028 663138809 659975891 653403854 649158401 647729645 646487808 646748276 647120209 646885147
1336.7F46885147j288299l90473K223511J414795J00403k88697Q51593K796326n76858
$$ 646885147 645596848 645206375 647429886 648844681 648945084 648656387 649507980 652304306 651727448
1345.3F51727448m541932l024063m82330Q60977J571274N60837J283798N383682L737259
$$ 651727448 647185516 644161453 643679123 644540100 646111374 646672211 647956009 653339691 657076950
1354F57076950k884140l404541l113251m019012r87930L69949k047272o34994J63879
$$ 657076950 654192810 650788269 647675018 643656006 642668076 643038025 640990753 640355759 640519638
1362.7F40519638R06448N137406P98187m787674j846466J206055j93177j431961j271667
$$ 640519638 641426086 646563492 647361679 642574005 640727539 641933594 641740417 640308456 639036789
1371.4F39036789q58841R20296N13000k7389L998222L537750J994171Q93555j799850
$$ 639036789 638177948 639098244 639611244 639583855 643582077 647119827 649113998 650007553 648207703
1380.1F48207703k378769j192322k312393l116532j168861R63478J369095q82187K808228
$$ 648207703 645828934 644636612 642324219 639207687 638038826 639002304 640371399 639489212 642297440
1388.7F42297440N973815K542191J298828K656098J667404m591446p354279P59964
$$ 642297440 648271255 650813446 652112274 654768372 656435776 651844330 644490051 645250015
1396.4F45250015J015778J921692K03323j366043J612244l94898J621857L203201k205124
$$ 645250015 646265793 648187485 648390808 647024765 648637009 648242111 649863968 653067169 650862045
1405.1F50862045k44903p37763n802002l391342j591377p90672O68449Q66089L108482
$$ 650862045 650617142 649879379 644077377 640686035 639094658 638303986 638972435 639838524 642947006
1413.8F42947006R62219k628555M6082N312729K039871j3304100q40683K876549J97410
$$ 642947006 643909225 641280670 641326752 646639481 648679352 635375252 634534569 637411118 637608528
1422.5F37608528K020455K751388K457275j283416q93021M512177K656402j663284
$$ 637608528 639628983 642380371 644837646 643554230 642661209 647173386 649829788 648166504
1430.2F48166504k451630j124572l97339j555252q48237O37436J725007K321472J612014
$$ 648166504 645714874 644590302 644192963 642637711 641789474 642426910 644151917 646473389 648085403
1438.9F48085403J03455k34146R95560K413864J125946j038666k149429m941483m885025
$$ 648085403 648188858 647954712 648950272 651364136 652490082 651451416 649301987 644360504 639475479
1447.6F39475479k85492K265701L029099J714172P28608K502517J816712N26733L396988
$$ 639475479 639189987 641455688 644484787 646198959 646927567 649430084 651246796 651773529 655170517
1456.2F55170517l552780q618775p51342l73078J745377L45688J499786K171707r52377
$$ 655170517 651617737 642998962 642247620 641874542 643619919 643965607 645465393 647637100 646684723
1464.9F46684723M628296N454025K956009k441254l367233p72858l328628p30515K494736
$$ 646684723 651313019 656767044 659723053 657281799 653914566 653141708 649813080 649082565 651577301
1473.6F51577301O338272M883652L36227N048294L340073J271210N222015O48956l220901
$$ 651577301 657915573 662799225 663135452 668183746 671523819 672795029 678017044 678666000 675445099
1482.3F75445099R29031R93729K439041Q28629p5074K356110j111527j394271O218261
$$ 675445099 676374130 677367859 679806900 680635529 680560455 682916565 681805038 680410767 686629028
1491F86629028P155838L898774K209625K41318l388291n535278J669540K310181J613922
$$ 686629028 693784866 697683640 699893265 700134583 696746292 691211014 692880554 695190735 696804657
1499.6F96804657K996597J835861M105835N069581J294403J82876j5822754j750335
$$ 696804657 699801254 701637115 705742950 710812531 712106934 712289810 696467056 694716721
1507.3F94716721Q962097K511444Q9340Q35724J975861k708893L664016N177765J204224
$$ 694716721 703678818 706190262 706279602 707115326 709091187 706382294 710046310 715224075 716428299
1516G16428299J629868o346360N230332O773605l650131k887879L947297L71704k981797
$$ 716428299 718058167 711711807 716942139 723715744 720065613 717177734 721125031 721496735 718514938
1524.7G18514938l844223L713150N525818K753067K477112J632843N02014K52228q823013
$$ 718514938 714670715 718383865 723909683 726662750 729139862 730772705 731274719 731526947 722703934
1533.4G22703934k214508O832275J148987k589951l932800o384125k901611M878540
$$ 722703934 720489426 727321701 728470688 725880737 721947937 715563812 712662201 717540741
1541.1G17540741j997299O524505J1519394N098801k496719l001786j600799j151505
$$ 717540741 715543442 722067947 733587341 738686142 736189423 733187637 731586838 730435333
1548.8G30435333k737503K595444M406967r689j836777L035660L879318r2773m201203
$$ 730435333 727697830 730293274 734700241 734690552 732853775 735889435 739768753 739675980 735474777
1557.5G35474777r950943o203384Q504257N586014J146240J346512r65195n035553
$$ 735474777 725523834 719320450 727824707 733410721 734556961 735903473 734938278 729902725
1565.2G29902725J573715O665116O326217J734696j0121460k782135L182373M196396
$$ 729902725 731476440 738141556 744467773 746202469 736081009 733298874 736481247 740677643
1572.9G40677643J760864N50919p48597q398742K866974J782837q13370J242904n05371
$$ 740677643 742438507 742989426 742240829 733842087 736709061 738491898 737678528 738921432 738416061
1581.6G38416061p57064K74887j57929j299057l962784r03015J105118j329727M37927
$$ 738416061 737658997 737933884 737775955 736476898 732514114 731611099 732716217 731386490 731824417
1590.3G31824417J521683K45819J708221j079254k860870m27094j932983j246872k449722
$$ 731824417 733346100 733591919 735300140 734220886 731360016 730932922 728999939 727753067 725303345
1599G25303345k493897l038101l320618M48990j632843R93042K473297j727523k112351
$$ 725303345 722809448 719771347 716450729 716899719 715266876 716259918 718733215 717005692 714893341
1607.6G14893341j565170m380112n031662l99704J27258j524658k542419K67334K73895
$$ 714893341 713328171 708948059 703916397 703516693 703643951 702119293 699576874 699844208 700118103
1616.3G00118103o505814K114716o03027l164673l723221k136230k089844m386292
$$ 700118103 693612289 695727005 695123978 691959305 688236084 686099854 684010010 679623718
1624F79623718j438293k475128j590729m148178Q09555J866150j550064J59454R27734
$$ 679623718 678185425 675710297 674119568 669971390 670780945 672647095 671097031 671256485 672184219
1632.7F72184219J443253k869949j3570862P477646L478851n304565p36237K117157
$$ 672184219 673627472 670757523 657186661 664664307 668143158 662838593 662102356 664219513
1640.4F64219513J40610J109085l294144L05405L059387q148956m977494K261734R401551
$$ 664219513 664360123 665469208 662175064 662480469 665539856 657390900 652413406 654675140 664076691
1649.1F64076691L198394p1487L809662n682755j2117233Q530960M884644L074341
$$ 664076691 667275085 667203598 671013260 665330505 653213272 661744232 666628876 669703217
1656.8F69703217K609329J812591J540528N27267K488022L106384m869613n71671J023483
$$ 669703217 672312546 674125137 675665665 676192932 678680954 681787338 676917725 676346054 677369537
1665.5F77369537K394257L852158K011413j464615J957703N156402j389465P18842
$$ 677369537 679763794 683615952 685627365 684162750 686120453 691276855 689887390 690606232
1673.2F90606232L024749l071212j028977L623963L864593K584992J490860L087539
$$ 690606232 693630981 690559769 689530792 693154755 697019348 699604340 701095200 704182739
1680.9G04182739M543000N349426L971863j0419617J48315N593415L110046J207581
$$ 704182739 708725739 714075165 718047028 707627411 707775726 713369141 716479187 717686768
1688.6G17686768J068m69132L119812K027512L363190M727325M59137l531342Q54035
$$ 717686768 717687836 717218704 720338516 722366028 725729218 730456543 730915680 727384338 728238373
1697.3G28238373K535171N134735m73632p703782O422654J582336j259384N433121
$$ 728238373 730773544 735908279 735434647 727730865 734153519 735735855 734476471 739909592
1705G39909592N104828r92585M213639L587646k923508j326751K260971R61456O33698
$$ 739909592 745014420 744021835 748235474 751823120 748899612 747572861 749833832 750795288 751428986
1713.7G51428986k007981r28802n6458m378509N016098Q019333L7002r57718L467560
$$ 751428986 749421005 748492203 748435745 744057236 749073334 757092667 757129669 756171951 759639511
1722.4G59639511J401444K88543K388535M20837m37927j324768j053467p30820L509064
$$ 759639511 761040955 761329498 763718033 764138870 763700943 762376175 761322708 760591888 764100952
1731.1G64100952N251465L489151n286407j1216660P881165N767135K037125j71128
$$ 764100952 769352417 772841568 767555161 756338501 764219666 769986801 772023926 771852798
1738.8G71852798n364456k435913K644348L627701O28967K060547L431549j892395
$$ 771852798 766488342 764052429 766696777 770324478 770953445 773013992 776445541 774553146
1746.5G74553146N47181K929611J332931K68860m900513j344223L427353K163315M38309
$$ 774553146 775100327 778029938 779362869 779631729 774731216 773386993 776814346 778977661 779415970
1755.2G79415970J168365k48413J953736J838531K74658L876496j947556n845337M78211
$$ 779415970 780584335 780335922 782289658 784128189 784402847 788279343 786331787 780486450 780964661
1763.9G80964661K714233M44641j646805O2104k652665K736359M255142Q26950l619690
$$ 780964661 783678894 784123535 782476730 782538834 779886169 782622528 786877670 787704620 784084930
1772.5G84084930j809387O589890K127304l375778j596833p87353J869430j037063
$$ 784084930 782275543 788865433 790992737 787616959 786020126 785232773 787102203 786065140
1780.3G86065140k374192J393433K341690K817764K362214q03452k630005j113815
$$ 786065140 783690948 785084381 787426071 790243835 792606049 791802597 789172592 788058777
1788G88058777L06854k77023k084580k329940r19495M748077L825226N11475K482757
$$ 788058777 788365631 788088608 786004028 783674088 782754593 787502670 791327896 791839371 794322128
1796.7G94322128L763199R84497m156189l196945O44379r76944K15149p63550K40326
$$ 794322128 798085327 799069824 794913635 791716690 792361069 791384125 791599274 790835724 791076050
1805.3G91076050K125931J005706P55005J506119K652435j858825k105027K026062
$$ 791076050 793201981 794207687 794962692 796468811 799121246 797262421 795157394 797183456
1813G97183456K625657p01066m152908j097030O82830J770707N74569j342392P43103
$$ 797183456 799809113 799108047 794955139 793858109 794540939 796311646 796886215 795543823 796286926
1821.7G96286926L9368L900452N564575n127411m630509j28097R25598K141495m860993
$$ 796286926 796326294 800226746 805791321 800663910 796033401 795905304 796830902 798972397 794111404
1830.4G94111404j399765L586426K261505J346817J029053J313934n46493j924973
$$ 794111404 792711639 796298065 798559570 799906387 800935440 802249374 801702881 799777908
1838.1G99777908J846772O72302k200852l151931j232834j811066n240402L555984
$$ 799777908 801624680 802296982 800096130 796944199 795711365 793900299 788659897 792215881
1845.8G92215881M272080K418899J653214J349945N10025k446365k864914J1367K53754
$$ 792215881 796487961 798906860 800560074 801910019 802420044 799973679 797108765 797120132 797373886
1854.5G97373886l216858n86471L236847J128387J123962J003647J08643J249084J683197
$$ 797373886 794157028 793570557 796807404 797935791 799059753 800063400 800172043 801421127 803104324
1863.2H03104324k74429j990814j258087l502350l218765J837768l41873m33121L197632
$$ 803104324 802829895 800839081 799580994 796078644 792859879 794697647 794355774 793922653 797120285
1871.9G97120285K833252M02603j408234o64291N27573J040573Q52890k576065j528015
$$ 797120285 799953537 800356140 798947906 798283615 798811188 799851761 800704651 798128586 796600571
1880.6G96600571L36761n69382k61993j003952K951355M056931M52041L53851m12750
$$ 796600571 796937332 796367950 796105957 795102005 798053360 802110291 802562332 802916183 802503433
1889.2H02503433l331756k191620O32477P75146o8130k154694q28095K400589K73972
$$ 802503433 799171677 796980057 797612534 798387680 798319550 796164856 795336761 797737350 798011322
1897.9G98011322J596375M35943o45370J924667m61807j496811k774887j091004J906357
$$ 798011322 799607697 800043640 799398270 801322937 800861130 799364319 796589432 795498428 797404785
1906.6G97404785J086731J339951M78515K61689O96258J019287J50452j187592k085495
$$ 797404785 798491516 799831467 800309982 800571671 801267929 802287216 802437668 801250076 799164581
1915.3G99164581k820587j542129k897263O95190M115143K010193l56521m48304K426987
$$ 799164581 796343994 794801865 791904602 792599792 796714935 798725128 798368607 797920303 800347290
1923.9H00347290J814499n00565k747726k820206P50427Q18787j045380j429672j99203
$$ 800347290 802161789 801661224 798913498 796093292 796843719 797662506 796617126 795187454 794988251
1932.6G94988251O54983M90723K073593P45621p08847N59921n25513j525879l62396
$$ 794988251 795643234 796133957 798207550 798953171 798244324 798804245 798278732 796752853 796390457
1941.3G96390457k059936l019181K642594J881942o56127K252197J053314m5929P79495
$$ 796390457 794330521 791311340 793953934 795835876 795179749 797431946 798485260 798439331 799218826
1950G99218826o97021l42255o46286j682052o58722J552429J298904l1585P40509Q35037
$$ 799218826 798521805 798179550 797533264 795851212 795192490 796744919 798043823 798012238 798752747 799587784
1959.6G99587784K94342o98242R42459J821670j861419j736985j60522j285248o16531
$$ 799587784 799882126 799183884 800126343 801948013 800086594 798349609 798189087 796903839 796287308
1968.3G96287308J431579Q81119k50626O32706m23050q03680J106644Q17184j517029
$$ 796287308 797718887 798600006 798349380 798982086 798559036 797755356 798862000 799679184 798162155
1977G98162155j606064m62341o08749Q48159L81852j048050M70047Q97979j26495J80817
$$ 798162155 796556091 796093750 795485001 796333160 796715012 795666962 796137009 797034988 796908493 797089310
1986.6G97089310K012024J183700j437073j513519p43942k430267j763382J888198
$$ 797089310 799101334 800285034 798847961 797334442 796590500 794160233 792396851 794285049
1994.3G94285049J69602j266785J84098J98974J848679K075500m52118j135483J217576
$$ 794285049 794454651 793187866 793371964 793570938 795419617 797495117 797042999 795907516 797125092
2003G97125092k56501k116470m12598k432861j601257J120834K12479L66668L59421
$$ 797125092 796868591 794752121 794339523 791906662 790305405 791426239 791638718 792005386 792364807
2011.7G92364807P401K00500J130371O67496j964569k939072j299362N61142N74341
$$ 792364807 792372208 792572708 793703079 794370575 792406006 789466934 788167572 788728714 789303055
2020.4G89303055j2970M22745n27955p28225J531677L51334m51584J505508j023941
$$ 789303055 789290085 789712830 789184875 788456650 789988327 790339661 789888077 791393585 790369644
2029.1G90369644l258362j849670P64542J220550j630173j417160j26724Q92639K554627
$$ 790369644 787111282 785261612 786026154 787246704 785616531 784199371 784072647 784965286 787519913
2037.7G87519913R23919r01870j154023r36050k80991j248092j947708p31583O61545
$$ 787519913 788443832 787541962 786387939 785451889 785170898 783922806 781975098 781243515 781905060
2046.4G81905060Q84399n69534r95255K30256O04019M07257J202392J35498k635269
$$ 781905060 782789459 782219925 781224670 781454926 782058945 782466202 783668594 783804092 781168823
2055.1G81168823j206360J48011j166001j298980K73742K909088J510239k98767L47061
$$ 781168823 779962463 780110474 778944473 777645493 777919235 780828323 782338562 782039795 782386856
2063.8G82386856r8114k21939m9438N31997o08597o24618l052j474914J44424J309814
$$ 782386856 782288742 782066803 782017365 782549362 781940765 781316147 781313095 779838181 779982605 781292419
2073.4G81292419J556855J035919j293869j003342J146851J369095j841889k198257
$$ 781292419 782849274 783885193 782591324 781587982 782734833 784103928 782262039 780063782
2081.1G80063782r82743j76620K249908K22168j284256J531830K261963j24588k027206
$$ 780063782 779081039 778904419 781154327 781376495 780092239 781624069 783886032 783761444 781734238
2089.8G81734238m44641J030197o15921j396408J59912M91485o05011k264709q47244
$$ 781734238 781289597 782319794 781703873 780307465 780467377 780958862 780353851 778089142 777241898
2098.5G77241898L044357J845169K50854P76215n84793j494064j944123j824417N8060
$$ 777241898 780286255 782131424 782382278 783158493 782573700 781079636 779135513 777311096 777369156
2107.2G77369156J602020P30515m21830k51388L66897J160050R06982l40118q30078
$$ 777369156 778971176 779701691 779279861 779028473 779395370 780555420 781462402 781122284 780292206
2115.9G80292206N41153J195678k3193j686020k572174l25241J216354m83245k08512
$$ 780292206 780833359 782029037 782005844 780319824 777747650 777422409 778638763 778155518 777947006
2124.5G77947006J628800L44085p03201N71137p26929j559525R15528J028595j749192
$$ 777947006 779575806 779919891 779216690 779787827 779060898 777501373 778416901 779445496 777696304
2133.2G77696304j369171R26590P21665P82547J446685K403031J620941j170654o76346
$$ 777696304 776327133 777253723 777975388 778757935 780204620 782607651 784228592 783057938 782381592
2141.9G82381592r77402j915359j239396k378540j004715J885071J128464k16522O11419
$$ 782381592 781404190 779488831 778249435 775870895 774866180 776751251 777879715 777663193 778274612
2150.6G78274612J357117m2801j98898J460876l28445k221603j076813j402664N0735
$$ 778274612 779631729 779588928 779390030 780850906 780522461 778300858 777224045 775821381 775872116
2159.3G75872116L729477K938843j026535k045517n04074m54102m01306K36511J603394
$$ 775872116 779601593 782540436 781513901 779468384 778964310 778510208 778108902 778345413 779948807
2167.9G79948807R43985k165375m17786N55954o77185P47071J056213J385269K72064
$$ 779948807 780892792 778727417 778309631 778865585 778188400 778935471 779991684 781376953 781649017
2176.6G81649017j239166J062393J508942j213074l09982J342544k07748K33917p66830
$$ 781649017 780409851 781472244 782981186 781768112 781458130 782800674 782592926 782826843 782060013
2185.3G82060013k186890J219483L399200K543411k23922j126023L25241j75171j076965
$$ 782060013 779873123 781092606 784491806 787035217 786811295 785685272 786010513 785835342 784758377
2194G84758377j467743j67084N70679q03604j994247j389542K597961L294907R22012
$$ 784758377 783290634 783123550 783694229 782890625 780896378 779506836 782104797 785399704 786321716
2202.6G86321716J125641L90473M25033J154251p13730j805267q44574J289978L86582
$$ 786321716 787447357 787837830 788262863 789417114 788703384 786898117 786053543 787343521 787730103
2211.3G87730103k896576r74579J754379K249603L013993N82504j329804l8223L09448
$$ 787730103 784833527 783858948 785613327 787862930 790876923 791459427 790129623 790091400 790400848
2220G90400848J86158p7362j077958j143112J5793L4714m04587J477737K539292m51355
$$ 790400848 790587006 790509644 789431686 788288574 788304367 788339081 787934494 789412231 791951523 791500168
2229.7G91500168k527390j552429n50995J458206J548157p43179L39355J020356M3869
$$ 791500168 788972778 787420349 786869354 788327560 789875717 789132538 789471893 790492249 790536118
2238.3G90536118J070785N90286j215362n61753J326981J468811j241836k649155M7760
$$ 790536118 791606903 792197189 790981827 790420074 791747055 793215866 791974030 789324875 789372635
2247G89372635J830902J64261j515122k22549J033249J57013J572647J910858j246643
$$ 789372635 791203537 791367798 789852676 789630127 790663376 790820389 792393036 794303894 793057251
2255.7G93057251q49304m07334l102951p74612K198868l47672o24847J000137J161957
$$ 793057251 792207947 791800613 788697662 787923050 790121918 789774246 789149399 790149536 791311493
2264.4G91311493J613159J196594j50985q73566l48282j175995j318893R37576J813736
$$ 791311493 792924652 794121246 793970261 793096695 792748413 791572418 790253525 791191101 793004837
2273G93004837J000519j083222j41296J131592p18842k52533R32312J716538N0735
$$ 793004837 794005356 792922134 792780838 793912430 793193588 792941055 793873367 795589905 795640640
2281.7G95640640k318649j059494o48727p69043k98691R86862J383743Q3695K73590
$$ 795640640 793321991 792262497 791613770 790844727 790546036 791532898 792916641 793000336 793273926
2290.4G93273926L88031O31943O44531Q10013J235580o15005k068711j496048L78952
$$ 793273926 793661957 794293900 794938431 795748444 796984024 796369019 794300308 792804260 793183212
2299.1G93183212r66415j582947K398224K067490Q7738j68076j53656O48193r85336
$$ 793183212 792216797 790633850 793032074 795099564 795187302 795019226 794865570 795513763 794528427
2307.8G94528427j739883j449280j390305n58090j177978k39487J452866N09872J900253
$$ 794528427 792788544 791339264 789948959 789390869 788212891 787973404 789426270 789936142 791836395
2316.4G91836395K631378j255493k477798j187287j731338k084274j163788J265793
$$ 791836395 794467773 793212280 790734482 789547195 787815857 785731583 784567795 785833588
2324.2G85833588J407013j227112l407898n37567N135803O127243J161346m668655
$$ 785833588 787240601 786013489 782605591 782068024 787203827 793331070 794492416 789823761
2331.9G89823761K864532M592972r971161o444625K553634K37274j767120k600708
$$ 789823761 792688293 797281265 787310104 780865479 783419113 783656387 781889267 779288559
2339.6G79288559J677170L029785J386719L711319L257980p90024l983841j680832
$$ 779288559 780965729 783995514 785382233 789093552 792351532 791561508 787577667 785896835
2347.3G85896835m68368j173859l56903O22788L265609L834915N1423k480851l534393
$$ 785896835 785428467 784254608 783897705 784520493 787786102 791621017 791672440 789191589 785657196
2356G85657196k368011k980500N7221M963379J498260J40686j022339J58387p20749
$$ 785657196 783289185 780308685 780365906 785329285 786827545 786968231 785945892 786104279 785383530
2364.7G85383530p060013m566727R74198O965866K672958l720245K574081K121277
$$ 785383530 778323517 773756790 774730988 781696854 784369812 780649567 783223648 785344925
2372.4G85344925k556229m77447L430328K280274r1401j63116j038437R26437P27158
$$ 785344925 782788696 782311249 785741577 788021851 787930450 787767334 786728897 787655334 788382492
2381.1G88382492P7057J464996l49350j508178k299576o24466J120224j442490j908722
$$ 788382492 788459549 789924545 789575195 788067017 785767441 785142975 786263199 784820709 782911987
2389.7G82911987m12140K77329K99683J777725K365722P87659n2338k388534l150559
$$ 782911987 782499847 782777176 783076859 784854584 787220306 788007965 787955627 785567093 782416534
2398.4G82416534p84454Q49686P76901N5923k37121M49448R62829q1558l43323l15628
$$ 782416534 781632080 782481766 783258667 783314590 783077469 783526917 784489746 784408188 784064865 783749237
2408.1G83749237J43051j64337j798172j357727n61600J301422J518860o15234r67026
$$ 783749237 783892288 783727951 781929779 780572052 780010452 781311874 782830734 782215500 781248474
2416.7G81248474j74484J118088k55127k01874R38110j640930j340332m95834j697998
$$ 781248474 781073990 782192078 781936951 781735077 782673187 781032257 779691925 779196091 777498093
2425.4G77498093q23822l40805J70669J469422L76358r44901j30081P18689o78101
$$ 777498093 776674271 776333466 776504135 777973557 778349915 777405014 777274933 777993622 777315521
2434.1G77315521j793289k55356j01547N9509K86103j644440j249008Q46023J758347
$$ 777315521 775522232 775266876 775165329 775224838 775510941 773866501 772617493 773463516 775221863
2442.8G75221863Q10165K81296O96335p74613k202453j686478K22168K21100k539902
$$ 775221863 776032028 776313324 777009659 776235046 774032593 772346115 772568283 772789383 770249481
2451.5G70249481k988663O36521K353973J828079K145234m62036j770478k66189n03769
$$ 770249481 767260818 767897339 770251312 772079391 774224625 773762589 771992111 771725922 771222153
2460.1G71222153j795044j585236J30081j522293j267242M76456K07672J838302P37305
$$ 771222153 769427109 767841873 767971954 766449661 765182419 765658875 765866547 767704849 768442154
2468.8G68442154j53198N96695O19659K45514j534958j645126j750565j047516j466369
$$ 768442154 768288956 768885651 769505310 769750824 768215866 766570740 764820175 763772659 762306290
2477.5G62306290j956635J352310Q27713Q0033K160644J891556N36041j377868k412644
$$ 762306290 760349655 761701965 762529678 762609711 764770355 766661911 767197952 765820084 763407440
2486.2G63407440j546325p3014p07168j846390L79791J581040J010055K34909p06100
$$ 763407440 761861115 761788101 761080933 759234543 759614334 761195374 762205429 762440338 761734238
2494.8G61734238P34787L82003l48129N62287j172562p39136N42908o63147j500473
$$ 761734238 762469025 762851028 762502899 763065186 761892624 761153488 761696396 761033249 759532776
2503.5G59532776j31226L145142O29272k579879L81088R42840r91668j384812n01785
$$ 759532776 759401550 762546692 763175964 760596085 760977173 761920013 760928345 759543533 759041748
2512.2G59041748J295929P80563j940765j630249l8986j98517P42493J262817R97467
$$ 759041748 760337677 761118240 759177475 757547226 757508240 757309723 758052216 759315033 760312500
2520.9G60312500L17612k126313j374588J054154j022186j523514O99005p03735j387024
$$ 760312500 760630112 758503799 757129211 758183365 757161179 755637665 756336670 755632935 754245911
2529.6G54245911N24063P78122j547852j277313K055511Q38700J71661J211395r11636
$$ 754245911 754769974 755548096 754000244 752722931 754778442 755617142 755788803 757000198 756088562
2538.2G56088562k220383j831665Q5221m18778j775818M20914J615143R66568Q39Q00934
$$ 756088562 753868179 752036514 752121735 751702957 749927139 750348053 751963196 752929764 752930603 753731537
2547.9G53731537J418762l84674k346268k626419k40631l75900p41959J166840l0136
$$ 753731537 755150299 754765625 752419357 749792938 749552307 749176407 748434448 749601288 749571152
2556.6G49571152J70898P07474j003494K97775P5684k332840l06778K296142n06439
$$ 749571152 749742050 750449524 749446030 749743805 749819489 747486649 747179871 749476013 748969574
2565.2G48969574l032532l25088J352234J272430j01700k996521n27420K173538L51258
$$ 748969574 745937042 745611954 746964188 748236618 748134918 745138397 744610977 746784515 747135773
2573.9G47135773n35584k66266j21383j058503k677917k413177M56466K129288K161102
$$ 747135773 746600189 746333923 746212540 745154037 742476120 740062943 740519409 742648697 744809799
2582.6G44809799J607743j235581j028366J99661j064224m69589n6458o71310q30155
$$ 744809799 746417542 745181961 744153595 744353256 743289032 742819443 742762985 742091675 741261520
2591.3G41261520K96860M40445q10242l02505k16293R91210J716385q21685j518403
$$ 741261520 741558380 741998825 741188583 740886078 740669785 741660995 743377380 742555695 741037292
2600G41037292l81622K51846n59310j930314j063995O11649N47256M39072J681366
$$ 741037292 740655670 740907516 740348206 738417892 737353897 737965546 738512802 738951874 740633240
2608.6G40633240L16314j984558n03006L50571p26166j270523o70318O11648q88519
$$ 740633240 740949554 738964996 738461990 738812561 738086395 736815872 736145554 736757202 735868683
2617.3G35868683j883621j119004m04358J614685L40500j178741j04752l19748j49993
$$ 735868683 733985062 732866058 732461700 734076385 734416885 733238144 733133392 732813644 732663651
2626G32663651L33328k08893j757584N4703J526489j915893j664810R0408l1204k75650
$$ 732663651 732996979 732788086 731030502 731085205 732611694 730695801 729030991 729121399 729090195 728814545
2635.6G28814545m98505J10321j146698l80096J688079l39126k453613j916123o62460
$$ 728814545 728316040 728426361 727279663 726899567 728587646 728248520 725794907 723878784 723216324
2644.3G23216324Q2397N51377k10114n60608J023407J185837j614532k962189j054077
$$ 723216324 723298721 723850098 723639984 723079376 724102783 725288620 723674088 720711899 719657822
2653G19657822j179047r91592J511535Q13294n65872K13317n88150j973419q24661
$$ 719657822 718478775 717487183 718998718 719812012 719246140 719459457 718871307 716897888 716073227
2661.7G16073227K24152N89752K48108L2882Q99048j268616j582107m5166k198792
$$ 716073227 716297379 716887131 717135239 717168121 718067169 716798553 715216446 715171280 712972488
2670.4G12972488j404419J151886l71322j229477J264038J322327r65348j533889j691437
$$ 712972488 711568069 712719955 712348633 711119156 712383194 713705521 712740173 711206284 709514847
2679G09514847n76554q392o90155J090622J970062l4561N4245M31061j709519n93643
$$ 709514847 708938293 708929901 708239746 709330368 711300430 711265869 711320114 711751175 710041656 709448013
2688.7G09448013J311035k5939j384354j684494j23139L40500o98013r85565r85031
$$ 709448013 710759048 710733109 709348755 707664261 707541122 707881622 707183609 706198044 705213013
2697.4G05213013l59879K48184N27420l44696n13000r69391j673584N20630k02561
$$ 705213013 704853134 705101318 705628738 705284042 704771042 703801651 702128067 702648697 702446136
2706G02446136j264495J002884P65152L2348j82724j348038r6817J130524r24530p22961
$$ 702446136 701181641 702184525 702949677 702982025 702799301 701451263 701354446 702484970 701560440 700837479
2715.7G00837479M84008j070785j005325j58463q33054j347808J32980R01260q75702
$$ 700837479 701321487 700250702 699245377 699086914 698253860 696906052 697039032 697940292 697064590
2724.4F97064590q51287N21240R22699r92356k553253n91659J385345J719971j40457
$$ 697064590 696213303 696734543 697657242 696664886 694111633 693519974 694905319 696625290 696484833
2733F96484833j137543n11169o7444R08584q05511j549988m14810j487503j066132
$$ 696484833 695347290 694836121 694768677 695677261 694871750 693321762 692906952 691419449 690353317
2741.7F90353317N12543J105270K29035j682968j371537L1434O42395O99310p15790
$$ 690353317 690865860 691971130 692200165 690517197 689145660 689177094 689819489 690518799 689803009
2750.4F89803009l70407J454010n7755j123886q47702j699905j745072k00347J263198
$$ 689803009 689432602 690886612 690828857 689704971 688857269 687157364 685412292 685211945 686475143
2759.1F86475143L06M0817J226883l75672o24466J91880p62482p70874J024017P6218
$$ 686475143 686475449 686516266 687743149 687367477 686743011 686934891 686172409 685401535 686425552 686501770
2768.7F86501770q03528N83191Q164n46494j516342n04837R80758r32617j04522O04019
$$ 686501770 685698242 686281433 686289597 685743103 684226761 683721924 684702682 683770065 683665543 684269562
2778.4F84269562k50855p52639k058564j220016N19256L67813r10797n31387L81393
$$ 684269562 684018707 683266068 681207504 679987488 680506744 680874557 679963760 679432373 679813766
2787F79813766Q51593J405793l86048k103119j588058m44794O52085N89294j236954
$$ 679813766 680665359 682071152 681685104 679581985 677993927 677549133 678201218 678790512 677553558
2795.7F77553558k234954j046982N40695N2414j315003J006318K502059L16849j576767
$$ 677553558 675318604 674271622 674812317 674864731 673549728 674556046 677058105 677374954 675798187
2804.4F75798187k143936r90143l28369m31671j095200n13992R13162k0065m03213
$$ 675798187 673654251 672664108 672335739 671904068 670808868 670294876 671208038 671187973 670784760
2813.1F70784760j205597j730194j49384Q93707k76336k023774j140136L97415O67572
$$ 670784760 669579163 667848969 667699585 668593292 668316956 666293182 665153046 665550461 666218033
2821.8F66218033j398544j490174p78274j902924J621094J095810l004380j154251
$$ 666218033 664819489 663329315 662551041 660648117 662269211 663365021 660360641 659206390
2829.5F59206390Q76313P20520r78470j538696J54495N40313p66448n96390J64032
$$ 659206390 660082703 660803223 659824753 658286057 658440552 658980865 658214417 657618027 657782059
2838.2F57782059q59604j450806j324081L32489m72794k552719j050186j027985K12784
$$ 657782059 656922455 655471649 654147568 654480057 654007263 651454544 650404358 649376373 649589157
2846.8F49589157N72968j729966j237716j634064j716156k108688j539688K807464
$$ 649589157 650162125 648432159 647194443 645560379 643844223 641735535 640195847 643003311
2854.6F43003311J816178q64792o56739j862411j272431j002960p81936N26313m28199
$$ 643003311 644819489 643954697 643297958 641435547 640163116 639160156 638378220 638904533 638476334
2863.2F38476334j213723j428680Q7471K39525k501068j726380L06206j372108k742196
$$ 638476334 637262611 635833931 635921402 636160927 633659859 631933479 632239685 630867577 628125381
2871.9F28125381O29387l5362l375320q15468J683197P92160k173767j351052l36303
$$ 628125381 628754768 628719406 625344086 624528618 626211815 627003975 624830208 623479156 623142853
2880.6F23142853j805420L74184p5112j855812j622391L42064J783219q78678j408767
$$ 623142853 621337433 621711617 621636505 619780693 618158302 618500366 620283585 619404907 617996140
2889.3F17996140r31855j401062p48214J192512J831551p26776k572594k176094M33616
$$ 617996140 617064285 615663223 614915009 616107521 617939072 617212296 614639702 612463608 612897224
2897.9F12897224q9988q35877J908875M67071j488151p77664o21224r65271k71149
$$ 612897224 612807236 611971359 613880234 614347305 612859154 612081490 611460266 610494995 610223846
2906.6F10223846M38958o42052l26729P12586m26522k228775j431846k17667p09801
$$ 610223846 610662804 610020752 609694023 610406609 609980087 607751312 606319466 606101799 605391998
2915.3F05391998n87883k94990k87972j154899K64206N73501m191398k149773L384628
$$ 605391998 604804115 604509125 604221153 603066254 603330460 603903961 599712563 597562790 600947418
2924F00947418J574364j779900j418686K401009L041916j250305j188164n34134k261772
$$ 600947418 602521782 600741882 599323196 601724205 604766121 603515816 602327652 601793518 599531746
2932.7E99531746j123123l65944J600685L387222Q22678p59773l23944J65138j74446
$$ 599531746 598408623 598042679 599643364 603030586 603853264 603093491 602769547 602934685 602760239
2941.3F02760239J03264J708374K592048L049088J559372r18961j283188p79609n39780
$$ 602760239 602863503 604571877 607163925 610213013 611772385 610853424 609570236 608790627 608250847
2950F08250847J165542K636643P89223M63562J274070M75274J612815J318589k58675
$$ 608250847 609416389 612053032 612842255 613305817 614579887 615055161 616667976 617986565 617727890
2958.7F17727890j04752K55089J087685J025734J542930J275292K94342J878853P82051
$$ 617727890 617623138 617878227 618965912 619991646 621534576 622809868 623104210 624983063 625765114
2967.4F25765114R0408J731568j04065n44358J515427J467056J08834j561585n24406
$$ 625765114 625855522 627587090 627483025 626938667 628454094 629921150 630029984 628468399 627943993
2976.1F27943993K380294J437912L35770J003265J226998M41017k007446o028J837578
$$ 627943993 630324287 631762199 632097969 633101234 634328232 634769249 632761803 632755775 634593353
2984.7F34593353J74523J023101L72925K94113P69272o65703k670J479378J916923
$$ 634593353 634767876 635790977 636163902 636458015 637227287 636561584 636558914 638038292 639955215
2993.4F39955215J53046j194191j60217J356392J538391N76706k76566j794586j228561
$$ 639955215 640108261 638914070 638753853 640110245 641648636 642225342 641948776 640154190 638925629
3002.1F38925629N80978J652298J067886j33133P10831j126785k325936m54902J194000
$$ 638925629 639506607 641158905 642226791 642093658 642804489 641677704 639351768 638896866 640090866
3010.8F40090866J675568j469040j937409o599Q7662R28001j026726k644615J300583
$$ 640090866 641766434 640297394 638359985 638353386 638441048 639369049 638342323 635697708 636998291
3019.5F36998291K962837j159324k751427m79927m92897k091751j427613O63414J095238
$$ 636998291 639961128 638801804 636050377 635570450 635077553 632985802 631558189 632221603 633316841
3028.1F33316841k99682p80488q10279j559639J85661N98946j984597p56836O96297
$$ 633316841 633017159 632236671 631426392 629866753 630052414 630651360 628666763 627909927 628606224
3036.8F28606224q81004j662941j145058j27945O09703N39284j124764j978797n7488
$$ 628606224 627725220 626062279 624917221 624789276 625398979 625938263 624813499 622834702 622777214
3045.5F22777214O57883r06029l78532P0381k889977k481498N17768J454964Q28400
$$ 622777214 623435097 622529068 622150536 622220917 619330940 616849442 617367210 618822174 619650574
3054.2F19650574k628327k276725J631202R37119q74825k328567j941986o5308k16179
$$ 619650574 617022247 614745522 616376724 617313843 616439018 614110451 612168465 612103157 611886978
3062.9F11886978K75116J82457l90510q99010j766739m02298j04256J08490J89362
$$ 611886978 612162094 612344551 611954041 611055031 609288292 608885994 608781738 608890228 609079590
3071.5F09079590j910286j516647l93219q55790q14132o42395R9640J044158j30996
$$ 609079590 607169304 605652657 605259438 604403648 603589516 602947121 603046761 604090919 603959923
3080.2F03959923j177368p13349q20923j385574j411781N97114l2806j904373k1096
$$ 603959923 602782555 602069206 601248283 599862709 598450928 599048042 599015236 597110863 597089767
3088.9E97089767m78668r29870k41547j186638p10373K17896L30963n18990j091156
$$ 597089767 596611099 595681229 595439682 594253044 593542671 593760567 594091530 593572540 592481384
3097.6E92481384p31392L18871n65872q11997N19753j970749n86548N09644k333184
$$ 592481384 591749992 592068863 591502991 590690994 591210747 589239998 588653450 589163094 586829910
3106.2E86829910j020469p4006L21923k42272j91803N92156j510925q24852o17447
$$ 586829910 585809441 585735435 586057358 585815086 585623283 586215439 584704514 583879662 583262215
3114.9E83262215j453743l19062j12190l10211j584129j147194R95178M86946o17523
$$ 583262215 581808472 581489410 581377220 581067009 579482880 578335686 579330864 579817810 579200287
3123.6E79200287o2370Q9836j074448j522980p88841j424675j419678L92609O55708
$$ 579200287 579137917 579227753 578153305 576630325 575841484 574416809 572997131 573389740 574045448
3132.3E74045448j16501j827392j536713K4605n73616O62155m45862k373199J84288
$$ 574045448 573928947 572101555 570564842 570589447 570015831 570677986 570232124 567858925 568043213
3141E68043213K75345l32527O57463r50089j972008r8800J78680m64287j17759j370850
$$ 568043213 568318558 567986031 568643494 567693405 565721397 565622597 565801277 565336990 565219231 563848381
3150.6E63848381j446800k75650N76820J255875j301041k597732M10957K126694K22206
$$ 563848381 562401581 562125931 562702751 563958626 562657585 560059853 560470810 562597504 562819710
3159.3E62819710j881447j184311m96941n31501m8333m83856m22935J2626R2888L53089
$$ 562819710 560938263 559753952 559257011 558725510 558677177 558193321 557770386 557783012 557875900 558228989
3168.9E58228989J82953o5423j890411k112961P12509J41602j704979j390610n45959
$$ 558228989 558411942 558346519 556456108 554343147 555055656 555197258 553492279 552101669 551555710
3177.6E51555710J231270J280327j671639k398682P44934Q30613k216263j230126P61338
$$ 551555710 552786980 554067307 552395668 549996986 550741920 551572533 549356270 548126144 548887482
3186.3E48887482j08490o92902p47070m38614J19171k56042J85623J122322r49326
$$ 548887482 548778992 548086090 547339020 546900406 547019577 546763535 546949158 548071480 547122154
3195E47122154k665787l58276Q6632o62346J91917m72488l94516o87866j181221j75057
$$ 547122154 544456367 544098091 544184723 543522377 543714294 543241806 542847290 542159424 540978203 540803146
3204.6E40803146K28768P39059l44848j006966q25920r72748J404686K652702K17438
$$ 540803146 541031914 541770973 541426125 540419159 539593239 538620491 540025177 542677879 542895317
3213.3E42895317l546524l154945j40610M00200O83288q51707k764244p46269J156120
$$ 542895317 539348793 536193848 536053238 536453438 537136726 536285019 533520775 532774506 533930626
3222E33930626j04828j219559k3842R67446k48680j286812q8768P89032J322746J04447
$$ 533930626 533825798 532606239 532582397 533549843 533301163 532014351 531925583 532714615 534037361 534141808
3231.6E34141808j620217o09703j636810j332436Q14247o80198r91478N99251m2496
$$ 534141808 532521591 531911888 530275078 528942642 529756889 529076691 528085213 528684464 528641968
3240.3E28641968j709328j18446J437797O52046P33376p70683j889305p98073O95915
$$ 528641968 526932640 526814194 528251991 528904037 529637413 528866730 526977425 526179352 526875267
3249E26875267R05952j009178j398163j479644q34236M67987j039582l00560J603623
$$ 526875267 527781219 526772041 525373878 523894234 523059998 523527985 522488403 522187843 523791466
3257.7E23791466J270447M11148o99158l75061r16405l89557J565590j14364m43230
$$ 523791466 525061913 525473061 524773903 524398842 523482437 523092880 524658470 524544106 524100876
3266.3E24100876Q0070k035446k288551M44374K443619R58709j406326k957611j964302
$$ 524100876 524180946 522145500 519856949 520301323 522744942 523703651 522297325 519339714 517375412
3275E17375412R33838R01375k45858k20603n33410M0970L21503j006088l34969R7275
$$ 517375412 518309250 519210625 518964767 518744164 518210754 518251724 518573227 517567139 517232170 517329445
3284.7E17329445l3455J324196k25907r27162o22749j250076l47977p99789m48418
$$ 517329445 517295990 518620186 518394279 517467117 516844368 515594292 515246315 514446526 513998108
3293.3E13998108P32536J111412q53462k546730R7084j18179m74510R21745Q76846
$$ 513998108 514730644 515842056 514988594 512441864 512538948 512420769 511946259 512868004 513744850
3302E13744850M53530k453042j812477J599312J151695p47375j129456P76558L93181
$$ 513744850 514198380 511745338 509932861 511532173 512683868 511936493 510807037 511583595 511976776
3310.7E11976776j920318r33152M06113k98157r06296k156944j464882J708946K151108
$$ 511976776 510056458 509123306 509529419 509231262 508324966 506168022 504703140 506412086 508563194
3319.4E08563194R49898p08084j707497l70369Q50525k18200j551934Q5793m38767
$$ 508563194 509513092 508805008 507097511 506727142 507577667 507359467 505807533 505893326 505454559
3328.1E05454559k013473j152115j097031P05605J711922P52830l42445j313248r70955
$$ 505454559 503441086 502288971 501191940 501897545 503609467 504362297 504019852 502706604 501735649
3336.7E01735649k016182m62990R97734r45243j615181j790238P65228K548943L81279
$$ 501735649 499719467 499256477 500254211 499308968 497693787 495903549 496668777 499217720 499598999
3345.4D99598999q75359o39190l3760m26102p63092o05316n10597r80950j015281K86750
$$ 499598999 498723640 498084450 498050690 497624588 496861496 496256180 495745583 494764633 493749352 494036102
3355.1D94036102j27945j452980j186027J293258J092072j867371k209205k426529
$$ 494036102 493908157 492455177 491269150 492562408 493654480 491787109 489577904 487151375
3362.8D87151375j018067J369400K491341J090126j606521r45130j391220O87943K989730
$$ 487151375 486133308 487502708 489994049 491084175 489477654 488532524 487141304 487829247 490818977
3371.4D90818977o36787j283073r38111j152801J23405K44141K83012m1122j69411
$$ 490818977 490182190 488899117 487961006 486808205 486931610 487175751 487458763 487417641 487248230
3380.1D87248230p79343j141662k41623r06334j454888k55928N12200l7346N646R07860
$$ 487248230 486468887 485327225 485085602 484179268 482724380 482468452 482980652 482943306 482948952 483856812
3389.8D83856812o60935k593460k065697k27432K071800R23615j017609N47638P67403
$$ 483856812 483195877 480602417 478536720 478309288 480381088 481304703 480287094 480834732 481602135
3398.4D81602135p4120j043472k522926j698609J71204R48066J162186K51236j314621
$$ 481602135 481528015 480484543 477961617 476263008 476434212 477382278 478544464 478795700 477481079
3407.1D77481079q94203n33676K33001J310578N7945K31362j03989j537895p58629
$$ 477481079 476586876 476053200 476286201 477596779 477654724 477886086 477782097 476244202 475485573
3415.8D75485573m41055P9689J662712J187667o34002j618767k266464k60811K484512
$$ 475485573 475044518 475124207 476786919 477974586 477340584 475721817 473455353 473194542 475679054
3424.5D75679054N92079k136077o13366R15299M6692L52783p65266j212388P27463
$$ 475679054 476271133 474135056 473521690 474436989 474483681 474836464 474071198 472858810 473586273
3433.2D73586273P39594l9597k53792O21605k34298L52554K025757L56216j500206
$$ 473586273 474325867 474286270 474032478 474654083 474419785 474772339 476798096 477154312 475654106
3441.8D75654106l716431m22859K085457K96326N58166j922798j669655J262360P81555
$$ 475654106 471937675 471514816 473600273 473896599 474454765 472531967 470862312 472124672 472906227
3450.5D72906227n52215J526756J998138q37326l29246K56538P56035j988030k376136
$$ 472906227 472354012 473880768 475878906 475041580 474712334 474968872 475724907 473736877 471360741
3459.2D71360741K276153J067925K50015j253204j254349J557388L50609J57242K7160
$$ 471360741 473636894 474704819 474954834 473701630 472447281 474004669 474355278 474512520 474539680
3467.9D74539680n55992k28691J546288J430588p01180P8278L16047m11720q17757
$$ 474539680 473983688 473754997 475301285 476731873 476030693 476108971 476425018 476013298 475195541
3476.6D75195541N53933J129684O57043J678010J038742q68950k180062k1019j68724
$$ 475195541 475749474 476879158 477536201 479214211 480252953 479384003 477203941 477182922 477014198
3485.2D77014198j54533L067703r44290l386803L94020Q23822O74744K232018J0566
$$ 477014198 476859665 479927368 478983078 475596275 475990295 476814117 477488861 479720879 479731445
3493.9D79731445k253341J482010K279701K82173L33137o64596j726952q0070K081337
$$ 479731445 477478104 478960114 481239815 481521988 481855125 481190529 479463577 479383507 481464844
3502.6D81464844o56090o63910J709671l53432m69284J384125J626434L37792N67474
$$ 481464844 480808754 480144844 481854515 481501083 481031799 482415924 484042358 484380150 484947624
3511.3D84947624R19304j576576j279030O70395P67937J05972j298905O42205R70802
$$ 484947624 485866928 484290352 483011322 483681717 484449654 484555626 483256721 483898926 484869728
3520D84869728p17468J580353N18074j346512J325073L263474J802063j165848j298256
$$ 484869728 484152260 485732613 486250687 484904175 486229248 489492722 491294785 490128937 488830681
3528.6D88830681j199722R34219M58946l76129J636848N8976R99221R51920p37762
$$ 488830681 487630959 488565178 489024124 488647995 490284843 490343819 491343040 492294960 491557198
3537.3D91557198Q83979M72412j110610j849251O59561P23114l56636M11072J34964
$$ 491557198 492441177 492913589 491802979 489953728 490613289 491336403 490979767 491390839 491525803
3546D91525803J802978J330376N8822O7292K116928J477356j159935m42543j995354
$$ 491525803 493328781 494659157 494717979 494785271 496902199 498379555 497219620 496777077 494781723
3554.7D94781723J748428L687020J270828M63104j098251m06189m6501K637672J014290
$$ 494781723 496530151 500217171 501487999 501951103 500852852 500446663 500400162 503037834 504052124
3563.4E04052124o71349M026566k739754m309845R85909L89290L148155J133957J007271
$$ 504052124 503380775 507407341 504667587 500357742 501343651 501732941 504881096 506015053 507022324
3572E07022324K751617J731720m71153j139374K86064J06239Q05474P37495L05100
$$ 507022324 509773941 511505661 511034508 509895134 510181198 510287437 511092911 511830406 512135506
3580.7E12135506J656112J846276n28450j606102J021728j177063J2589M867286n17044
$$ 512135506 513791618 515637894 515109444 513503342 514525070 513348007 513360596 518227882 517710838
3589.4E17710838O05889K917823J397019j447334q80356J523437p9345M031982L574409
$$ 517710838 518316727 521234550 522631569 521184235 520303879 521827316 521747971 525779953 529354362
3598.1E29354362j414184L63998k41699J698876L082504K2926p06825J419754J553574
$$ 529354362 527940178 528304176 528062477 529761353 532843857 532866783 532159958 533579712 535133286
3606.8E35133286j978188L236961J920204q27636K675514m231491j136589M920425
$$ 535133286 533155098 536392059 538312263 537484627 540160141 535928650 534792061 539712486
3614.5E39712486R0218K008514L488961K039604O44417k446137n19485M982948K541504
$$ 539712486 539802704 541811218 545300179 547339783 547984200 545538063 545018578 550001526 552543030
3623.1E52543030p9499K514458q82187j003952L144341k244911l219300K280960L398133
$$ 552543030 552463531 554977989 554095802 553091850 556236191 553991280 550771980 553052940 556451073
3631.8E56451073M323959J685486j03760L103485K898712J004906J079941M50897N27916
$$ 556451073 560775032 562460518 562356758 565460243 568358955 569363861 570443802 570894699 571422615
3640.5E71422615J232071Q19855O866R32923N177154N804520r92775M299812R625397
$$ 571422615 572654686 573474541 573481407 574414330 579591484 585396004 584403229 588703041 598328438
3649.2E98328438n92003o991310m896012Q26073K213974N307121P680817o255646j190719
$$ 598328438 597736435 590745125 585849113 586675186 588889160 594196281 601877098 595621452 594430733
3657.9E94430733L894081j77879n2376J768722L962174J169319K58942J567001K36130
$$ 594430733 598324814 598146935 598094559 599863281 603825455 604994774 605253716 606820717 607056847
3666.5F07056847L971786R97887l927536K166443j373482K353935N062790O331940
$$ 607056847 611028633 612026520 608098984 610265427 608891945 611245880 616308670 622640610
3674.3F22640610l950005j8923073J2671051R383126L073578j885415J34621L267822
$$ 622640610 618690605 599767532 612438583 621821709 624895287 623009872 623144493 626412315
3682F26412315K10648N66292J374397R91325M433442N574607m320983j408806P801971
$$ 626412315 626622963 627189255 628563652 629554977 633988419 639563026 635242043 633833237 641635208
3690.6F41635208p438660m225807N450211J960144L198891J845626o91604r16138j141395
$$ 641635208 634196548 629970741 635420952 637381096 640579987 642425613 641734009 640817871 639676476
3699.3F39676476K542610N30853m946480p29561M436188L502045J212921j07880O43616
$$ 639676476 642219086 642749939 637803459 637073898 641510086 645012131 646225052 646117172 646760788
3708F46760788M063034o393509r5596N696258q953857K455292K981949J709899J098175
$$ 646760788 650823822 644430313 644334717 650030975 641077118 643532410 646514359 648224258 649322433
3716.7F49322433n85861P06787k527771Q89511L329773l802795P69424N155640q60748
$$ 649322433 648736572 649443359 646915588 647805099 651134872 647332077 648101501 653257141 652396393
3725.4F52396393k200623k12784L246079K939072j238861L851165k329025q811645
$$ 652396393 650195770 649982986 653229065 656168137 654929276 658780441 656451416 647639771
3733.1F47639771P692642J103897q594132K740097J864930J197280L998337L001328
$$ 647639771 655332413 656436310 647842178 650582275 652447205 653644485 657642822 660644150
3740.8F60644150m673233Q79898J2256851m875641j7791900Q980178N033265Q191070
$$ 660644150 655970917 656850815 669107666 664232025 646440125 655420303 660453568 668644638
3748.5F68644638m184265j8237763J0959473j894836m196167P796783N600662L131485
$$ 668644638 664460373 646222610 657182083 655287247 651091080 658887863 664488525 667620010
3756.2F67620010o427765O03257L827133q449249k590485L661346J957856Q41751L755111
$$ 667620010 661192245 661795502 665622635 657173386 654582901 658244247 660202103 661043854 664798965
3764.9F64798965k062225k592697M580231L686905k164460j0278091K393494N067977
$$ 664798965 662736740 660144043 664724274 668411179 666246719 655968628 658362122 663430099
3772.6F63430099J882401R6054k557678n39017p36542L776780K391662o282425K633896
$$ 663430099 665312500 665408554 662850876 662311859 661575317 665352097 667743759 661461334 664095230
3781.3F64095230O78635N85479K119980l869171j405334J767654K063141K34985O25611
$$ 664095230 664773865 665359344 667479324 663610153 662204819 663972473 666035614 666270599 666896210
3790F66896210J104049j755371q66317O00967K749481J578903m528503k583695J101075
$$ 666896210 668000259 666244888 665378571 665979538 668729019 670307922 665779419 663195724 664296799
3798.7F64296799L116836L028031n064316q638153K448044M834823N311203N966873
$$ 664296799 667413635 670441666 665377350 656739197 659187241 664022064 669333267 675300140
3806.4F75300140r978866n556565N477753L020783P92083r31396j59226K906876O064453
$$ 675300140 665321274 659764709 665242462 668263245 669055328 668123932 667964706 670871582 676936035
3815.1F76936035m841842j7527237O206893Q070908O611404L270493j4656906j606903
$$ 676936035 672094193 654566956 660773849 668844757 675456161 678726654 664069748 662462845
3822.8F62462845L727035L141480K433395q27713m387054Q54187K434997K353974P26166
$$ 662462845 666189880 669331360 671764755 670937042 666549988 667404175 669839172 672193146 672919312
3831.4F72919312r812546K893142R142075m320755p64999O729965j0065460l917847
$$ 672919312 663106766 665999908 675141983 670821228 670056229 676786194 666720734 662802887
3839.2F62802887Q468628n345688p77054P466660k273255n611267N38178J620483J849442
$$ 662802887 671271515 665925827 665148773 672615433 670342178 664730911 665269089 666889572 668739014
3847.8F68739014J255493j635895N10178K087707m335785j572571j6457977Q429337
$$ 668739014 669994507 668358612 668868790 670956497 666620712 665048141 648590164 657019501
3855.6F57019501J1655502j618652j558228L531494L191758L032226m139175J22528
$$ 657019501 668675003 667056351 665498123 669029617 672221375 675253601 671114426 671236954
3863.3F71236954O538086o962052p349167K925797N185776Q540497o522141j3159027
$$ 671236954 677775040 670812988 663463821 666389618 671575394 680115891 673593750 660434723
3871F60434723L740311P688369M224472r692306J276092K501297m309463J445923N669937
$$ 660434723 664175034 671863403 676087875 666395569 667671661 670172958 665863495 667309418 672979355
3879.7F72979355l929367m885559N528640J985550J310044M101181j3074723k448120
$$ 672979355 669049988 664164429 669693069 671678619 672988663 677089844 664015121 661567001
3887.4F61567001N023194L302536M488220l008728j0820770K431717L559036N75027
$$ 661567001 666590195 669892731 674380951 671372223 660551453 662983170 666542206 667117233
3895.1F67117233K834397J0604K326966K964248p524185L899002k418823q091202N103073
$$ 667117233 669951630 669962234 672289200 675253448 667729263 671628265 669209442 661118240 666221313
3903.8F66221313k199859J004715L461685N06744K021561o15234k326813k445602K03552
$$ 666221313 664021454 665026169 668487854 668994598 671016159 670400925 668074112 665628510 665832062
3912.5F65832062K139129J92261J088715K050552l538437l632202M519501J173096
$$ 665832062 667971191 668163452 669252167 671302719 667764282 664132080 668651581 669824677
3920.2F69824677l404465K079391P46613q49533j268006o10962R89914j24893J062012
$$ 669824677 666420212 668499603 669246216 668396683 667128677 666517715 667507629 667382736 668444748
3928.8F68444748n89981p87811J274719j499024j430053J248550J796799q99887p09992
$$ 668444748 667854767 667066956 668341675 666842651 665412598 666661148 668457947 667558060 666848068
3937.5F66848068R86252r95102j333465J540603K363358k491989k590561j512680Q96225
$$ 666848068 667834320 666839218 665505753 667046356 669409714 666917725 664327164 662814484 663710709
3946.2F63710709L136215k011109O46592R13772l085785R75113Q8272M65393K564164
$$ 663710709 666846924 664835815 665482407 666396179 663310394 664285507 664373779 664839172 667403336
3954.9F67403336j079178l171845q4228J471481J67542K061004p1335l489990J173935
$$ 667403336 666324158 663152313 663068085 664539566 664707108 666768112 666696777 663206787 664380722
3963.6F64380722Q52966l353805k79389L077088J119613j368255j165238J036072L54386
$$ 664380722 665233688 661879883 661600494 664677582 665797195 664428940 663263702 664299774 664654160
3972.2F64654160q00553O54221O58111M14505j97448j165467l84979J749573J007232
$$ 664654160 663853607 664507828 665165939 665580444 665382996 664217529 663832550 665582123 666589355
3980.9F66589355j531677L01132K28882k111816n44739J405411J186142p09992k498703
$$ 666589355 665057678 665358810 665587692 663475876 662931137 664336548 665522690 664812698 662313995
3989.6F62313995k999801m89502L163986K268753j192932p20139K729111K243195r43070
$$ 662313995 659314194 658824692 661988678 664257431 663064499 662344360 665073471 667316666 666373596
3998.3F66373596p55462K40631
$$ 666373596 665618134 665858765
4000.2F65858765
$$ 665858765
##END=$$ End of the data block
