##TITLE=Amido Residuo - Bianca $$ Begin of the data block
##JCAMP-DX=5.00 $$ ACD/SpecManager v 10.08
##SPECTROMETER/DATA SYSTEM=Alpha
##DATE=24 Oct 2013 13:19:44
##DATA TYPE=INFRARED SPECTRUM
##DATA CLASS=XYDATA
##ORIGIN=
##OWNER=
##NPOINTS=1765
##FIRSTX=399.75695801
##LASTX=3997.56933594
##MAXX=3997.56933594
##MINX=399.75695801
##MAXY=0.84333158
##MINY=0.16049498
##XFACTOR=1.0000000000
##YFACTOR=1.000000000000000e-9
##FIRSTY=0.49532849
##DELTAX=2.03957629
##XUNITS=1/CM
##YUNITS=ARBITRARY UNITS
##XYDATA=(X++(Y..Y))
399.8D95328486o062746m377723k615571r02086Q50737K012998K055943J713305Q23468
418.1D88826811j192093k391457k853423l321887l385812l427624l366202k785892
434.4D66102421j774192j49130K068519M006535M850775M596174L839969K955556J827032
452.8D88323659Q16941K50906p12782j979530k636165k824008l262252l869056l981919
471.1D70125794l749251l471851k869249j948386j210153o42002j15275J50710J44869
489.5D56415206k56061j205087j908451j837135j725137k118826k662897k924263l199399
507.9D38577950l752947m312515m520744m547954m842043m987061m209310k754479
524.2D04650897j522213n85497M20004J462639K713382M252463N696118O426096N821824
$$ plain form
399.8 495328486 489265740 484888017 482272446 481370360 482221097 484234095 486290038 488003343 488826811
418.1 488826811 487634718 485243261 482389838 479067951 475682139 472254515 468888313 466102421
434.4 466102421 464328229 464179099 466247618 470254153 475104928 479701102 483541071 486496627 488323659
452.8 488323659 489140600 489391506 488678724 486699194 484063029 481239021 477976769 474107713 470125794
471.1 470125794 466376543 462904692 460035443 458087057 456876904 456234902 456119627 456270337 456415206
489.5 456415206 456159145 454954058 453045607 451208472 449483335 447364509 444701612 441777349 438577950
507.9 438577950 434825003 430512488 425991744 421443790 416601747 411614686 407405376 404650897
524.2 404650897 403128684 402543187 402963191 404425830 407139212 411391675 417087793 423513889 429335713
542.5D29335713L972084J929283L67135q51721j821697k708614l610044m463226n425989
560.9D16722924o536335p402659p926166p970750p019818m899472j901299J127541
577.2C74193966L633172N874008P741332Q512824P936806O410897M609465K879858
593.5D21792328J342446K43098k31684l25232l38078j09196M40985J253844K090603
611.9D26159114K697199L190279L808767M570812N272120N529165N141080M497111
628.2D60865647L911227L377378K788364K297789K027035J716971J391501J394957
644.5D79770869J564175J525074J370639J387715J568854J594603J391113J237929
660.8D91410971J334995J387566J414329J645803J634091J702488J758754J524568
$$ plain form
542.5 429335713 433307797 435237080 435604215 434752494 432930797 430222183 426612139 422148913 416722924
560.9 416722924 410186589 402783930 394857764 386887014 379867196 374967724 373066425 374193966
577.2 374193966 377827138 383701146 391442478 399955302 407892108 414303005 418912470 421792328
593.5 421792328 423134774 423377872 423146188 422820956 422482878 422373682 422814667 424068511 426159114
611.9 426159114 428856313 432046592 435855359 440426171 445698291 451227456 456368536 460865647
628.2 460865647 464776874 468154252 470942616 473240405 475267440 476984411 478375912 479770869
644.5 479770869 481335044 482860118 484230757 485618472 487187326 488781929 490173042 491410971
660.8 491410971 492745966 494133532 495547861 497193664 498827755 500530243 502288997 503813565
677.1E03813565J473963J764298J779556J299202R01282P71225L67045o04987j702190
695.5E09862959k616882l502726m205674m171312l305257j937657l70771J343370L233164
713.8D94329214M867017N885780O706000P466912P878065P821083P146478O236553
730.2E48337102N534470M734993L620028K464116J436353J43826j645982l471673m817724
748.5E56335509n745232o439746o859719o830276o247043n208552l737926j579285
764.8E13687730J354098M492700P166744R242713J0770559J1456192J0974943R710730
781.2E78856409Q494496P441163O218255N240142M985273N199730N383253N580068
797.5F27398789N961776O068468N438149M384637L619253L148020K521097J789868
$$ plain form
677.1 503813565 505287528 507051826 508831382 510130584 511031866 511803091 512170136 511565149 509862959
695.5 509862959 507246077 503743351 499537677 495366365 492061108 490123451 489752680 491096050 494329214
713.8 494329214 499196231 505082011 511788011 519254923 527132988 534954071 542100549 548337102
730.2 548337102 553871572 558606565 562226593 564690709 566127062 566270888 564624906 561153233 556335509
748.5 556335509 550590277 544150531 537290812 530460536 524213493 519004941 515267015 513687730
764.8 513687730 515041828 519534528 526701272 535943985 546714544 558170736 569145679 578856409
781.2 578856409 587350905 594792068 601010323 606250465 611235738 616435468 621818721 627398789
797.5 627398789 633360565 639429033 644867182 649251819 652871072 656019092 658540189 660330057
813.8F60330057J316190R32932J56343j061022k268851l284693m512847o075859p391333
832.1F38140917p929564p984757p934988p505655o509602n469561m871428m481852
848.5E85453510m035055l887177m332840m855395m199087j315773L333986Q151591
864.8E74313760J1922180J4183343J4614224J3091088J0165333O715060L099322o94156
881.1F47410154m125297o468355p803262q605659q777439q093775p112205o574630
897.4E89849532o522537o645619o987095p909894r290696j0520219j1421681j2180686
913.7E18371105j2634635j2117266j0229469p439583m639387k426774p14898Q33690
930D69002783K185583L325373M618556O091714P127165P017285N093187R88305m609049
$$ plain form
813.8 660330057 661646247 662579179 662735522 661674500 659405649 656120956 651608109 645532250 638140917
832.1 638140917 630211353 622226596 614291608 606785953 600276351 594806790 589935362 585453510
848.5 585453510 581418455 577531278 573198438 568343043 564143956 562828183 566162169 574313760
864.8 574313760 586235940 600419283 615033507 628124595 638289928 645004988 648104310 647410154
881.1 647410154 643284857 636816502 629013240 620407581 611630142 603536367 596424162 589849532
897.4 589849532 583326995 576681376 569694281 561784387 552493691 541973472 530551791 518371105
913.7 518371105 505736470 493619204 483389735 475950152 471310765 468883991 468169093 469002783
930 469002783 471188366 474513739 479132295 485224009 492351174 499368459 504461646 505449951 500840902
948.4E00840902j0112255j4190197j6682864j8298685j9579560k0557731k1183908
962.7C80235702k1653295k2145808k2502332k2472263k2008508k1139547j9753293
977B28560656j7687604j5023976j2096644r195342o521225m219979k361343r59560
993.3A60494983P1958P79644J198694J343727J188859P61435J94847k79710m69163
1011.6A65285274l02285J53333Q28803J596928K312064K935424L451482L782838L862739
1030A83906600L695473L282249K683878J989528J407192J222238J478493J924649K478867
1048.3B04069167L377960M673838O139174P538826Q857265J0249063J1610568J2026697
1064.7B68542558R766906L625423m859418j1484742j3049304j0223165n936086k175808
$$ plain form
948.4 500840902 490728647 476538450 459855586 441556901 421977341 401419610 380235702
962.7 380235702 358582407 336436599 313934267 291462004 269453496 248313949 228560656
977 228560656 210873052 195849076 183752432 174557090 168035865 163815886 161454543 160494983
993.3 160494983 160566941 161346585 162545279 163889006 165077865 165839300 166034147 165754437 165285274
1011.6 165285274 164982989 165136322 165965125 167562053 169874117 172809541 176261023 180043861 183906600
1030 183906600 187602073 190884322 193568200 195557728 196964920 198187158 199665651 201590300 204069167
1048.3 204069167 207447127 212120965 218260139 225798965 234656230 244905293 256515861 268542558
1064.7 268542558 278309464 281934887 277075469 265590727 252541423 242318258 236382172 234206364
1081B34206364O53564K720967M276038N531251O459326O927192O774902N837709M273713
1099.3B77661026K610951J543492J492828K274365L327995M192293M626214M490435
1115.6C02219599L792972K870589K222449K081037K489805L381341M370124M654526
1132C28082442L442347O64324k901048o208568q547962r673804r679735q786499p294178
1150.3B79097319n541027l727019j904189j38939J568020L381729N449325P733345
1166.6B85918564R979188J1951447J3574063J4887512J5825063J6269088J6276687
1180.9C84681612J5905857J5113116J3772636J1806995R443343P146269N172610L594786
1197.2D66637224K548724K136678K301663K821475L530115M450709N506694O298483
$$ plain form
1081 234206364 234859928 237580895 241856933 247388184 253847510 260774702 267549604 273387313 277661026
1099.3 277661026 280271977 281815469 283308297 285582662 288910657 293102950 297729164 302219599
1115.6 302219599 306012571 308883160 311105609 313186646 315676451 319057792 323427916 328082442
1132 328082442 331524789 332189113 329288065 323079497 314531535 304857731 295177996 286391497 279097319
1150.3 279097319 273556292 269829273 267925084 267786145 269354165 272735894 278185219 285918564
1166.6 285918564 295897752 307849199 321423262 336310774 352135837 368404925 384681612
1180.9 384681612 400587469 415700585 429473221 441280216 450723559 457869828 463042438 466637224
1197.2 466637224 469185948 471322626 473624289 476445764 479975879 484426588 489933282 496231765
1213.5D96231765O457418N958259M974246L666699K133787O03020n32329j163900j552224
1231.9E16776741j792908j755893j425505r32634l87847K69353J144230K044738K608537
1250.3E16548812K761245K726793K639354K397597K011835J767099J929343K387404
1266.6E35169482K696634K589762K183795J586079P53522j54435p57456r51231j070976
1284.9E42045176j327336j540482j602471j743376k119601k468049k449513k153814
1301.2E26640534j967966j987159j930833j662612j469910j593292j790702j884521
1317.6E12353539k156078k852500l874242m929334n790621o359220o383627n597771
1333.9D74410146m245936k929897j944631j067698k27123K21997Q1062l02553m79430
$$ plain form
1213.5 496231765 502689183 508647442 513621688 517288387 519422174 520025194 519492865 518328965 516776741
1231.9 516776741 514983833 513227940 511802435 510869801 510481954 510751307 511895537 513940275 516548812
1250.3 516548812 519310057 522036850 524676204 527073801 529085636 530852735 532782078 535169482
1266.6 535169482 537866116 540455878 542639673 544225752 544979274 544824839 544067383 543116152 542045176
1284.9 542045176 540717840 539177358 537574887 535831511 533711910 531243861 528794348 526640534
1301.2 526640534 524672568 522685409 520754576 519091964 517622054 516028762 514238060 512353539
1317.6 512353539 510197461 507344961 503470719 498541385 492750764 486391544 480007917 474410146
1333.9 474410146 470164210 467234313 465289682 464221984 463994861 464216858 464297920 463995367 463515937
1352.2D63515937n75691q69244j164049j175553j068443r53674p12872k84612M20302
1370.6D57132101J139432J484037J535088J682937J853227K153397L127932M589349
1386.9D74697500N124718M274548L104895J875639P40617j79946q76039j229883j526385
1405.3D86005664j793116k019257k190351j920343j240432r00090j096010p62612Q3745
1423.6D74167198O08414Q52138J058847J370817J796186K033890J809269J625448J791656
1442D87113863J626849R80318O8307p29770j117110j309216k041369k622426j160204
1460.3D80809242O28799K240002L947049N601526P736116J0388613J1028051J0114253
1476.6E32493651R558320R146273Q805871Q447290Q393466Q178413P202148O094635
$$ plain form
1352.2 463515937 462940246 462071002 460906953 459731400 458662957 457709283 456996411 456711799 457132101
1370.6 457132101 458271533 459755570 461290658 462973595 464826822 466980219 470108151 474697500
1386.9 474697500 479822218 484096766 487201661 489077300 489817917 489637971 488761932 487532049 486005664
1405.3 486005664 484212548 482193291 480002940 478082597 476842165 475942075 474846065 474083453 474167198
1423.6 474167198 474775612 475627750 476686597 478057414 479853600 481887490 483696759 485322207 487113863
1442 487113863 488740712 489721030 489789337 489059567 487942457 486633241 484591872 481969446 480809242
1460.3 480809242 481438041 483678043 487625092 493226618 500962734 511351347 522379398 532493651
1476.6 532493651 542051971 551198244 560004115 568451405 576844871 585023284 592225432 598320067
1493E98320067O134212O485820N568266M715860M769384N516589N514026L650605L164709
1511.3F43839538L671348L780723L575504L472626L550768K902090K252162K326131
1527.6F69370890K550840K787948K538800K149641K735556L387272K065003R89616
1543.9F88575566J276314J705945J770615J615167J913428K495587K426505N90205
1560.3G02369332k3901Q27789J287699J080692N56230N29468Q40068K90752n22852
1578.6G07235277l83199k67684o03378j111567j401186j573741j936615k546966k986491
1597F94424450l098130l392041l968179m400074m570425m908800n273819n203664n542040
1615.3F54067278o633461n914747m890621n278409n316317m948973m665494l664732
$$ plain form
1493 598320067 604454279 610940099 616508365 621224225 625993609 631510198 637024224 640674829 643839538
1511.3 643839538 647510886 651291609 654867113 658339739 661890507 664792597 667044759 669370890
1527.6 669370890 671921730 674709678 677248478 679398119 682133675 685520947 687585950 688575566
1543.9 688575566 689851880 691557825 693328440 694943607 696857035 699352622 701779127 702369332
1560.3 702369332 702345431 703173220 704460919 705541611 706097841 706627309 707467377 707758129 707235277
1578.6 707235277 706852078 706584394 705981016 704869449 703468263 701894522 699957907 697410941 694424450
1597 694424450 691326320 687934279 683966100 679566026 674995601 670086801 664812982 659609318 654067278
1615.3 654067278 647433817 641519070 636628449 631350040 626033723 621084750 616419256 612754524
1631.6F12754524k709925l015638l071248j939237p69556K99752J121044J430929J785636
1650F05886281K954661L561736K670824L008485M040241M741728M768312M611075N216599
1668.4F41459942N582988M995287N149722N382061M949093N037188N709529O008029
1684.7F84273839M606962L869295M180253M276097M685282M695118M161477L863692
1701G18612015L018976K724289K816201K701223K785265K905071K999663K822697J975775
1719.3G43361175J503766J674831J929700K084076K163887K151072K100230J578867
1735.7G58547604J271188J434684J471341J585662J793683J769602J464665J165092
1752G70503521J130760J167595J114011J220107J284242J012742R55701J249969J498461
$$ plain form
1631.6 612754524 610044599 607028961 603957713 602018476 601248920 601548672 602669716 604100645 605886281
1650 605886281 608840942 612402678 615073502 618081987 622122228 626863956 631632268 636243343 641459942
1668.4 641459942 647042930 652038217 657187939 662570000 667519093 672556281 678265810 684273839
1684.7 684273839 688880801 692750096 696930349 701206446 705891728 710586846 714748323 718612015
1701 718612015 721630991 724355280 727171481 729872704 732657969 735563040 738562703 741385400 743361175
1719.3 743361175 744864941 746539772 748469472 750553548 752717435 754868507 756968737 758547604
1735.7 758547604 759818792 761253476 762724817 764310479 766104162 767873764 769338429 770503521
1752 770503521 771634281 772801876 773915887 775135994 776420236 777432978 778388679 779638648 781137109
1770.3G81137109J151323M50254M30584Q93414J059949P99060O23405P89881J108348
1788.7G88443327J161694P35164M52340P43091R35972O96540N26905P36534Q92937
1807G95324504P18356N42044O34551P71404O38246M74990O55591R00865P46607M78566
1827.4H01885724M48167M01557L27289K56360K54213M69566O76453M32074p8678p0095
1847.8H05002630J94788J64270J2696J23203L44455K91765Q0526J66714N13196N06997
1868.2H07401240J2219j54555J83165M21464L21031J75059K95281N13077N14209L13402
1888.6H09995592J78039K81632L03030R4056L2782K03550K68519J34230L9100J17064
1909H11647594J86920J14620O2406J23382K04801J89245K8849o2705R7752K09272Q9705
$$ plain form
1770.3 781137109 782288432 782738686 783169270 784062684 785122633 785921693 786545098 787334979 788443327
1788.7 788443327 789605021 790340185 790792525 791535616 792471588 793168128 793695033 794431567 795324504
1807 795324504 796042860 796584904 797219455 797990859 798629105 799104095 799759686 800660551 801407158 801885724
1827.4 801885724 802333891 802735448 803062737 803319097 803573310 804042876 804719329 805151403 805072725 805002630
1847.8 805002630 805197418 805361688 805374384 805497587 805842042 806133807 806214333 806381047 806894243 807401240
1868.2 807401240 807413459 807258904 807442069 807863533 808184564 808359623 808654904 809167981 809682190 809995592
1888.6 809995592 810173631 810455263 810758293 810852349 810885131 811088681 811357200 811491430 811530530 811647594
1909 811647594 811834514 811949134 812011540 812134922 812339723 812528968 812557817 812495112 812592864 812802136 812891841
1931.5H12891841j6153Q3566K53737K63989J30415N3465J52111K05338J19329J36017
1951.9H14273655K77639L11375J77621J09077K16186K96891J93119O4134J00375K12550
1972.3H16232622K01761Q0228N7996J51753J68860O1691R835R4532J46866J6809j12891
1994.7H17110062m2141O3598p15j54495j99974j62720j82689k75135l17216k68817
2015.1H15569758k95519m49300n37217m60207m06802m73976n27621n04434m57346m38929
2035.5H11018407m55320m55737m13715l58463l13222k76208k07067j29521q3565l8922
2055.9H08286667J7583O4612P6174O4910O3717Q7381J06573R7334R6500J09375J10566
2078.3H09181392J20342J23620J19507J51873J72198J68323J80781J87278J85966K21849
$$ plain form
1931.5 812891841 812875688 812959254 813212991 813476980 813607395 813660860 813812971 814018309 814137638 814273655
1951.9 814273655 814551294 814862669 815040290 815149367 815365553 815662444 815855563 815919697 816020072 816232622
1972.3 816232622 816434383 816514611 816572607 816724360 816893220 816954911 816964746 817059278 817206144 817222953 817110062
1994.7 817110062 817067921 817131519 817130804 816976309 816776335 816613615 816430926 816155791 815838575 815569758
2015.1 815569758 815274239 814824939 814287722 813827515 813420713 812946737 812419116 811914682 811457336 811018407
2035.5 811018407 810563087 810107350 809693635 809335172 809021950 808745742 808538675 808409154 808325589 808286667
2055.9 808286667 808304250 808368862 808445036 808509946 808573663 808661044 808767617 808864951 808961451 809070826 809181392
2078.3 809181392 809301734 809425354 809544861 809696734 809868932 810037255 810218036 810405314 810591280 810813129
2098.7H10813129K63572K41577J84715J83106K24232K02060J47581J55032J82211J42276
2119.1H12739491N1797J5199N1558P0453M2319K6167N1617Q7857N6923j2934J6808
2141.5H13197255J22726J48714P7665O2286J48356J96398J72496K03192L31163M26591
2161.9H15086842L94582L73185M75407N83231N71430N09024N56766O51956O28829N44012
2182.3H20375264N45323O26385O52194N66721M64439M64022N34177N08309M24981M82440
2202.7H25644255O00278N82039M78149M62890N51044N80848M96983M32670M75586N02050
2223.1H30806792L97563L05533L63946M40717L81052K66612K66731L69310L77834K59101
2243.5H34235191K07782K78473L33548K80320J92583K22206L24190L16977K59757K90692
$$ plain form
2098.7 810813129 811076701 811318278 811502993 811686099 811910331 812112391 812259972 812415004 812597215 812739491
2119.1 812739491 812791288 812806487 812858045 812928498 812970817 812996984 813048601 813136458 813193381 813180447 813197255
2141.5 813197255 813319981 813468695 813546360 813608646 813757002 813953400 814125896 814329088 814660251 815086842
2161.9 815086842 815481424 815854609 816330016 816913247 817484677 817993701 818550467 819202423 819831252 820375264
2182.3 820375264 820920587 821546972 822199166 822765887 823230326 823694348 824228525 824736834 825161815 825644255
2202.7 825644255 826244533 826826572 827304721 827767611 828318655 828899503 829396486 829829156 830304742 830806792
2223.1 830806792 831204355 831509888 831873834 832314551 832695603 832962215 833228946 833598256 833976090 834235191
2243.5 834235191 834442973 834721446 835054994 835335314 835527897 835750103 836074293 836391270 836651027 836941719
2263.9H36941719L32773L09467K81990K99513L34620L27826K69175K59697L38912L50952
2284.3H40046644K27869J22070J55032K52485K67267J77384J05560J57833K46465K03728
2304.7H41962337P7785R0062K28465K24888R3818O2823J11222Q5116o676j1623J13309
2327.1H43031526K08854R1195j20818j44959n662m0233k93315l74257k55347j50382
2347.5H41946602q1182n662Q9407J19209L7611j39296k79606j81436j68920l41534
2367.9H40995193l48628k55942k30611k57849k08319p4923k9981j16467j95206j51693
2388.3H39125574r4712j51038k26558k20596j83642k05279k82406l00110k54392k98441
2408.7H36908400m07398m25458l53396l31759m33266n33164n13017m55558m94600n86390
$$ plain form
2263.9 836941719 837274492 837583959 837865949 838165462 838500082 838827908 839097083 839356780 839695692 840046644
2284.3 840046644 840274513 840396583 840551615 840804100 841071367 841248751 841354311 841512144 841758609 841962337
2304.7 841962337 842040122 842130184 842358649 842583537 842677355 842740178 842851400 842936516 842929840 842918217 843031526
2327.1 843031526 843240380 843331575 843210757 843065798 843060136 843019903 842726588 842352331 842096984 841946602
2347.5 841946602 841865420 841859758 841949165 842068374 842105985 841966689 841687083 841505647 841336727 840995193
2367.9 840995193 840646565 840390623 840160012 839902163 839693844 839618921 839588940 839472473 839277267 839125574
2388.3 839125574 839030862 838879824 838653266 838432670 838249028 838043749 837761343 837461233 837206841 836908400
2408.7 836908400 836501002 836075544 835722148 835390389 834957123 834423959 833910942 833455384 832960784 832374394
2429.1H32374394n93782n29527n26905o12498o45816n71191n31376o07788o84679o49988
2449.5H26420844n69523n74946n98490n22972m45962m87387n73396n67377m72724m22240
2469.9H21185827m83095n43774n00023m24921m25220m54187m05968l23951l13878l56674
2490.3H16954136l57628l02494k51233k38836k47359k34723k00928k21133k84970k75373
2510.7H14339459k13385k22683l13937l71456l54112l63886m49061n17190m89414m35948
2531.1H10608387m73678n95987o55055n96941n83052o73533p07090o27040n76139o33836
2551.5H04486036o91890o49214n58257n53906o54340o71566n77926n63979o10829n93602
2571.9G98360527n46754n46634n98252o14107n37872m56154m74811n40793m80354l58939
$$ plain form
2429.1 832374394 831780612 831251085 830724180 830111682 829465866 828894675 828363299 827755511 827070832 826420844
2449.5 826420844 825851321 825276375 824677885 824154913 823708951 823221564 822648168 822080791 821608067 821185827
2469.9 821185827 820702732 820158958 819658935 819234014 818808794 818354607 817948639 817624688 817310810 816954136
2490.3 816954136 816596508 816294014 816042781 815803945 815556586 815321863 815120935 814899802 814614832 814339459
2510.7 814339459 814126074 813903391 813589454 813217998 812863886 812500000 812050939 811533749 811044335 810608387
2531.1 810608387 810134709 809538722 808883667 808286726 807703674 807030141 806323051 805696011 805119872 804486036
2551.5 804486036 803794146 803144932 802586675 802032769 801378429 800706863 800128937 799564958 798954129 798360527
2571.9 798360527 797813773 797267139 796668887 796054780 795516908 795060754 794585943 794045150 793564796 793205857
2592.3G93205857l41475l88682m11689l57091l31283m31240n30064n46574n70119o80148
2612.7G88617492q06093q26180q04186r02772j046717j097441j103640j144111j230657
2631G79655695j287043j239061j196623j266599j316190j273215j246094j269341j269162
2649.4G68292367j212120j152515j157224j207292j209259j147807j098454j119733
2665.7G58987963j148283j104772j038969j011193r87828r32514q98481r17553r56536
2684.1G49991834r64105r37939r33468r66430j027107j082718j096964j097679j140476
2702.4G40744948j205623j245200j267791j274109j242757j210153j180112j151681
2718.7G30967522j184225j187325j109481j041651j006960r92299r39846q54194q45253
$$ plain form
2592.3 793205857 792864382 792475700 792064011 791706920 791375637 790944397 790414333 789867759 789297640 788617492
2612.7 788617492 787811399 786985219 786181033 785278261 784231544 783134103 782030463 780886352 779655695
2631 779655695 778368652 777129591 775932968 774666369 773350179 772076964 770830870 769561529 768292367
2649.4 768292367 767080247 765927732 764770508 763563216 762353957 761206150 760107696 758987963
2665.7 758987963 757839680 756734908 755695939 754684746 753696918 752764404 751865923 750948370 749991834
2684.1 749991834 749027729 748089790 747156322 746189892 745162785 744080067 742983103 741885424 740744948
2702.4 740744948 739539325 738294125 737026334 735752225 734509468 733299315 732119203 730967522
2718.7 730967522 729783297 728595972 727486491 726444840 725437880 724445581 723505735 722651541 721806288
2737.1G21806288r10402r40561q86559q17776q17239q39293q20041p77483p27117o80328
2757.5G13589489o56187o29664o07192o50048p19428p32303p31945p83205q39532q83460
2777.9G06356525r54330j030027j108587j203001j286089j352430j429140j520634
2794.2F96472287j595676j642823j720786j840651j936853k019107k112031k199412
2810.5F81404948k287388k363681k425850k515852k620757k703011k759993k831817
2826.8F60896599k962827l085792l131330l187716l327132l469944l570318l648162
2843.1F34513378l758371l917992l999948l977538l947854l982603m137039m417360
2859.5F02374673m826009n348444n912304o459356o967246p369280p582068p583261
$$ plain form
2737.1 721806288 720895886 719955325 719068766 718250990 717433751 716594458 715774417 714996934 714269817 713589489
2757.5 713589489 712933302 712303638 711696446 711046398 710326970 709594667 708862722 708079517 707239985 706356525
2777.9 706356525 705402195 704372168 703263581 702060580 700774491 699422061 697992921 696472287
2794.2 696472287 694876611 693233788 691513002 689672351 687735498 685716391 683604360 681404948
2810.5 681404948 679117560 676753879 674328029 671812177 669191420 666488409 663728416 660896599
2826.8 660896599 657933772 654847980 651716650 648528934 645201802 641731858 638161540 634513378
2843.1 634513378 630755007 626837015 622837067 618859529 614911675 610929072 606792033 602374673
2859.5 602374673 597548664 592200220 586287916 579828560 572861314 565492034 557909966 550326705
2875.8E50326705p310271o716609n877018m899204l882468k908468k043128j358271
2892.1E15331268r11176o83427o30855p34806r54152j257181j649260k120137k648533
2910.4E03741741l206610l742278m156947m354030m314810m046887l576607k863139
2926.8D73480433j867711p07895N71668J954705L295988M476666N467713O257921O821394
2945.1D99750882P193238P484734P716954P807076P785320P724166P560372P225514
2961.4E60248256O759941O265939N830109N495310N279421N157471N085528N036652
2977.8F05158627M943371M709124M359425M003465L661811L348589L039956K632976
2994.1F35857344K175152J755834J336515R07659M75228L2842l46959o39855r73344
$$ plain form
2875.8 550326705 543016434 536299825 530422807 525523603 521641135 518732667 516689539 515331268
2892.1 515331268 514420092 513736665 513105810 512371004 511416852 510159671 508510411 506390274 503741741
2910.4 503741741 500535131 496792853 492635906 488281876 483967066 479920179 476343572 473480433
2926.8 473480433 471612722 470904827 471476495 473431200 476727188 481203854 486671567 492929488 499750882
2945.1 499750882 506944120 514428854 522145808 529952884 537738204 545462370 553022742 560248256
2961.4 560248256 567008197 573274136 579104245 584599555 589878976 595036447 600121975 605158627
2977.8 605158627 610101998 614811122 619170547 623174012 626835823 630184412 633224368 635857344
2994.1 635857344 638032496 639788330 641124845 642032504 642507732 642540574 642193615 641553760 640580416
3012.4F40580416j394093j755178j984537k175987k339959k475977k648711k785921
3028.7F23020053k859175k958238l110826l263474l316581l320694l411889l559947
3045.1E97219229l653288l659368l671288l721774l733218l760218l812075l778815
3061.4E67429185l712833l725410l841817l953159l948986l877640l758490l665626
3077.7E36945224l759682l915906l974796m004597l960193l880143l937542m000902
3094E05511463l895700l717482l690780l840655l869474l674030l581434l759802l810465
3112.4D71671641l530890l371984l519147l746152l884345l790588l556758l406972
3128.7D42864805l397792l464222l439367l268063l180742l328383l461033l364742
$$ plain form
3012.4 640580416 639186323 637431145 635446608 633270621 630930662 628454685 625805974 623020053
3028.7 623020053 620160878 617202640 614091814 610828340 607511759 604191065 600779176 597219229
3045.1 597219229 593565941 589906573 586235285 582513511 578780293 575020075 571208000 567429185
3061.4 567429185 563716352 559990942 556149125 552195966 548246980 544369340 540610850 536945224
3077.7 536945224 533185542 529269636 525294840 521290243 517330050 513449907 509512365 505511463
3094 505511463 501615763 497898281 494207501 490366846 486497372 482823342 479241908 475482106 471671641
3112.4 471671641 468140751 464768767 461249620 457503468 453619123 449828535 446271777 442864805
3128.7 442864805 439467013 436002791 432563424 429295361 426114619 422786236 419325203 415960461
3145D15960461l184736l018796k878815k969831l221304l231138l024429k878815k850383
3163.4C88702214k835632k767741k709657k707333k702027k619624k519965k471358
3179.7C67368877k460033k444744k394527k355546k353459k316207k245218k230316
3196C48568827k219737k142489k025872j949519j962364j980096j921385j825452j771301
3214.3C30770612j750350j723558j687884j663089j649320j609832j540929j409948
3230.7C17735702j310140j457960j626372j527876j358419j253396j161427j158595
3247C06881517j273870j290888j145780j040429j045555j053929j022846r83208r28313
3265.3B97096699q31365o86973p14332r37134j031399r79513r04620q46594q34614
$$ plain form
3145 415960461 412775725 409756929 406878114 403908283 400686979 397455841 394431412 391552597 388702214
3163.4 388702214 385866582 383098841 380389184 377681851 374979824 372360200 369840235 367368877
3179.7 367368877 364908844 362464100 360069573 357714027 355360568 353044361 350799143 348568827
3196 348568827 346349090 344206601 342180729 340231210 338268846 336288750 334367365 332541913 330770612
3214.3 330770612 329020262 327296704 325608820 323945731 322296411 320686579 319145650 317735702
3230.7 317735702 316425562 314967602 313341230 311813354 310454935 309201539 308040112 306881517
3247 306881517 305607647 304316759 303170979 302130550 301084995 300031066 299008220 298025012 297096699
3265.3 297096699 296265334 295578361 294864029 293926895 292895496 291915983 291011363 290164769 289330155
3283.7B89330155q15481p68960o83814o53625p83622r37372j014591r73641p76321
3302B81922728n78076o49601r85444j218468j172691j025766r66311r71347r47416
3320.4B73407608q88020q44776r48787j106143j117259j051486r33617p96288r01550
3338.8B64819682j162768j218498j152932j058638q84623r68605j298010j339495j106412
3357.1B54629701r76801j015007j040071r13620q23722j012116j349539j406684j116857
3375.5B44975284r00865q62628q83237q97199q06555n53414k59474l40804p56577q20115
3395.9B37894416l80650j08123m71905r12592p31349l44246k65524l37929m42788m81292
3416.3B33418018l32803k12356k18466j22264O1243J83464J71557J73509L02598J89930
$$ plain form
3283.7 289330155 288514674 287745714 287061900 286408275 285624653 284687281 283672690 282699049 281922728
3302 281922728 281344652 280695051 279709607 278491139 277318448 276292682 275326371 274355024 273407608
3320.4 273407608 272519588 271674812 270726025 269619882 268502623 267451137 266517520 265721232 264819682
3338.8 264819682 263656914 262438416 261285484 260226846 259342223 258373618 257075608 255736113 254629701
3357.1 254629701 253652900 252637893 251597822 250684202 249860480 248848364 247498825 246092141 244975284
3375.5 244975284 244074419 243211791 242328554 241431355 240624800 240071386 239811912 239471108 238714531 237894416
3395.9 237894416 237513766 237405643 236933738 236021146 235289797 234945551 234680027 234342098 233899310 233418018
3416.3 233418018 233085215 232872859 232654393 232532129 232593372 232776836 232948393 233121902 233424500 233614430
3436.6B33614430j74672k06559J32456L82796L96788L12448L31759M56989N46962O26132
3457B36419529P33822O81922O14077Q72761J102746Q20964L38599K91482O27503R64939
3477.4B43468344J025751P43866O24016Q48770R08971P97034Q68693J002088J044661
3495.8B51332194J000106J022816J134723R85801P57456Q52794J072198J282006J326889
3514.2B60766983J110017J017273J198262J438588J404553J151085J101017J253247
3530.5B70441025J409859J586884J617462J467943J578063J858621J819045J499772
3546.8B83278674J469374J716762J861513J969516K110154K245426K356559K377182
3563.1B99385160K333075K495348K770484K782375K757012K970696L191471L320158
$$ plain form
3436.6 233614430 233439758 233233199 233365655 233748451 234145239 234457687 234789446 235246435 235793397 236419529
3457 236419529 237153351 237835273 238449350 239322111 240424857 241245821 241584420 241875902 242503405 243468344
3477.4 243468344 244494095 245237961 245861977 246710747 247619718 248416752 249285445 250287533 251332194
3495.8 251332194 252332300 253355116 254489839 255475640 256233096 257085890 258158088 259440094 260766983
3514.2 260766983 261877000 262894273 264092535 265531123 266935676 268086761 269187778 270441025
3530.5 270441025 271850884 273437768 275055230 276523173 278101236 279959857 281778902 283278674
3546.8 283278674 284748048 286464810 288326323 290295839 292405993 294651419 297007978 299385160
3563.1 299385160 301718235 304213583 306984067 309766442 312523454 315494150 318685621 322005779
3579.4C22005779L533065L744453L691971L423542L496766L833503L992110M053325
3595.7C51774514M172981M217118M242450M373282M381358M335940M430086M569292
3612.1C86497021M675299M644751M554540M629523M632383M576326M530817M531950
3628.4D23272610M699081M619509M524559M575878M581869M599899M711419M812241
3644.7D60397065M761487M624635M475444M256696M162997M420519M590481M361004
3661D96050328M115194M159451M187345M013658M031479L876329L413379L370762L474593
3679.4E30692518L431499L549337L699899L609002L077566K633572K675593K784609
3695.7E56153595K779067K624810K438605K490282K637982K626240K328873J862466
$$ plain form
3579.4 322005779 325538844 329283297 332975268 336398810 339895576 343729079 347721189 351774514
3595.7 351774514 355947495 360164613 364407063 368780345 373161703 377497643 381927729 386497021
3612.1 386497021 391172320 395817071 400371611 405001134 409633517 414209843 418740660 423272610
3628.4 423272610 427971691 432591200 437115759 441691637 446273506 450873405 455584824 460397065
3644.7 460397065 465158552 469783187 474258631 478515327 482678324 487098843 491689324 496050328
3661 496050328 500165522 504324973 508512318 512525976 516557455 520433784 523847163 527217925 530692518
3679.4 530692518 534124017 537673354 541373253 544982255 548059821 550693393 553368986 556153595
3695.7 556153595 558932662 561557472 563996077 566486359 569124341 571750581 574079454 575941920
3712E75941920J925350K212286K218723K096534J953899J777411J709998J958131K136708
3730.3E93930960K038300J791239J546859J631379J787782J405895J044094J610995
3746.7F06787503J715183J056671J014292J515150J567483J256586J219630J419186
3763F17551684J416862J310110J144827J039684J182437J374006J426995J231849J035035
3781.3F28713489J029670J049936J084923J150489J176059J137376J137317J274406
3797.7F37753665J088679O75023Q36432Q72314P05421R97960J302302J193762R42588
3816F46368146J088798R62555N30065O37650Q20339Q81195R86695J087546J140833
3834.4F54503822Q50618M07279M28021O06477O99937Q99554J162886J089692K59936
$$ plain form
3712 575941920 577867270 580079556 582298279 584394813 586348712 588126123 589836121 591794252 593930960
3730.3 593930960 595969260 597760499 599307358 600938737 602726519 604132414 605176508 606787503
3746.7 606787503 608502686 609559357 610573649 612088799 613656282 614912868 616132498 617551684
3763 617551684 618968546 620278656 621423483 622463167 623645604 625019610 626446605 627678454 628713489
3781.3 628713489 629743159 630793095 631878018 633028507 634204566 635341942 636479259 637753665
3797.7 637753665 638842344 639517367 640353799 641226113 641931534 642929494 644231796 645425558 646368146
3816 646368146 647456944 648419499 648949564 649587214 650407553 651288748 652275443 653362989 654503822
3834.4 654503822 655354440 655761719 656189740 656796217 657496154 658395708 659558594 660648286 660908222
3852.7F60908222j33157O49810R68993Q65877P13288O53148P07626N44131M24445N11050
3873.1F66813433N67675O98447P14242P14601P38978M65751M13358N78999M08471L52085
3893.5F72466040O54101P91729O00397K88129P3016J72138L85225M21107M51147N26428
3913.9F76829457M54486L17633L19898L71277L59655L58104L77357L23058K48968K54214
3934.3F80214107L13580L89934L98814L05415L12924M00901L57270L03209L17514L26991
3954.7F83640659L02553K73764K80500L10659L30806L18646L15488K98738K48492K04503
3975.1F86524808K27571K88367L33548L73184L02315J88589K21789K53380J63912J58787
3995.5F89036250K62439
$$ plain form
3852.7 660908222 660775065 661424875 662393868 663259745 663973033 664626181 665333807 665877938 666302383 666813433
3873.1 666813433 667381108 668079555 668793797 669508398 670247376 670713127 671126485 671705484 672113955 672466040
3893.5 672466040 673120141 673911870 674512267 674800396 674873412 675045550 675430775 675851882 676303029 676829457
3913.9 676829457 677283943 677601576 677921474 678292751 678652406 679010510 679387867 679710925 679959893 680214107
3934.3 680214107 680527687 680917621 681316435 681621850 681934774 682335675 682692945 682996154 683313668 683640659
3954.7 683640659 683943212 684216976 684497476 684808135 685138941 685457587 685773075 686071813 686320305 686524808
3975.1 686524808 686752379 687040746 687374294 687747478 688049793 688238382 688460171 688713551 688877463 689036250
3995.5 689036250 689298689
3997.5F89298689
$$ plain form
3997.5 689298689
##END=$$ End of the data block
