##TITLE=Amido Residuo - Bianca $$ Begin of the data block
##JCAMP-DX=5.00 $$ ACD/SpecManager v 10.08
##SPECTROMETER/DATA SYSTEM=Alpha
##DATE=24 Oct 2013 13:19:44
##DATA TYPE=INFRARED SPECTRUM
##DATA CLASS=XYDATA
##ORIGIN=
##OWNER=
##NPOINTS=1765
##FIRSTX=399.75695801
##LASTX=3997.56933594
##MAXX=3997.56933594
##MINX=399.75695801
##MAXY=0.84419185
##MINY=0.16062517
##XFACTOR=1.0000000000
##YFACTOR=1.000000000000000e-9
##FIRSTY=0.49562368
##DELTAX=2.03957629
##XUNITS=1/CM
##YUNITS=ARBITRARY UNITS
##XYDATA=(X++(Y..Y))
399.8D95623678o960571m851192k680808p08819J012862K066791K272993K092064Q34018
418.1D88701016j514763k371162k670080l312587l459633l550946l443271k734065
434.4D65644509j620323N394K056688L863663M718661M786521M185290K901434J551688
452.8D88093525P59185K72482q79437j999050k398908k808362l561110m003435l778458
471.1D69696432l551662l360569k920330k101183r70810k76357k50220k56837j08361
489.5D55900103l27349j088083j660078j713783j818538k324044k816201k816379k904921
507.9D38430727l664405m496038m692286m525989m688054m823119m037738k669632
524.2D04833466j596600q85904J6958J442223L049940M495591N760342O399244N755723
$$ plain form
399.8 495623678 488663107 483811915 481131107 480422288 481435150 483501941 485774934 487866998 488701016
418.1 488701016 487186253 484815091 482145011 478832424 475372791 471821845 468378574 465644509
434.4 465644509 464024186 464029580 466086268 469949931 474668592 479455113 483640403 486541837 488093525
452.8 488093525 488852710 489125192 488245755 486246705 483847797 481039435 477478325 473474890 469696432
471.1 469696432 466144770 462784201 459863871 457762688 456791878 456515521 456265301 456008464 455900103
489.5 455900103 455572754 454484671 452824593 451110810 449292272 446968228 444152027 441335648 438430727
507.9 438430727 434766322 430270284 425577998 421052009 416363955 411540836 407503098 404833466
524.2 404833466 403236866 402350962 402367920 403810143 406860083 411355674 417116016 423515260 429270983
542.5D29270983L954261K006620N74708o28233j930028l110975l845185m430324n373507
560.9D16488320o520480p344395p870227q043737p102340m739314j708687J095385
577.2C74254525L524065N828768P768780Q579790Q017272O460816M607796K909601
593.5D21951413J399577K02238l63975l16829j09821M0978M00901J186639J937449
611.9D26328570K443999L098786L983080M786849N261064N312889N058051M680365
628.2D60953653M083335L361136K744794K375781K089799J701772J474351J539409
644.5D80324030J569599J444042J331776J347363J538843J616537J405597J236111
660.8D91813898J349002J433403J517951J700133J507342J543373J692295J658916
$$ plain form
542.5 429270983 433225244 435231864 435806572 435178339 433248311 430137336 426292151 421861827 416488320
560.9 416488320 409967840 402623445 394753218 386709481 379607141 374867827 373159140 374254525
577.2 374254525 377778590 383607358 391376138 399955928 407973200 414434016 419041812 421951413
593.5 421951413 423350990 423553228 423189253 422872424 422762603 422803581 423204482 424391121 426328570
611.9 426328570 428772569 431871355 435854435 440641284 445902348 451215237 456273288 460953653
628.2 460953653 465036988 468398124 471142918 473518699 475608498 477310270 478784621 480324030
644.5 480324030 481893629 483337671 484669447 486016810 487555653 489172190 490577787 491813898
660.8 491813898 493162900 494596303 496114254 497814387 499321729 500865102 502557397 504216313
677.1E04216313J677156J754105J630068J238823R51945Q19207L17096o96659j745939
695.5E10162115k621531l498793m196614m195035l354758j930743k98291J426488L295630
713.8D94788468M961282O027311O776154P427514P799148P731855P092774O252825
730.2E48857331N591989M808009L664612K460957J378536n36j804769l537536m776239
748.5E56642354n668223o454230o977081o883144o202400n237997l809273j504600
764.8E13905406J516640M575312P192731R269059J0758221J1392176J0932505R759188
781.2E79301238Q535624P399797O176710N237937M986346N150199N347729N649447
797.5F27785027O020248N984426N323112M411339L722728L191590K499938J725256
$$ plain form
677.1 504216313 505893469 507647574 509277642 510516465 511468410 512287617 512604713 511908054 510162115
695.5 510162115 507540584 504041791 499845177 495650142 492295384 490364641 490066350 491492838 494788468
713.8 494788468 499749750 505777061 512553215 519980729 527779877 535511732 542604506 548857331
730.2 548857331 554449320 559257329 562921941 565382898 566761434 566760898 564956129 561418593 556642354
748.5 556642354 550974131 544519901 537542820 530659676 524457276 519219279 515410006 513905406
764.8 513905406 515422046 519997358 527190089 536459148 547217369 558609545 569542050 579301238
781.2 579301238 587836862 595236659 601413369 606651306 611637652 616787851 622135580 627785027
797.5 627785027 633805275 639789701 645112813 649524152 653246880 656438470 658938408 660663664
813.8F60663664J247406Q92222J43111j019716k188206l249526m601300o202519p387221
832.1F38297915p887065q033156p977903p506073o519794n472005m835307m433871
848.5E85632741m009127l876686m321099m806041m140556j321316L299594Q103669
864.8E74561179J1846184J4152289J4590859J2975097J0075748O769478L208578o38247
881.1F47541165m152298o542742p896244q670569q772313q097470p154525o624758
897.4E89630246o576478o627918o902873p836819r246349j0540784j1495947j2235463
913.7E18167615j2637138j2089372j0184676p409900m668206k432793o49900Q63791
930D68959421K157658L329456M663259O108016P099777O961495N012393R32872m602075
$$ plain form
813.8 660663664 661911070 662803292 662946403 661926687 659738481 656488955 651887655 645685136 638297915
832.1 638297915 630410850 622377694 614399791 606893718 600373924 594901919 590066612 585632741
848.5 585632741 581623614 577746928 573425829 568619788 564479232 563157916 566457510 574561179
864.8 574561179 586407363 600559652 615150511 628125608 638201356 644970834 648179412 647541165
881.1 647541165 643388867 636846125 628949881 620279312 611506999 603409529 596255004 589630246
897.4 589630246 583053768 576425850 569522977 561686158 552439809 541899025 530403078 518167615
913.7 518167615 505530477 493441105 483256429 475846529 471178323 468745530 468095630 468959421
930 468959421 471117079 474446535 479109794 485217810 492317587 499279082 504291475 505224347 500622272
948.4E00622272j0082870j4205784j6749263j8353551j9602716k0545244k1138341
962.7C79944503k1628320k2149801k2494346k2450745k1992386k1123796j9715786
977B28389323j7636433j4966846j2025237r154946o517276m202232k325326r35852
993.3A60625175O1303P62343J201258J361638J200989P50810J96591k42219m65437
1011.6A65452451l44351J60962Q65519J576439K254098K908722L472358L806635L878072
1030A84030905L738627L332511K676397J933456J387000J266107J511678J921535K468094
1048.3B04266310L351882M656270O144047P518396Q789390J0182932J1587620J2027651
1064.7B68524498R796858L691166m815489j1476219j3038098j0216728n940512k203301
$$ plain form
948.4 500622272 490539402 476333618 459584355 441230804 421628088 401082844 379944503
962.7 379944503 358316183 336166382 313672036 291221291 269228905 248105109 228389323
977 228389323 210752890 195786044 183760807 174605861 168088585 163886353 161561027 160625175
993.3 160625175 160686478 161448821 162650079 164011717 165212706 165963516 166160107 165917888 165452451
1011.6 165452451 165108100 165269062 166134581 167711020 169965118 172873840 176346198 180152833 184030905
1030 184030905 187769532 191102043 193778440 195711896 197098896 198365003 199876681 201798216 204266310
1048.3 204266310 207618192 212274462 218418509 225936905 234726295 244909227 256496847 268524498
1064.7 268524498 278321356 282012522 277197033 265720814 252682716 242465988 236525476 234322175
1081B34322175N71698K661527M287377N544900O490887O995022O811589N827874M255533
1099.3B77768582K601773J557439J516819K276719L327548M191101M602998M475773
1115.6C02318752L815889K886057K193570K048493K488911L403783M395365M655838
1132C28206658L406167O34224k874345o147772q505166r671330r706914q792192p265449
1150.3B79283881n527198l748328j939892j48327J592070L400684N415290P661283
1166.6B85989463R938628J1948734J3592542J4917552J5859336J6313702J6312003
1180.9C84871960J5913278J5104919J3760269J1801869R458333P161826N164236L558367
1197.2D66795057K508313K123713K316892K852410L572583M488349N504311O270021
$$ plain form
1081 234322175 234893873 237555400 241842777 247387677 253878564 260873586 267685175 273513049 277768582
1099.3 277768582 280370355 281927794 283444613 285721332 289048880 293239981 297842979 302318752
1115.6 302318752 306134641 309020698 311214268 313262761 315751672 319155455 323550820 328206658
1132 328206658 331612825 332247049 329372704 323224932 314719766 305048436 295341522 286549330 279283881
1150.3 279283881 273756683 270008355 268068463 267920136 269512206 272912890 278328180 285989463
1166.6 285989463 295928091 307876825 321469367 336386919 352246255 368559957 384871960
1180.9 384871960 400785238 415890157 429650426 441452295 450910628 458072454 463236690 466795057
1197.2 466795057 469303370 471427083 473743975 476596385 480168968 484657317 490161628 496431649
1213.5D96431649O429493N935431M979491L677785K123654O01709n28216j186908j569747
1231.9E16894341j781524j741111j403272r13918l68297K99811J154542K039492K590776
1250.3E16770840K726555K700030K633632K407848K015949J752555J924098K393007
1266.6E35324514K678931K569616K197563J608968P57813j56283p62224r47952j048089
1284.9E42222857j326084j564800j595259j702488k097666k467275k446293k161324
1301.2E26861668j971841j962364j907229j674593j503050j616180j778424j840949
1317.6E12607038k129316k879143l932953m962206n773574o317526o348789n582958
1333.9D74680573m243911k933114j944036j050323k25723J78635M0532l08633m63784
$$ plain form
1213.5 496431649 502861142 508796573 513776064 517453849 519577503 520179212 519650996 518464088 516894341
1231.9 516894341 515112817 513371706 511968434 511054516 510686219 510986030 512140572 514180064 516770840
1250.3 516770840 519497395 522197425 524831057 527238905 529254854 531007409 532931507 535324514
1266.6 535324514 538003445 540573061 542770624 544379592 545137405 544981122 544218898 543270946 542222857
1284.9 542222857 540896773 539331973 537736714 536034226 533936560 531469285 529022992 526861668
1301.2 526861668 524889827 522927463 521020234 519345641 517842591 516226411 514447987 512607038
1317.6 512607038 510477722 507598579 503665626 498703420 492929846 486612320 480263531 474680573
1333.9 474680573 470436662 467503548 465559512 464509189 464283466 464462101 464502633 464194000 463730216
1352.2D63730216n45442q43167j167089j201123j080990r56118p25716k92033M24862
1370.6D57343400J126945J458525J540125J698881J845688K149433L147721M612177
1386.9D74922895N125910M243941L070861J875102P53433j96129r20207j261055j511157
1405.3D86103594j745253j982809k177476j908243j228035r16093j104147p09265J31249
1423.6D74463522O06418Q19028J019924J363606J808256K017498J775384J637786J841247
1442D87352669J650542R65715N3703p33643j134724j350701k084970k632588j147598
1460.3D80938405O41435K264172L990650N618572P666141J0281801J1037648J0189772
1476.6E32628596R583175R135008Q801639Q452237Q361697Q108794P202626O167233
$$ plain form
1352.2 463730216 463184774 462341607 461174518 459973395 458892405 457936287 457210571 456918538 457343400
1370.6 457343400 458470345 459928870 461468995 463167876 465013564 467162997 470310718 474922895
1386.9 474922895 480048805 484292746 487363607 489238709 489992142 489796013 488875806 487614751 486103594
1405.3 486103594 484358341 482375532 480198056 478289813 477061778 476145685 475041538 474332273 474463522
1423.6 474463522 475069940 475888968 476908892 478272498 480080754 482098252 483873636 485511422 487352669
1442 487352669 489003211 489968926 490022629 489288986 488154262 486803561 484718591 482086003 480938405
1460.3 480938405 481579840 483844012 487834662 493453234 501119375 511401176 522438824 532628596
1476.6 532628596 542211771 551346779 560148418 568600655 576962352 585071146 592273772 598441005
1493E98441005O171524O465793N555808M731894M761279N426585N428613L724813L272712
1511.3F43980026L728688L783941L532470L412723L512502K910256K254069K346516
1527.6F69461191K611816K807140K533972K170861K690434L245771K040029J122773
1543.9F88683987J394748J710177J726806J628280J924395K428532K324402O17743
1560.3G02439070J07050R19223J316308J043261N10573N46634Q30352K24770n23866
1578.6G07413375l39090k51413o08325j102626j380682j554668j925111k552450l006875
1597F94692135l140152l430187l948987m330695m521191m930019n310953n199551n549133
1615.3F54331267o634116n844355m850745n314529n319417m898190m626632l653049
$$ plain form
1493 598441005 604612529 611078322 616634130 621366024 626127303 631553888 636982501 640707314 643980026
1511.3 643980026 647708714 651492655 655025125 658437848 661950350 664860606 667114675 669461191
1527.6 669461191 672073007 674880147 677414119 679584980 682275414 685521185 687561214 688683987
1543.9 688683987 690078735 691788912 693515718 695143998 697068393 699496925 701821327 702439070
1560.3 702439070 702546120 703465343 704781651 705824912 706335485 706882119 707712471 707937241 707413375
1578.6 707413375 707074285 706822872 706214547 705111921 703731239 702176571 700251460 697699010 694692135
1597 694692135 691551983 688121796 684172809 679842114 675320923 670390904 665079951 659880400 654331267
1615.3 654331267 647697151 641852796 637002051 631687522 626368105 621469915 616843283 613190234
1631.6F13190234k759576l092826l044307j848876o74367L65138J104593J413345J830876
1650F06484234K952099L566563K800763L107488M039705M704773M776299M632175N201578
1668.4F42265677N583823N032003N163074N389154M956781M990578N604267N933702
1684.7F84919059M646063L937364M236042M294396M610240M589975M099250L826618
1701G19159007L033102K750456K840579K726197K775609K848149K890050K744675K037346
1719.3G43805170J594603J720488J951933K077043K126992K082646J993596J578629
1735.7G58931100J357258J450538J449824J598418J792013J713336J440465J246691
1752G70979643J216769J173854J082361J206934J291990J027346R39190J194954J428247
$$ plain form
1631.6 613190234 610430658 607337832 604293525 602444649 601770282 602135420 603240013 604653358 606484234
1650 606484234 609436333 613002896 615803659 618911147 622950852 627655625 632431924 637064099 642265677
1668.4 642265677 647849500 652881503 658044577 663433731 668390512 673381090 678985357 684919059
1684.7 684919059 689565122 693502486 697738528 702032924 706643164 711233139 715332389 719159007
1701 719159007 722192109 724942565 727783144 730509341 733284950 736133099 739023149 741767824 743805170
1719.3 743805170 745399773 747120261 749072194 751149237 753276229 755358875 757352471 758931100
1735.7 758931100 760288358 761738896 763188720 764787138 766579151 768292487 769732952 770979643
1752 770979643 772196412 773370266 774452627 775659561 776951551 777978897 778918087 780113041 781541288
1770.3G81541288J105249M77969M88759R28282J062155P93517O39975Q22842J105845
1788.7G88965881J081049O62566N01453Q19445R36866O73830N49674P60675Q78513
1807G95829952O98447N27084O25372P77662O51478M94123O65724Q87275P24435M59909
1827.4H02341461M40657M38810L71575K31564J98722M49181O59525M04775n0664l278
1847.8H05482328K14517J37568N126J53541L64721K71916N3645J63733N11349M89950
1868.2H07848394J0371j35660J87218L99888L06487J89066L23176N31256M99130K76327
1888.6H10435653J70231L12090L38912J08301J3709J74165K64108J46687L2664R0718
1909H12087238J84595J41621Q0943J27435J97112J65523J1146m5240J32084K22683
$$ plain form
1770.3 781541288 782646537 783124506 783613265 784541547 785603702 786397219 787037194 787860036 788965881
1788.7 788965881 790046930 790709496 791210949 792030394 792967260 793641090 794190764 794951439 795829952
1807 795829952 796528399 797055483 797680855 798458517 799109995 799604118 800269842 801157117 801881552 802341461
1827.4 802341461 802782118 803220928 803592503 803824067 804022789 804471970 805131495 805536270 805485606 805482328
1847.8 805482328 805696845 805834413 805839539 805993080 806357801 806629717 806683362 806847095 807358444 807848394
1868.2 807848394 807858765 807723105 807910323 808310211 808616698 808805764 809128940 809660196 810159326 810435653
1888.6 810435653 810605884 810917974 811256886 811365187 811378896 811553061 811817169 811963856 811996520 812087238
1909 812087238 812271833 812413454 812494397 812621832 812818944 812984467 812995613 812950373 813082457 813305140
1929.4H13305140R1850R001J26540K64168K27094R1791M4286J46449J90437J18017
1949.8H14614773J49190K99454L33250J82807R4295J94013K89619J99914O8903J05381
1970.2H16531599K15530J97470Q5175R2328K00152J83225K8789k9504Q5234J49906
1990.6H17739904J1027j07765k7240O4850j5139j63079j82032j33455j83702l03685
2011H16699684l42191k86698l03149m34876n14209m68075m17054m49777n14805n04911
2031.4H12463939m52637m59314m93348m66883l88682l48389l44515k86161j62185q3029
2051.8H08978796p9334o6697p630O0082Q0287P0989R6143J27673J02937P0095P9036
2074.2H09512377J03652J10925J13189J28567J46389J57058J57237J79827K04921J89543
$$ plain form
1929.4 813305140 813396990 813405991 813532531 813796699 814023793 814115584 814159870 814306319 814496756 814614773
1949.8 814614773 814763963 815063417 815396667 815579474 815673769 815867782 816157401 816357315 816426218 816531599
1970.2 816531599 816747129 816944599 817029774 817122102 817322254 817505479 817534268 817504764 817589998 817739904
1990.6 817739904 817750931 817643166 817615926 817680776 817665637 817502558 817320526 817187071 817003369 816699684
2011 816699684 816357493 816070795 815767646 815332770 814818561 814350486 813933432 813483655 812968850 812463939
2031.4 812463939 812011302 811551988 811058640 810591757 810203075 809854686 809510171 809224010 809061825 808978796
2051.8 808978796 808899462 808832765 808825135 808885217 808965504 809036493 809132636 809260309 809363246 809433341 809512377
2074.2 809512377 809616029 809726954 809840143 809968710 810115099 810272157 810429394 810609221 810814142 811003685
2094.6H11003685J75059K07603K44021K22385J88112K18988K58505K15709J42694J30177
2115H13006938J63018J41442N5373J0252M3332Q3864P0334M0888M3035P8976R1493
2137.5H13828945L4690K2233R8109J17719N8591O2287J54317K07960J96874K29896
2157.9H15011621L33845M08471L90529L89696M88460N80847N58734M89533N43833O63340
2178.2H19858909O29544N02586N14269O32227O41822N24342M56274N20349N98251N42224
2198.6H25420797M40657M78566N82337N76139M93168M85957N52237N42164M29749L90769
2219H30392540N00977N41985M07099L15786L85821M62055L94404K54571K35737L38852
2239.4H34229827L61383K68757K27750K84433L19660K65538K08974K49684L22580L08991
$$ plain form
2094.6 811003685 811178744 811386347 811630368 811852753 812040865 812259853 812518358 812734067 812876761 813006938
2115 813006938 813169956 813311398 813366771 813377023 813420355 813504219 813574553 813615441 813658476 813737452 813828945
2137.5 813828945 813863635 813885868 813983977 814101696 814160287 814222574 814376891 814584851 814781725 815011621
2157.9 815011621 815345466 815753937 816144466 816534162 817022622 817603469 818162203 818651736 819195569 819858909
2178.2 819858909 820488453 820991039 821505308 822137535 822779357 823303699 823759973 824280322 824878573 825420797
2198.6 825420797 825861454 826340020 826922357 827498496 827991664 828477621 829029858 829572022 830001771 830392540
2219 830392540 830893517 831435502 831842601 832158387 832544208 833006263 833400667 833655238 833890975 834229827
2239.4 834229827 834591210 834859967 835087717 835372150 835691810 835957348 836166322 836416006 836738586 837047577
2259.8H37047577K71737L09587L48449L17573K72632K71797L05653L15070K84433K88666
2280.2H40033174L40163L33905K34843J48773J71602K35975K21729J54495J43707K09033
2300.6H42227399K47777J89483J21892J59800K41398J99676Q0466P9692J84118J91212
2321H43922913K7299n7697Q5294J83225L0815j34527q4460J2219j05620l26633l77596
2343.5H43175232k84433j18911L6835J35422K14458K28524O4254k26140l83437k87294
2363.8H42554510k37465l54171l87192k98321k64227l12448k73943j36673o0320j18137
2384.2H40111613j92225j26183l9696j17243k34484k29478j80304k17319l17335l19123
2404.6H38138223k28763k49922l67880m13716l69072l61144m37737m97758m94957m80056
$$ plain form
2259.8 837047577 837319314 837628901 837977350 838294923 838567555 838839352 839145005 839460075 839744508 840033174
2280.2 840033174 840373337 840707242 840942085 841090858 841262460 841498435 841720164 841874659 842018366 842227399
2300.6 842227399 842475176 842664659 842786551 842946351 843187749 843387425 843467891 843547583 843731701 843922913
2321 843922913 843950212 843892515 843977809 844161034 844191849 844057322 843972862 843985081 843879461 843552828 843175232
2343.5 843175232 842890799 842771888 842808723 842944145 843158603 843387127 843451381 843225241 842841804 842554510
2363.8 842554510 842317045 841962874 841575682 841277361 841013134 840700686 840426743 840290070 840229750 840111613
2384.2 840111613 839919388 839793205 839753509 839636266 839401782 839172304 838992000 838774681 838457346 838138223
2404.6 838138223 837909460 837659538 837291658 836877942 836508870 836147726 835709989 835212231 834717274 834237218
2425H34237218n24700o02424n92291n15819n40793o49333o60896n72562n26667n92709
2445.4H28459024o58869o12676n57125n97119o10829n23865m63367m95314n54204n41389
2465.8H22844267m44830m09782m96089n59509n09977m27067m20988m68731m41253l42846
2486.2H18323195l12090l59356l53158k70009k09570k26021k71439k73287k34604k26140
2506.6H15587521k61903k65539k16186k05398k75552l39746l49403l74853m59254n22614
2527H12317073m88579m34637m87149o08325o51479o06060n96582o52671o67215o10172
2547.4H06514204n91755o42896o57439o08683n60045n57304o28113o58214n92351n73218
2567.8H00444186o01888n92828n59032n41270n98967o54637n64039m36366m54724n29587
$$ plain form
2425 834237218 833712518 833110094 832517803 832001984 831461191 830811858 830150962 829578400 829051733 828459024
2445.4 828459024 827800155 827187479 826630354 826033235 825422406 824898541 824435174 823939860 823385656 822844267
2465.8 822844267 822399437 821989655 821493566 820934057 820424080 819997013 819576025 819107294 818666041 818323195
2486.2 818323195 818011105 817651749 817298591 817028582 816819012 816592991 816321552 816048265 815813661 815587521
2506.6 815587521 815325618 815060079 814843893 814638495 814362943 814023197 813673794 813298941 812839687 812317073
2527 812317073 811828494 811393857 810906708 810298383 809646904 809040844 808444262 807791591 807124376 806514204
2547.4 806514204 805922449 805279553 804622114 804013431 803453386 802896082 802267969 801609755 801017404 800444186
2567.8 800444186 799842298 799249470 798690438 798149168 797550201 796895564 796331525 795895159 795440435 794910848
2588.2G94910848m78446l78073l67462m06385m00603l49044l56436m48167n17309n15163
2608.6G90693760n52416o83546p92205q17299q33035r11772j008928j066387j111686
2626.9G82916486j165330j224280j258432j214505j181841j262784j335501j303613
2643.3G72970200j249910j254380j272678j227140j155556j147985j192749j206398
2659.6G63263404j160979j099110j094937j128018j094877j021505j013219j027584
2675.9G54623175r71496r04561r03904r48369r39191q91209r18567r83178j044393
2694.3G46118307j107335j112640j085997j121759j190722j241863j273632j266777
2710.6G36717582j234234j212656j203418j177788j153707j136244j099050j040160
$$ plain form
2588.2 794910848 794432402 794054329 793686867 793280482 792879879 792530835 792174399 791726232 791208923 790693760
2608.6 790693760 790141344 789457798 788665593 787848294 787015259 786103487 785094559 784028172 782916486
2626.9 782916486 781751156 780526876 779268444 778053939 776872098 775609314 774273813 772970200
2643.3 772970200 771720290 770465910 769193232 767966092 766810536 765662551 764469802 763263404
2659.6 763263404 762102425 761003315 759908378 758780360 757685483 756663978 755650759 754623175
2675.9 754623175 753651679 752747118 751843214 750894845 749955654 749064445 748145878 747162700 746118307
2694.3 746118307 745010972 743898332 742812335 741690576 740499854 739257991 737984359 736717582
2710.6 736717582 735483348 734270692 733067274 731889486 730735779 729599535 728500485 727460325
2726.9G27460325r84371r72450r69171r19640q64566q65101q95203q89063q46445q16643
2747.3G18437672q15750q19146p83801p11441o51300o14226o16610o58751o96480o97255
2767.7G11372912o96480p47085q13127q64684r08375r44734j007139j118362j213968
2786G03058958j246870j298904j415908j525045j570701j621425j748801j883566j959205
2804.4F88788533k034128k139985k223194k258956k283216k364993k504527k626241
2820.7F70353293k704680k776026k871335k972841l058434l127873l218114l354073
2837F46269917l477573l572166l676116l811598l943980l974855l945470l972411m036546
2855.4F11859202m154801m407227m835010n393087n953372o476820o964504p369220
$$ plain form
2726.9 727460325 726475954 725503504 724534333 723614693 722750127 721885026 720989823 720100760 719254315 718437672
2747.3 718437672 717621922 716802776 716018975 715307534 714656234 714042008 713425398 712766647 712070167 711372912
2767.7 711372912 710676432 709929347 709116220 708251536 707343161 706398427 705391288 704272926 703058958
2786 703058958 701812088 700513184 699097276 697572231 696001530 694380105 692631304 690747738 688788533
2804.4 688788533 686754405 684614420 682391226 680132270 677849054 675484061 672979534 670353293
2820.7 670353293 667648613 664872587 662001252 659028411 655969977 652842104 649623990 646269917
2837 646269917 642792344 639220178 635544062 631732464 627788484 623813629 619868159 615895748 611859202
2855.4 611859202 607704401 603297174 598462164 593069077 587115705 580638885 573674381 566305161
2871.7E66305161p631600p659257p347762o713450n866528m895389l878295k910972
2888E19401908k082825j393556q77858o35385o33180p48396r34661j239538j664877
2906.4E09191632k139687k657056l235161l792048m192054m355818m295528m034162
2922.7D80490118l565222k840698j860231p17997N74261J960873L297657M505009N502849
2941D87346619O230653O748169P166624P504285P728159P809282P786393P745147P618010
2959.4E53683341P285594O815970O335557N875230N483985N259454N188286N143643
2975.7F01071060N080878M956305M688740M378140M092396L759205L402471L035963
2992F34465158K625704K217531J796424J329303R02951N04076P0155l23474o39499
$$ plain form
2871.7 566305161 558673561 551014304 543666542 536953092 531086564 526191175 522312880 519401908
2888 519401908 517319083 515925527 515047669 514412284 513779104 513030708 512096047 510856509 509191632
2906.4 509191632 507051945 504394889 501159728 497367680 493175626 488819808 484524280 480490118
2922.7 480490118 476924896 474084198 472223967 471505970 472080231 474041104 477338761 481843770 487346619
2941 487346619 493577272 500325441 507492065 514996350 522724509 530533791 538320184 546065331 553683341
2959.4 553683341 560968935 567784905 574120462 579995692 585479677 590739131 595927417 601071060
2975.7 601071060 606151938 611108243 615796983 620175123 624267519 628026724 631429195 634465158
2992 634465158 637090862 639308393 641104817 642434120 643337071 643841147 643911302 643587828 642948329
3010.4F42948329r48667j305938j682222j975417k183378k353727k496839k631128
3026.7F27371013k737343k852500k991318l124833l244460l295899l349661l459037
3043F02315962l558755l623008l642977l672957l712714l703534l748775l841400l827751
3061.4E68984091l750980l727853l819525l963292l991425l889024l754020l694653
3077.7E38393319l790379l922760l985346m014671l957033l883242l946185m001141
3094E06892562l882468l709972l723770l909379l950328l731936l569752l691614l759771
3112.4D72963572l535212l399759l534794l770053l935486l819943l567576l448248
3128.7D43952501l461391l507554l445775l275126l192604l315508l424704l343493
$$ plain form
3010.4 642948329 641999662 640693724 639011502 637036085 634852707 632498980 630002141 627371013
3026.7 627371013 624633670 621781170 618789852 615665019 612420559 609124660 605774999 602315962
3043 602315962 598757207 595134199 591491222 587818265 584105551 580402017 576653242 572811842 568984091
3061.4 568984091 565233111 561505258 557685733 553722441 549731016 545841992 542087972 538393319
3077.7 538393319 534602940 530680180 526694834 522680163 518723130 514839888 510893703 506892562
3094 506892562 503010094 499300122 495576352 491666973 487716645 483984709 480414957 476723343 472963572
3112.4 472963572 469428360 466028601 462493807 458723754 454788268 450968325 447400749 443952501
3128.7 443952501 440491110 436983556 433537781 430262655 427070051 423754543 420329839 416986346
3145D16986346l215015l057837k909154l023416l256350l216148l021747k919763k876192
3163.4C89490724k828271k771943k741635k747029k727688k630919k533287k510577
3179.7C67999375k517402k488703k405166k314628k297759k327591k301812k246499
3196C49099815k210468k149314k056986j976818j943975j962334j928926j822144j779526
3214.3C31269324j797944j780153j739561j695991j658231j633435j562268j421958
3230.7C17979783j324088j452595j617938j527130j337111j221329j180351j233429
3247C07085812j335829j278788j064390r81033j077980j128822j072020r99868r18001
3265.3B97229081q01801o75470p46220r66490j040518j009703r58621q90136q41230
$$ plain form
3145 416986346 413771331 410713494 407804340 404780924 401524574 398308426 395286679 392366916 389490724
3163.4 389490724 386662453 383890510 381148875 378401846 375674158 373043239 370509952 367999375
3179.7 367999375 365481973 362993270 360588104 358273476 355975717 353648126 351346314 349099815
3196 349099815 346889347 344740033 342683047 340706229 338762254 336799920 334870994 333048850 331269324
3214.3 331269324 329471380 327691227 325951666 324255675 322597444 320964009 319401741 317979783
3230.7 317979783 316655695 315203100 313585162 312058032 310720921 309499592 308319241 307085812
3247 307085812 305749983 304471195 303406805 302425772 301347792 300218970 299146950 298147082 297229081
3265.3 297229081 296427280 295751810 295005590 294039100 292998582 291988879 291030258 290140122 289298892
3283.7B89298892q10951p68870o82473o61642p69913q96871j014590j010686p83116
3302B81899780n76705o67512r70155j176059j180411j081228r92149r56029r42588
3320.4B73356944r02772q73565r99600j142681j100510j015067r53883q68231r35584
3338.8B64565051j132071j165957j105070j031160r05395j011401j315266j361609
3355.1B55537122j159131j025707j055955j092256r34958q00401j001462j351238j398190
3373.4B45717824j105622q83177q50513q93414r05157p95051n46858k66209l70950
3391.8B39100873p96362q08746l42339j12757m96924r12681p47502l86641k73391l43770
3412.2B33879760m68820m63456k87935k08870k58535j78084L9116J93089J62780J85996
$$ plain form
3283.7 289298892 288487941 287719071 287036598 286374956 285605043 284708172 283693582 282682896 281899780
3302 281899780 281323075 280655563 279685408 278509349 277328938 276247710 275255561 274299532 273356944
3320.4 273356944 272454172 271580607 270581007 269438326 268337816 267322749 266368866 265500635 264565051
3338.8 264565051 263432980 262267023 261161953 260130793 259225398 258213997 256898731 255537122
3355.1 255537122 254377991 253352284 252296329 251204073 250269115 249468714 248467252 247116014 245717824
3373.4 245717824 244612202 243729025 242878512 241985098 241079941 240284890 239738032 239471823 239100873
3391.8 239100873 238304511 237495765 237153426 237040669 236543745 235631064 234883562 234496921 234223530 233879760
3412.2 233879760 233410940 232947484 232659549 232450679 232192144 232014060 232053176 232246265 232409045 232595041
3432.6B32595041L07680J58235j44839j66729R0271L58537M25130L15532L37109M95762
3453B34771729N80117O34595P24137O41212N61640Q53076J088038Q20309M09469L77983
3473.4B41462305O20544R09269R95994P20501O34908R04054R43333P76767Q23021R71228
3493.8B49761924J074389J086503J072526J095951R43213P94053Q91895J075893J291335
3512.1B59087682J318723J088232J023262J252920J516521J442700J125068J047939
3528.4B68903047J235008J445234J614153J616270J512825J662702J918375J861751
3544.7B81769365J516074J467407J732796J841217J912475K102882K288967K390713
3561.1B97021896K400487K359748K505958K792061K833515K810776K993584L180087
$$ plain form
3432.6 232595041 232902721 233060956 232916117 232749388 232839659 233198196 233623326 233938858 234275967 234771729
3453 234771729 235351846 235986441 236710578 237351790 237913430 238766506 239854544 240674853 241084322 241462305
3473.4 241462305 242082849 242992118 243988112 244708613 245343521 246247575 247190908 247967675 248790696 249761924
3493.8 249761924 250836313 251922816 252995342 254091293 255034506 255828559 256720454 257796347 259087682
3512.1 259087682 260406405 261494637 262517899 263770819 265287340 266730040 267855108 268903047
3528.4 268903047 270138055 271583289 273197442 274813712 276326537 277989239 279907614 281769365
3544.7 281769365 283285439 284752846 286485642 288326859 290239334 292342216 294631183 297021896
3561.1 297021896 299422383 301782131 304288089 307080150 309913665 312724441 315718025 318898112
3577.4C18898112L333956L585308L786058L703624L471642L625036L900706L958136
3593.7C48262578M029989M191936M267126M288077M377395M370988M349976M501611
3610C82639676M665435M722923M626810M518569M659414M727930M672855M579574M477739
3628.4D24290925M637152M676312M621149M643440M613161M590988M693627M803270
3644.7D61570024M727573M581451M508048M362613M243374M389823M496485M327655
3661D97207046M165887M239142M246354L989041L954411L859520L367126L244221L454924
3679.4E31727672L554284L663004L696680L542065L053487K662182K747416K850950
3695.7E57497740K745330K574206K489626K562046K635956K551555K246201J854301
$$ plain form
3577.4 318898112 322232068 325817376 329603434 333307058 336778700 340403736 344304442 348262578
3593.7 348262578 352292567 356484503 360751629 365039706 369417101 373788089 378138065 382639676
3610 382639676 387305111 392028034 396654844 401173413 405832827 410560757 415233612 419813186 424290925
3628.4 424290925 428928077 433604389 438225538 442868978 447482139 452073127 456766754 461570024
3644.7 461570024 466297597 470879048 475387096 479749709 483993083 488382906 492879391 497207046
3661 497207046 501372933 505612075 509858429 513847470 517801881 521661401 525028527 528272748 531727672
3679.4 531727672 535281956 538944960 542641640 546183705 549237192 551899374 554646790 557497740
3695.7 557497740 560243070 562817276 565306902 567868948 570504904 573056459 575302660 577156961
3712E77156961J986682K284110K226591K038896J922131J790344J748980J996755K155841
3730.3E95307291K011060J647711J420915J695991J923024J433254R40919J541257
3746.7F07921422J716256J044571J050174J637876J644075J237512J177013J411259
3763F18840158J450777J341224J139581J050353J252174J422525J364827J139343J039684
3781.3F30040646J063287J047909J084864J122892J125932J123667J136660J284540
3797.7F39030397J152754P36415Q63671R02594P07566R67682J257479J147509R33826
3816F47699893J050293Q32498N21898Q17955R33051Q59499Q80122R65178J126349Q75771
3836.4F56562507L92676M76896O68466P02143R16422J198887J057983J03593k40267
$$ plain form
3712 577156961 579143643 581427753 583654344 585693240 587615371 589405715 591154695 593151450 595307291
3730.3 595307291 597318351 598966062 600386977 602082968 604005992 605439246 606380165 607921422
3746.7 607921422 609637678 610682249 611732423 613370299 615014374 616251886 617428899 618840158
3763 618840158 620290935 621632159 622771740 623822093 625074267 626496792 627861619 629000962 630040646
3781.3 630040646 631103933 632151842 633236706 634359598 635485530 636609197 637745857 639030397
3797.7 639030397 640183151 640919566 641783237 642685831 643393397 644361079 645618558 646766067 647699893
3816 647699893 648750186 649582684 650104582 650922537 651855588 652715087 653595209 654560387 655686736 656562507
3836.4 656562507 656955183 657432079 658100545 658802688 659719110 660917997 661975980 662079573 661839306
3854.8F61839306P88868J165449R24051O26266N25654O47187N68688M64797N41746
3873.1F68092012O29545P57217O82473O14167O55353M41491M26233N52595M26471M93646
3893.5F73771203P36177P30693N33461K91586P5400J66178M37379N12719M85003M79937
3913.9F78219736L99947K90572L17634L85046L57985L30567L53337L09825K41697K78294
3934.3F81484640L91960M74751M03404K48313K88010M28974L78847K78473K69175K97785
3954.7F84944332L35812L42369K98858K45392K37406K76267L39985L37780K53737K05338
3975.1F87817276K35080K91646L44872L64602K71082J82986K69175L23414K01762J58012
3995.5F90459907K41041
$$ plain form
3854.8 661839306 662628174 663793623 664717674 665343940 665869594 666516781 667085469 667550266 668092012
3873.1 668092012 668721557 669478774 670161247 670775414 671430767 671872258 672298491 672851086 673277557 673771203
3893.5 673771203 674507380 675238073 675771534 676063120 676138520 676304698 676742077 677254796 677739799 678219736
3913.9 678219736 678619683 678910255 679227889 679612935 679970920 680301487 680654824 680964649 681206346 681484640
3934.3 681484640 681876600 682351351 682754755 683003068 683291078 683720052 684098899 684377372 684646547 684944332
3954.7 684944332 685280144 685622513 685921371 686166763 686404169 686680436 687020421 687358201 687611938 687817276
3975.1 687817276 688052356 688344002 688688874 689053476 689324558 689507544 689776719 690100133 690301895 690459907
3995.5 690459907 690700948
3997.5F90700948
$$ plain form
3997.5 690700948
##END=$$ End of the data block
