##TITLE=Amido Residuo - Bianca $$ Begin of the data block
##JCAMP-DX=5.00 $$ ACD/SpecManager v 10.08
##SPECTROMETER/DATA SYSTEM=Alpha
##DATE=24 Oct 2013 13:19:44
##DATA TYPE=INFRARED SPECTRUM
##DATA CLASS=XYDATA
##ORIGIN=
##OWNER=
##NPOINTS=1765
##FIRSTX=399.75695801
##LASTX=3997.56933594
##MAXX=3997.56933594
##MINX=399.75695801
##MAXY=0.84513193
##MINY=0.16071305
##XFACTOR=1.0000000000
##YFACTOR=1.000000000000000e-9
##FIRSTY=0.49521017
##DELTAX=2.03957629
##XUNITS=1/CM
##YUNITS=ARBITRARY UNITS
##XYDATA=(X++(Y..Y))
$$ plain form
399.8 495210171 489181310 485192060 482482165 481337160 482110351 484124601 486226469 487827420 488216758
418.1 488216758 486806095 484862804 482542217 479247481 475574702 472008646 468589783 465796113
434.4 465796113 464163512 464065582 466163456 470378697 475267470 479672879 483546495 486649513 488465458
452.8 488465458 489270777 489478797 488682777 486726761 484085113 481200814 478011072 474281698 470218390
471.1 470218390 466294408 462953359 460247070 458247721 457158118 456759691 456599295 456531197 456532538
489.5 456532538 456214607 455096573 453392565 451671243 449906737 447632492 444789767 441745400 438514203
507.9 438514203 434770882 430458218 425976455 421541929 416841269 411961854 407865196 405165464
524.2 405165464 403515369 402700543 402946353 404399782 407236397 411627144 417401105 423851073 429743648
$$ packed form
399.8D95210171o028861l989250k709895j145005P73191K014250K101868J600951L89338
418.1D88216758j410663j943291k320587l294736l672779l566056l418863k793670
434.4D65796113j632601r7930K097874M215241M888773M405409L873616L103018J815945
452.8D88465458Q05319K08020p96020j956016k641648k884299l189742l729374m063308
471.1D70218390l923982l341049k706289j999349j089603l98427j60396o8098J341
489.5D56532538l17931j118034j704008j721322j764506k274245k842725l044367l231197
507.9D38514203l743321m312664m481763m434526m700660m879415m096658k699732
524.2D05165464j650095q14826K45810J453429K836615M390747N773961O449968N892575
$$ plain form
542.5 429743648 433833003 435788572 436067581 435144573 433196038 430272430 426642835 422337294 417009562
560.9 417009562 410466969 402934074 394895405 386991352 380155772 375443637 373539984 374473304 377975225
579.2 377975225 383872718 391747147 400399953 408395946 414722025 419133812 421936274 423353136
595.6 423353136 423638582 423383504 423113465 422951043 422931075 423340321 424533963 426539719 429172933
613.9 429172933 432314664 436219990 441008210 446246058 451576889 456701189 461324602 465379775
630.2 465379775 468857050 471671075 473997802 476099044 477934718 479424506 480771869 482229948
646.5 482229948 483799338 485236675 486548930 488112479 489819616 491275489 492495477 493775904
662.9 493775904 495228171 496920019 498687953 500067532 501546502 503249347 504937708 506646693
$$ packed form
542.5D29743648M089355J955569K79009r23008j948535k923608l629595m305541n327732
560.9D17009562o542593p532895q038669p904053o835580m712135j903653R33320L501921
579.2C77975225N897493P874429Q652806P995993O326079M411787K802462J416862
595.6D23353136K85446k55078k70039j62422j9968M09246J193642K005756K633214
613.9D29172933L141731L905326M788220N237848N330831N124300M623413M055173
630.2D65379775L477275K814025K326727K101242J835674J489788J347363J458079
646.5D82229948J569390J437337J312255J563549J707137J455873J219988J280427
662.9D93775904J452267J691848J767934J379579J478970J702845J688361J708985
$$ plain form
679.2 506646693 508466184 510177791 511440396 512315750 513020158 513352931 512761235 511013508 508332908
697.5 508332908 504846811 500651836 496385306 492958337 491021484 490786493 492236316 495476276 500389278
715.9 500389278 506429553 513268948 520732045 528510273 536282420 543512344 549842536 555381417
732.2 555381417 560073197 563641667 566054046 567425549 567484677 565777123 562291563 557501256 551797986
750.6 551797986 545284450 538234115 531292796 525077283 519936681 516224980 514672101 516061008
766.9 516061008 520559788 527776718 537141204 548027933 559507728 570394695 580020070 588435411
783.2 588435411 595757484 601922691 607200503 612218618 617401600 622790337 628442883 634487510
799.5 634487510 640587330 645995617 650369644 654023051 657222450 659808815 661578476 662761092
$$ packed form
679.2E06646693J819491J711607J262605Q75354P04408L32773n91696j747727k680600
697.5E08332908l486097m194975m266530l426969j936853k34991J449823L239960M913002
715.9E00389278O040275O839395P463097P778228P772147P229924O330192N538881
732.2E55381417M691780L568470K412379J371503N9128j707554l485560m790307n703270
750.6E51797986o513536p050335o941319o215513n140602l711701j552879J388907
766.9E16061008M498780P216930R364486J0886729J1479795J0886967R625375Q415341
783.2E88435411P322073O165207N277812N018115N182982N388737N652546O044627
799.5F34487510O099820N408287M374027L653407L199399K586365J769661J182616
$$ plain form
815.8 662761092 663591504 663713634 662647367 660389781 657058835 652431130 646292150 638937593 630992293
834.2 630992293 622858286 614793777 607275426 600774586 595282257 590451956 586043000 581981838
850.5 581981838 578023493 573714077 568987310 564875364 563547432 566877842 575045288 586973906
866.8 586973906 601168752 615732491 628661990 638663530 645310163 648350179 647567868 643413246
883.1 643413246 636932790 629027545 620274007 611396194 603235722 596078992 589476705 582948208
899.4 582948208 576378047 569510341 561669528 552344263 541724086 530219257 517990232 505386412
915.8 505386412 493365526 483207226 475769371 471066684 468637168 468051165 468966693 471102834
932.1 471102834 474417567 479103357 485199720 492263258 499215186 504229188 505138636 500482619 490344584
$$ packed form
815.8F62761092Q30412J22130j066267k257586l330946m627705o138980p354557p945300
834.2F30992293q134007q064509p518351o500840n492329m830301m408956m061162
850.5E81981838l958345m309416m726767m111946j327932L330410Q167446J1928618
866.8E86973906J4194846J4563739J2929499J0001540O646633L040016p82311m154622
883.1F43413246o480456p905245q753538q877813q160472p156730o602287o528497
899.4E82948208o570161o867706p840813r325265j0620177j1504829j2229025j2603820
915.8E05386412j2020886j0158300p437855m702687k429516n86003R15528K136141
932.1D71102834L314733M685790O096363P063538O951928N014002R09448m656017j0138035
$$ plain form
950.4 490344584 476133555 459409684 441041738 421415001 400865495 379695863 358032733
964.7 358032733 335883409 313390225 290934891 268963456 247899666 228279158 210721031
979 210721031 195768639 183736756 174622774 168182552 164011776 161662966 160713047 160798863 161630586
997.3 161630586 162902981 164268225 165421098 166120678 166274428 165999040 165533110 165217578 165394098
1015.7 165394098 166274801 167876989 170145050 173055008 176505730 180276349 184114769 187804386
1032 187804386 191102937 193775564 195740730 197178498 198453978 199937984 201857537 204361841 207730249
1050.4 207730249 212363273 218472168 225932300 234697402 244929433 256550193 268528610 278219461
1066.7 278219461 281857908 277117044 265769631 252815217 242644086 236727670 234514356 235078245
$$ packed form
950.4D90344584j4211029j6723871j8367946j9626737k0549506k1169632k1663130
964.7C58032733k2149324k2493184k2455334k1971435k1063790j9620508j7558127
979B10721031j4952392j2031883r113982o440222m170776k348810r49919Q5816Q31723
997.3A61630586J272395J365244J152873O99580J53750k75388m65930l15532J76520
1015.7A65394098Q80703J602188K268061K909958L450722L770619L838420L689617
1032A87804386L298551K672627J965166J437768J275480J484006J919553K504304L368408
1050.4B07730249M633024O108895P460132Q765102J0232031J1620760J1978417R690851
1066.7B78219461L638447m740864j1347413j2954414j0171131n916416k213314N63889
$$ plain form
1083 235078245 237736255 241994321 247504681 253965944 260921627 267713189 273561209 277840525 280459762
1101.4 280459762 282019675 283518165 285801023 289136767 293302476 297879159 302323073 306109875
1117.7 306109875 309012949 311254323 313340098 315840930 319222391 323568493 328188092 331598103
1134 331598103 332243741 329350352 323203593 314735055 305077493 295385242 286636323 279408753 273892432
1152.4 273892432 270137548 268191755 268050611 269660294 273076892 278509587 286162585 296045154
1168.7 296045154 307931364 321485788 336385995 352236658 368538737 384829104 400732011
1182.9 400732011 415869057 429673761 441483438 450909734 458030611 463198841 466809094 469369560
1199.3 469369560 471540183 473893613 476741821 480272710 484724939 490233243 496526867 502972364
$$ packed form
1083B35078245K658010M258066N510360O461263O955683O791562N848020M279316K619237
1101.4B80459762J559913J498490K282858L335744M165709M576683M443914L786802
1117.7C06109875K903074K241374K085775K500832L381461M346102M619599L410011
1134C31598103O45638k893389o146759q468538r657562r692251q748919p227570n516321
1152.4B73892432l754884j945793j41144J609683L416598N432695P652998R882569
1168.7B96045154J1886210J3554424J4900207J5850663J6302079J6290367J5902907
1182.9D00732011J5137046J3804704J1809677R426296P120877N168230L610253K560466
1199.3D69369560K170623K353430K848208L530889M452229N508304O293624O445497
$$ plain form
1215.6 502972364 508914113 513871312 517492533 519560695 520146012 519647539 518517077 516993642 515233517
1233.9 515233517 513506055 512106538 511192322 510818958 511112034 512279212 514315844 516888618 519636035
1252.3 519636035 522371829 525007546 527389705 529383659 531153500 533118248 535521984 538190305
1268.6 538190305 540760338 542962551 544572532 545333326 545184672 544443309 543515027 542465270 541146398
1287 541146398 539615214 538019180 536258638 534142196 531711400 529276788 527120531 525162578 523198783
1305.3 523198783 521297932 519625187 518103719 516480327 514698267 512838423 510675907 507778049
1321.6 507778049 503894031 499008983 493252069 486914933 480569363 474999040 470749557 467800677
1338 467800677 465857774 464826673 464624763 464805335 464819670 464505196 464043081 463461101 462568074 461378604
$$ packed form
1215.6E02972364N941749M957199L621221K068162N85317m98473j130462j523435j760125
1233.9E15233517j727462j399517r14216l73364K93076J167178K036632K572774K747417
1252.3E19636035K735794K635717K382159J993954J769841J964748K403736K668321
1268.6E38190305K570033K202213J609981P60794j48654p41363r28282j049757j318872
1287E41146398j531184j596034j760542k116442k430796k434612k156257j957953j963795
1305.3E23198783j900851j672745j521468j623392j782060j859844k162516k897858
1321.6E07778049l884018m885048n756914o337136o345570n570323m249483k948880
1338D67800677j942903j031101k01910J80572J4335l14474m62115n81980q93027j189470
$$ plain form
1358.3 461378604 460179090 459090889 458124250 457409531 457139671 457584262 458715886 460145891 461646140
1376.7 461646140 463336796 465211004 467369169 470472068 475041389 480158001 484393388 487441719
1393 487441719 489287317 490017980 489826828 488936365 487694591 486187905 484446675 482465386 480291367
1411.4 480291367 478390783 477150023 476191759 475071996 474402964 474568188 475173146 475996196 477048308
1429.7 477048308 478432983 480235130 482250899 484051913 485711038 487545222 489186645 490155607
1446 490155607 490226328 489524186 488401473 487028658 484920681 482299060 481172889 481815964 484052092
1464.4 484052092 488013893 493631572 501315892 511630535 522678673 532843947 542395115 551508129
1480.7 551508129 560306132 568746567 577092946 585227370 592478871 598666131 604809463 611219525
$$ packed form
1358.3D61378604j199514j088201r66639p14719k69860M44591J131624J430005J500249
1376.7D61646140J690656J874208K158165L102899M569321N116612M235387L048331
1393D87441719J845598P30663j91152q90463j241774j506686j741230j981289k174019
1411.4D80291367j900584j240760r58264j119763o69032J65224O04958Q23050J052112
1429.7D77048308J384675J802147K015769J801014J659125J834184J641423R68962
1446D90155607P0721p02142j122713j372815k107977k621621j126171O43075K236128
1464.4D84052092L961801N617679P684320J0314643J1048138J0165274R551168R113014
1480.7E51508129Q798003Q440435Q346379Q134424P251501O187260O143332O410062
$$ plain form
1497 611219525 616764009 621532738 626315296 631749332 637216508 640976012 644257247 647966743 651695430
1515.4 651695430 655186355 658603072 662129045 665073276 667388380 669759989 672348499 675121725
1531.7 675121725 677634299 679789126 682455659 685721695 687828302 688985229 690388024 692106009
1548 692106009 693830907 695424676 697297096 699669003 701941788 702585638 702750266 703692198 705014646
1566.4 705014646 706069112 706600428 707149327 707966387 708206892 707710624 707390964 707167447 706561863
1584.7 706561863 705421329 703997552 702391565 700420976 697882533 694922149 691815734 688405395
1601.1 688405395 684440374 680062532 675520718 670628726 665382683 660233498 654731929 648133159
1617.4 648133159 642270863 637396872 632102370 626799524 621877134 617236197 613602877 610867381
$$ packed form
1497F11219525N544484M768729M782558N434036N467176L759504L281235L709496L728687
1515.4F51695430L490925L416717L525973K944231K315104K371609K588510K773226
1531.7F75121725K512574K154827K666533L266036K106607J156927J402795J717985
1548F92106009J724898J593769J872420K371907K272785O43850J64628R41932J322448
1566.4G05014646J054466N31316N48899Q17060K40505m96268l19660k23517o05584
1584.7G06561863j140534j423777j605987j970589k538443k960384l106415l410339
1601.1F88405395l965021m377842m541814m891992n246043n149185n501569o598770
1617.4F48133159n862296m873991n294502n302846m922390m640937l633320k735496
$$ plain form
1633.7 610867381 607799888 604832709 603098810 602503598 602882802 603977263 605417192 607292354 610285997
1652 610285997 613913953 616742492 619848788 623916864 628698111 633557677 638206840 643360615 648921251
1670.4 648921251 653957248 659095407 664449871 669391811 674375832 679950178 685861409 690526485
1686.7 690526485 694463134 698662877 702908218 707476258 712026417 716073453 719878078 722908258
1703 722908258 725643456 728486061 731220365 733995259 736838698 739721000 742464662 744516313 746121347
1721.4 746121347 747828484 749754727 751816750 753931761 755977154 757927895 759493768 760845125
1737.7 760845125 762311459 763812780 765443981 767213881 768883526 770296276 771535635 772749722
1754 772749722 773920238 775003374 776203096 777490318 778527558 779475749 780672193 782087922 783173501
$$ packed form
1633.7F10867381l067493k967179j733899n95212L79204J094461J439929J875162K993643
1652F10285997L627956K828539L106296M068076M781247M859566M649163N153775N560636
1670.4F48921251N035997N138159N354464M941940M984021N574346N911231M665076
1686.7F90526485L936649M199743M245341M568040M550159M047036L804625L030180
1703G22908258K735198K842605K734304K774894K843439K882302K743662K051651J605034
1721.4G46121347J707137J926243K062023K115011K045393J950741J565873J351357
1737.7G60845125J466334J501321J631201J769900J669645J412750J239359J214087
1754G72749722J170516J083136J199722J287222J037240R48191J196444J415729J085579
$$ plain form
1772.4 783173501 783658862 784175396 785113871 786157608 786925554 787555635 788378716 789475739 790539920
1790.7 790539920 791215897 791759968 792593420 793507040 794154048 794693947 795463145 796362817 797069728 797593296
1811.1 797593296 798218668 798979998 799605727 800098777 800775409 801654577 802362025 802812099 803260565 803715885
1831.5 803715885 804083288 804315805 804543197 805021107 805678248 806056321 806001067 806006312 806215525 806346476
1851.9 806346476 806345046 806485057 806842446 807132304 807206452 807357788 807821870 808272958 808306932 808219135
1872.3 808219135 808427930 808838367 809150219 809328318 809634149 810143888 810618758 810896933 811099470 811431825
1892.7 811431825 811746359 811826885 811869264 812093794 812363207 812482476 812512696 812637806 812842846 812954783
1913.1 812954783 812988460 813093007 813295364 813461244 813471675 813456476 813616395 813822091 813882053 813885450 814012527
$$ packed form
1772.4G83173501M85361N16534R38475J043737P67946O30081Q23081J097023J064181
1790.7G90539920O75977N44071Q33452R13620O47008N39899P69198Q99672P06911N23568
1811.1G97593296O25372P61330O25729M93050O76632Q79168P07448M50074M48466M55320
1831.5H03715885L67403K32517K27392M77910O57141L78073n5254N245K09213J30951
1851.9H06346476j430J40011L57389K89858P4148J51336M64082M51088L3974q7797
1872.3H08219135K08795M10437L11852J78099L05831N09739M74870K78175K02537L32355
1892.7H11431825L14534Q0526M2379K24530K69413J19269L0220J25110K05040J11937
1913.1H12954783L3677J04547K02357J65880J0431j5199J59919K05696N9962L397J27077
$$ plain form
1935.5 814012527 814266801 814490795 814600945 814684987 814852476 815018117 815105081 815250278 815560937 815897346
1955.9 815897346 816065073 816157222 816373050 816682041 816890717 816944838 817032874 817264795 817476869 817550778
1976.3 817550778 817634821 817826509 817996979 818032980 818026304 818126440 818285048 818302512 818174779 818107724 818150878
1998.8 818150878 818140745 818004966 817855716 817724288 817520261 817222416 816916108 816643178 816318154 815865874
2019.2 815865874 815353394 814903975 814496160 814026177 813496888 812997520 812550485 812097132 811633885 811210334
2039.6 811210334 810814261 810423434 810077727 809816599 809662759 809582710 809511662 809442639 809427440 809491158
2060 809491158 809565544 809613049 809690833 809832513 809966862 810035467 810107887 810233414 810360014 810472190 810591042
2082.4 810591042 810714185 810843587 810992777 811187208 811409652 811631799 811860204 812099814 812346160 812568128
$$ packed form
1935.5H14012527K54274K23994J10150Q4042J67489J65641Q6964J45197L10659L36409
1955.9H15897346J67727R2149K15828L08991K08676N4121Q8036K31921K12074P3909
1976.3H17550778Q4043J91688J70470L6001o676J00136J58608J7464j27733o7055M3154
1998.8H18150878j0133j35779j49250j31428k04027k97845l06308k72930l25024m52280
2019.2H15865874n12480m49419m07815m69983n29289m99368m47035m53353m63247m23551
2039.6H11210334l96073l90827l45707k61128j53840q0049p1048o9023j5199O3718
2060H09491158P4386M7505P7784J41680J34349O8605P2420J25527J26600J12176J18852
2082.4H10591042J23143J29402J49190J94431K22444K22147K28405K39610K46346K21968
$$ plain form
2102.8 812568128 812749445 812954664 813218057 813434422 813553214 813670397 813831568 813973248 814034939 814048469
2123.2 814048469 814099252 814183831 814228594 814238429 814290762 814403892 814492226 814512551 814544320 814658105 814793944
2145.6 814793944 814862967 814930797 815096080 815304637 815478504 815679133 816004038 816417336 816805840 817180336
2166 817180336 817657530 818238318 818801105 819320321 819899976 820553899 821166277 821694314 822240114 822866142
2186.4 822866142 823489666 824022233 824496448 825011134 825578809 826116502 826600075 827122927 827714920 828269243
2206.8 828269243 828730166 829192758 829745233 830312073 830784559 831199169 831676424 832195103 832604110 832916737
2227.2 832916737 833294630 833758295 834154665 834416568 834675968 835036457 835395753 835653365 835878551 836158633
2247.6 836158633 836466610 836724520 836939037 837203324 837550640 837881863 838135540 838400662 838731587 839047790
$$ packed form
2102.8H12568128J81317K05219K63393K16365J18792J17183J61171J41680O1691J3530
2123.2H14048469N0783Q4579M4763R835N2333J13130Q8334K0325L1769J13785J35839
2145.6H14793944O9023O7830J65283K08557J73867K00629L24905M13298L88504L74496
2166H17180336M77194N80788N62787N19216N79655O53923O12378N28037N45800O26028
2186.4H22866142O23524N32567M74215N14686N67675N37693M83573N22852N91993N54323
2206.8H28269243M60923M62592N52475N66840M72486M14610M77255N18679M09007L12627
2227.2H32916737L77893M63665L96370K61903K59400L60489L59296K57612K25186K80082
2247.6H36158633L07977K57910K14517K64287L47316L31223K53677K65122L30925L16203
$$ plain form
2268 839047790 839297891 839548647 839867055 840213895 840512216 840799391 841145635 841478586 841700792 841849208
2288.4 841849208 842037678 842303097 842564225 842736781 842863858 843053699 843311846 843546748 843695581 843836129
2308.8 843836129 844056189 844245911 844319820 844411075 844617069 844820440 844873607 844854176 844948232 845120549
2329.2 845120549 845131934 844950855 844808578 844802022 844742835 844489694 844192922 843961000 843804955 843765736
2349.6 843765736 843855619 844048083 844232917 844272912 844088614 843742669 843440652 843164504 842776000 842399240
2370 842399240 842138290 841899514 841609776 841357172 841240406 841180205 841037512 840826213 840677381 840583742
2390.4 840583742 840415657 840186059 839999020 839852870 839657843 839361012 839032590 838756502 838470578 838102281
2410.8 838102281 837699294 837336838 836990595 836546600 836017489 835528731 835084319 834587753 833999813 833391428
$$ packed form
2268H39047790K50101K50756L18408L46840K98321K87175L46244L32951K22206J48416
2288.4H41849208J88470K65419K61128J72556J27077J89841K58147K34902J48833J40548
2308.8H43836129K20060J89722P3909R1255K05994K03371N3167j9431R4056J72317
2329.2H45120549J1385j81079j42277o556n9187k53141k96772k31922j56045l9219
2349.6H43765736Q9883J92464J84834L9995j84298l45945l02017k76148l88504l76760
2370H42399240k60950k38776k89738k52604j16766o0201j42693k11299j48832r3639
2390.4H40583742j68085k29598j87039j46150j95027k96831l28422k76088k85924l68297
2410.8H38102281m02987l62456l46243m43995n29111m88758m44412m96566n87940o08385
$$ plain form
2431.2 833391428 832838058 832294464 831686020 831063628 830508232 829975963 829363108 828689635 828074098 827519476
2451.5 827519476 826934814 826337337 825821877 825364113 824859858 824297905 823761165 823311508 822883427 822378755
2471.9 822378755 821831644 821351647 820955038 820535541 820056081 819624186 819292367 818969131 818592906 818244517
2492.3 818244517 817995191 817789674 817550778 817272544 817004502 816794813 816599190 816344321 816069067 815843046
2512.7 815843046 815621674 815317333 814960182 814626455 814277649 813837290 813341141 812881291 812451839 811949909
2533.1 811949909 811335027 810685277 810093403 809542477 808925629 808251381 807609856 806979835 806309640 805642128
2553.5 805642128 805048168 804521859 803964734 803294301 802600265 802014828 801490963 800915897 800320148 799773157
2573.9 799773157 799236238 798647165 798021913 797462642 797013700 796561062 796036124 795552075 795170486 794803619
$$ packed form
2431.2H33391428n53370n43594o08444o22392n55396n32269o12855o73473o15537n54622
2451.5H27519476n84662n97477n15460m57764n04255n61953n36740m49657m28081n04672
2471.9H22378755n47111m79997l96609m19497m79460m31895l31819l23236l76225l48389
2492.3H18244517k49326k05517k38896k78234k68042k09689j95623k54869k75254k26021
2512.7H15843046k21372l04341l57151l33727l48806m40359m96149m59850m29452n01930
2533.1H11949909o14882o49750n91874n50926o16848o74248o41525o30021o70195o67512
2553.5H05642128n93960n26309n57125o70433o94036n85437n23865n75066n95749n46991
2573.9G99773157n36919n89073o25252n59271m48942m52638n24938m84049l81589l66867
$$ plain form
2594.3 794803619 794403076 794011593 793677509 793346882 792916596 792397261 791870832 791317463 790649414 789863586
2614.7 789863586 789027691 788175821 787251055 786218941 785140932 784054697 782914162 781692445 780451834
2633.1 780451834 779242277 778015971 776724458 775413990 774147093 772928417 771699607 770430446
2649.4 770430446 769188523 768019974 766871870 765679657 764471412 763316333 762220740 761124671
2665.7 761124671 760006368 758913934 757881701 756886482 755905151 754966259 754050255 753089309 752098560
2684.1 752098560 751165569 750298440 749401689 748424947 747394621 746334851 745253444 744151652 743007839
2702.4 743007839 741808295 740557134 739267290 737990737 736773968 735586941 734389901 733199894
2718.7 733199894 732028365 730891526 729811013 728774488 727777064 726814091 725874126 724967718 724088490
$$ packed form
2594.3G94803619m00543l91483l34084l30627m30286n19335n26429n53369o68049p85828
2614.7G89863586q35895q51870r24766j032114j078009j086235j140535j221717j240611
2633.1G80451834j209557j226306j291513j310468j266897j218676j228810j269161
2649.4G70430446j241923j168549j148104j192213j208245j155079j095593j096069
2665.7G61124671j118303j092434j032233r95219r81331r38892r16004r60946r90749
2684.1G52098560r32991q67129q96751r76742j030326j059770j081407j101792j143813
2702.4G43007839j199544j251161j289844j276553j216769j187027j197040j190007
2718.7G33199894j171529j136839j080513j036525r97424r62973r39965r06408q79228
$$ plain form
2737.1 724088490 723203421 722302914 721416652 720572948 719739437 718894243 718087673 717360616 716685414 716021001
2757.5 716021001 715384960 714800179 714205682 713512778 712762713 712034881 711294889 710497439 709645510 708742738
2777.9 708742738 707784355 706753433 705634952 704436958 703174651 701852560 700457036 698962867
2794.2 698962867 697387874 695767641 694048047 692194939 690262973 688256979 686176956 684031427
2810.5 684031427 681771457 679389417 676931441 674396515 671780527 669096589 666325927 663445890
2826.8 663445890 660483837 657469571 654356301 651104689 647725523 644239128 640662074 636993885
2843.1 636993885 633208513 629274786 625264287 621281743 617315471 613277256 609075546 604621232
2859.5 604621232 599763989 594340861 588326454 581807196 574841082 567460477 559801280 552128911
$$ packed form
2737.1G24088490q85069r00507q86262q43704q33511q45194q06570p27057o75202o64413
2757.5G16021001o36041n84781n94497o92904p50065p27832p39992p97450q51929r02772
2777.9G08742738r58383j030922j118481j197994j262307j322091j395524j494169
2794.2F98962867j574993j620233j719594j853108j931966k005994k080023k145529
2810.5F84031427k259970k382040k457976k534926k615988k683938k770662k880037
2826.8F63445890k962053l014266l113270l251612l379166l486395l577054l668189
2843.1F36993885l785372l933727m010499l982544l966272m038215m201710m454314
2859.5F04621232m857243n423128o014407o519258o966114p380605p659197p672369
$$ plain form
2875.8 552128911 544762850 538008749 532099009 527170300 523279071 520367503 518288136 516883433
2892.1 516883433 515955508 515274465 514629364 513872266 512923956 511696875 510061860 507912874 505230367
2910.4 505230367 502018511 498258144 494048387 489649028 485315025 481263489 477713197 474907756
2926.8 474907756 473095417 472413301 472971976 474892437 478152424 482612908 488098413 494377881 501218677
2945.1 501218677 508448660 515942812 523632288 531431675 539233923 546999335 554637372 561947942
2961.4 561947942 568776131 575120032 581055164 586624622 591940820 597180903 602381408 607488036
2977.8 607488036 612459719 617210567 621666312 625808716 629607379 633056164 636145532 638815999
2994.1 638815999 641062915 642894685 644291759 645260930 645774901 645840704 645551860 644974411 644055784
$$ packed form
2875.8E52128911p366061o754101n909740m928709l891229k911568k079367j404703
2892.1E16883433r27925o81043o45101p57098r48310j227081j635015k148986k682507
2910.4E05230367l211856l760367m209757m399359m334003m051536l550292k805441
2926.8D74907756j812339o82116N58675J920461L259987M460484N485505O279468O840796
2945.1E01218677P229983P494152P689476P799387P802248P765412P638037P310570
2961.4E61947942O828189O343901N935132N569458N316198N240083N200505N106628
2977.8F07488036M971683M750848M455745M142404L798663L448785L089368K670467
2994.1F38815999K246916J831770J397074R69171N13971O5803k88844n77449r18627
$$ plain form
3012.4 644055784 642709613 640989840 639017701 636852145 634531260 632062495 629445791 626708567
3028.7 626708567 623839617 620846629 617740452 614498377 611199021 607888937 604469717 600903630
3045.1 600903630 597264469 593622148 589970112 586277008 582549632 578751147 574895799 571121514
3061.4 571121514 567428529 563701332 559863031 555880547 551852465 547922611 544158041 540467501
3077.7 540467501 536637485 532654703 528643191 524622679 520656288 516775668 512844086 508847117
3094 508847117 504943430 501183152 497436374 493547142 489589393 485810280 482176423 478414804 474639893
3112.4 474639893 471144050 467746466 464170158 460386634 456465065 452604711 448959976 445478231
3128.7 445478231 442019671 438518375 435076356 431790143 428550899 425166488 421671957 418297559
$$ packed form
3012.4F44055784j346171j719773j972139k165556k320885k468765k616704k737224
3028.7F26708567k868950k992988l106177l242075l299356l310084l419220l566087
3045.1F00903630l639161l642321l652036l693104l727376l798485l855348l774285
3061.4E71121514l692985l727197l838301l982484m028082l929854l764570l690540
3077.7E40467501l830016l982782m011512m020512l966391l880620l931582l996969
3094E08847117l903687l760278l746778l889232l957749l779113l633857l761619l774911
3112.4D74639893l495843l397584l576308l783524l921569l860354l644735l481745
3128.7D45478231l458560l501296l442019l286213l239244l384411l494531l374398
$$ plain form
3145 418297559 415101498 412044197 409120977 406101823 402826399 399560004 396496266 393535644 390608758
3163.4 390608758 387756139 384973973 382204980 379450381 376740962 374093264 371503115 368949413
3179.7 368949413 366424859 363948435 361531854 359163254 356800050 354432464 352129906 349905372
3196 349905372 347715616 345546305 343442470 341435820 339443237 337423980 335475832 333639890 331826359
3214.3 331826359 330002487 328210652 326454043 324738830 323077559 321464062 319936424 318564147
3230.7 318564147 317251295 315720618 314023256 312490493 311128795 309819549 308612019 307445198
3247 307445198 306162208 304857045 303707212 302654713 301564336 300448269 299399942 298432946 297500372
3265.3 297500372 296637326 295904547 295135915 294178098 293154091 292168736 291216612 290303200 289436668
$$ packed form
3145D18297559l196061l057301k923220l019154l275424l266395l063738k960622k926886
3163.4C90608758k852619k782166k768993k754599k709419k647698k590149k553702
3179.7C68949413k524554k476424k416581k368600k363204k367586k302558k224534
3196C49905372k189756k169311k103835k006650j992583k019257j948148j835942j813531
3214.3C31826359j823872j791835j756609j715213j661271j613497j527638j372277
3230.7C18564147j312852j530677j697362j532763j361698j309246j207530j166821
3247C07445198j282990j305163j149833j052499j090377j116067j048327r66996r32574
3265.3B97500372q63046p32779p68632r57817j024007r85355r52124r13412q66532
$$ plain form
3283.7 289436668 288590163 287778497 287066340 286390156 285620451 284707099 283663690 282652676 281894356
3302 281894356 281352162 280720264 279748470 278507233 277257532 276155055 275164485 274186015 273200810
3320.4 273200810 272268236 271379858 270366222 269214988 268122733 267091721 266102016 265229881 264323592
3338.8 264323592 263199538 262005925 260877967 259791911 258829266 257827818 256540358 255166501
3355.1 255166501 253961742 252911776 251847565 250738829 249820232 249057248 248057529 246673658 245254114
3373.4 245254114 244136661 243201703 242305994 241447300 240579754 239754096 239161894 238880917 238546178
3391.8 238546178 237795979 236949369 236522064 236381114 235915557 235036597 234299958 233871907 233520195 233180568
3412.2 233180568 232814625 232421100 232107997 231849819 231570020 231395811 231458336 231685638 231864482 232001826
$$ packed form
3283.7B89436668q46505q11666p12157o76184p69705r13352j043409j011014p58320
3302B81894356n42194o31898r71794j241237j249701j102477r90570r78470r85205
3320.4B73200810r32574q88378j013636j151234j092255j031012r89705q72135r06289
3338.8B64323592j124054j193613j127958j086056r62645j001448j287460j373857
3355.1B55166501j204759j049966j064211j108736r18597p62984r99719j383871j419544
3373.4B45254114j117453r34958q95709q58694q67546q25658n92202k80977l34739
3391.8B38546178p50199q46610m27305j40950m65557q78960p36639m28051l51712l39627
3412.2B33180568l65943l93525l13103k58178k79799j74209O2525K27302J78844J37344
$$ plain form
3432.6 232001826 232243419 232382983 232238844 232098684 232257888 232641101 233050838 233409151 233798057 234258622
3453 234258622 234735385 235295430 236004978 236671284 237296149 238216341 239347279 240165845 240507662 240826607
3473.4 240826607 241479278 242438003 243432879 244133309 244754657 245658576 246616662 247423604 248288915 249306440
3493.8 249306440 250407755 251479149 252500087 253551155 254488200 255293936 256197184 257274628 258555204
3512.1 258555204 259876132 261006236 262099206 263386309 264871806 266278744 267406642 268486679
3528.4 268486679 269787610 271301091 272928238 274514198 276017606 277716428 279662162 281527877
3544.7 281527877 283093274 284619093 286371380 288237303 290184140 292324573 294638246 297025204
3561.1 297025204 299432665 301852882 304427266 307231098 310082197 312930495 315925002 319110245
$$ packed form
3432.6B32001826K41593J39564j44139j40160J59204L83213M09737L58313L88906M60565
3453B34258622M76763N60045P09548O66306O24865R20192J130938Q18566L41817L18945
3473.4B40826607O52671R58725R94876P00430O21348R03919R58086Q06942Q65311J017525
3493.8B49306440J101315J071394J020938J051068R37045Q05736R03248J077444J280576
3512.1B58555204J320928J130104J092970J287103J485497J406938J127898J080037
3528.4B68486679J300931J513481J627147J585960J503408J698822J945734J865715
3544.7B81527877J565397J525819J752287J865923J946837K140433K313673K386958
3561.1B97025204K407461K420217K574384K803832K851099K848298K994507L185243
$$ plain form
3577.4 319110245 322497189 326116741 329931766 333743960 337306261 340912193 344797492 348784566
3593.7 348784566 352873743 357175112 361552984 365912259 370336175 374745905 379115880 383588523
3610 383588523 388219833 392953753 397656620 402286708 406991988 411732316 416445136 421040773 425529242
3628.4 425529242 430246830 435014069 439649880 444250882 448863149 453511953 458255440 463080078
3644.7 463080078 467829376 472425610 476881415 481177032 485430002 489891320 494432002 498747498
3661 498747498 502897501 507120728 511315405 515266180 519240856 523120582 526522756 529839396 533327341
3679.4 533327341 536880434 540534139 544192970 547658622 550642252 553314865 556114674 559004903
3695.7 559004903 561794519 564393640 566804588 569236100 571826458 574377358 576592386 578450263
$$ packed form
3577.4C19110245L386944L619552L815025L812194L562301L605932L885299L987074
3593.7C48784566M089177M301369M377872M359275M423916M409730M369975M472643
3610C83588523M631310M733920M702867M630088M705280M740328M712820M595637M488469
3628.4D25529242M717588M767239M635811M601002M612267M648804M743487M824638
3644.7D63080078M749298M596234M455805M295617M252970M461318M540682M315496
3661D98747498M150003M223227M194677L950775L974676L879726L402174L316640L487945
3679.4E33327341L553093L653705L658831L465652K983630K672613K799809K890229
3695.7E59004903K789616K599121K410948K431512K590358K550900K215028J857877
$$ plain form
3712 578450263 580468774 582765818 585031569 587090433 588985980 590819418 592632771 594597101 596683383
3730.3 596683383 598664641 600335300 601795316 603479028 605343580 606784880 607840896 609433413
3746.7 609433413 611083031 612072885 613112926 614698410 616298914 617565811 618807375 620260835
3763 620260835 621716022 623047113 624176741 625217199 626462162 627889216 629266798 630407810 631443739
3781.3 631443739 632503748 633530498 634578884 635714531 636929333 638123631 639234602 640434623
3797.7 640434623 641485095 642188251 643143058 644130945 644854605 645804942 647050679 648171306 649059951
3816 649059951 650130808 651005507 651477337 652192295 653078020 653966606 654896498 655899763 657059193
3834.4 657059193 657995641 658471107 658942044 659540236 660218835 661121726 662283123 663326323 663486838
$$ packed form
3712E78450263K018511K297044K265751K058864J895547J833438J813353J964330K086282
3730.3E96683383J981258J670659J460016J683712J864552J441300J056016J592517
3746.7F09433413J649618R89854J040041J585484J600504J266897J241564J453460
3763F20260835J455187J331091J129628J040458J244963J427054J377582J141012J035929
3781.3F31443739J060009J026750J048386J135647J214802J194298J110971J200021
3797.7F40434623J050472P03156R54807R87887P23660R50337J245737J120627Q88645
3816F49059951J070857Q74699M71830P14958Q85725Q88586R29892J003265J159430
3834.4F57059193R36448M75466M70937N98192O78599R02891J161397J043200J60515
$$ plain form
3852.7 663486838 663300753 664032221 665145218 666062832 666675270 667253911 667996943 668542325 668920457
3871.1 668920457 669432580 670044422 670776904 671479344 672167361 672897875 673373103 673786819 674286008 674613595
3891.5 674613595 675024211 675769210 676588595 677202463 677504957 677565694 677709579 678101063 678580880 679113567
3911.9 679113567 679715157 680203259 680442452 680653334 681000650 681330979 681618929 681990623 682401419 682712853
3932.3 682712853 682955265 683273196 683699965 684130788 684455931 684777081 685170591 685498118 685747385 686033368
3952.7 686033368 686388433 686754704 687093437 687382340 687606812 687841177 688130200 688486397 688864827 689116836
3973.1 689116836 689266622 689505517 689836681 690154970 690447330 690699100 690921783 691163540 691393554 691591322
3993.4 691591322 691818416 692102313
$$ packed form
3852.7F63486838j86085P31468J112997R17614O12438N78641P43032N45382L78132
3871.1F68920457N12123O11842P32482P02440O88017P30514M75228M13716M99189L27587
3891.5F74613595M10616P44999Q19385O13868L02494O0737J43885L91484M79817N32687
3911.9F79113567O01590M88102K39193K10882L47316L30329K87950L71694M10796L11434
3932.3F82712853K42412L17931M26769M30823L25143L21150L93510L27527K49267K85983
3952.7F86033368L55065L66271L38733K88903K24472K34365K89023L56197L78430K52009
3973.1F89116836J49786K38895L31164L18289K92360K51770K22683K41757K30014J97768
3993.4F91591322K27094K83897
$$ plain form
3997.5 692102313
$$ packed form
3997.5F92102313
##END=$$ End of the data block
