##TITLE=$$ Begin of the data block
##JCAMP-DX=5.00 $$ ACD/SpecManager v 10.08
##SPECTROMETER/DATA SYSTEM=Varian
##DATE=15 Jan 2013 14:56:42
##DATA TYPE=INFRARED SPECTRUM
##DATA CLASS=XYDATA
##ORIGIN=
##OWNER=
##NPOINTS=3735
##FIRSTX=399.26403809
##LASTX=4000.35498047
##MAXX=4000.35498047
##MINX=399.26403809
##MAXY=85.56653595
##MINY=37.43082047
##XFACTOR=1.0000000000
##YFACTOR=0.000000100000000
##FIRSTY=68.90070343
##DELTAX=0.96440572
##XUNITS=1/CM
##YUNITS=TRANSMITTANCE
##XYDATA=(X++(Y..Y))
399.3F89007034o934738Q57163l119660o110077j3876953j7665787n958595P980766
407F44179153O203232J023331P192306L576889R23768O587143K125320o344376n645904
415.7F59820862n21088J992951O94198l172073K946014O028672N87539r562835l175355
424.3F55638885j919326m294892J438370N020523M290543M19693k687989k180099J373291
433F57098999K172699m534378n221787O13099p47528k080384Q94852K788162K47498
441.7F51231232k082901O3781N152970M902801m947281j784973Q020325J555557K61612
450.4F62373123K396851r22547Q08106N26504k670669k726288l190460n641480Q726349
459.1F59679489Q031998k232819K082062L625488j745453j314773j705246l564835
$$ plain form
399.3 689007034 682072296 682929459 679809799 673699722 659822769 642156982 636198387 644179153
407 644179153 650382385 651405716 658598022 662174911 663098679 669685822 671811142 665466766 659820862
415.7 659820862 659299774 661292725 661986923 658814850 661760864 667789536 668377075 658814240 655638885
424.3 655638885 653719559 649424667 650863037 655883560 660174103 660593796 657905807 655725708 657098999
433 657098999 659271698 654737320 649515533 650128632 649381104 647300720 648195572 650983734 651231232
441.7 651231232 649148331 649212112 654365082 659267883 654320602 652535629 660555954 662111511 662373123
450.4 662373123 664769974 663847427 664655533 665182037 662511368 659785080 656594620 650953140 659679489
459.1 659679489 667711487 665478668 667560730 671186218 669440765 668125992 666420746 662855911
466.8F62855911p690048k763061R09347J946640j19781p101441O18210k412186m274673
475.5F41968918n87311l473854k087746n47905K898064N183334K612076o22101n874977
484.1F39468498j856422K319870J27563m40330J35116J19248K166862L264618P48215
492.8F46053238k171936m763832j206093k307434m895363n99289k38419M674721O307755
501.5F40853348j582451l894653j364708P56492j054992k423058j073494j680603k959747
510.2F25576134j923523J134796j03073j513939j466103j833534n177345p066002l562851
518.9F04064560k284012J182823J218186K194633J875229l109360j948585k376938
526.6F00816536l449402k94685L290519K181015n8364J164093J106987K164421J706009
$$ plain form
466.8 662855911 655165863 652402802 653312149 655258789 655139008 648037567 648655777 646243591 641968918
475.5 641968918 641381607 637907753 635820007 635272102 638170166 643353500 645965576 645343475 639468498
484.1 639468498 637612076 639931946 640059509 639619179 639754295 639873543 642040405 645305023 646053238
492.8 646053238 643881302 639117470 637911377 635603943 630708580 630109291 629870872 634545593 640853348
501.5 640853348 639270897 635376244 634011536 634768028 633713036 631289978 630216484 628535881 625576134
510.2 625576134 623652611 624787407 624684334 623170395 621704292 619870758 614693413 607627411 604064560
518.9 604064560 601780548 602963371 604181557 606376190 608251419 605142059 603193474 600816536
526.6 600816536 597367134 597072449 600362968 602543983 602485619 603649712 604756699 606921120 608627129
535.2F08627129L72848M1008N00298J982307K204399L296967L498077L148041K022285
543.9F25693359J751061K242393k86827k067413k195129k972565k693291J539955L048020
552.6F24059563m18282n15137n49774j474037p39288k212410n293198m692612j173172
561.3F06991653j259155j278076j864777j555976j167756m586372m231148k911110
569E88137283l148651m586792l660774p70111k70043Q23975N70603J246490J885338
577.7E80227318R24568k26707M47387J720124L273582L948708L546142N801010L581009
586.4F03243141K252159L290482J351089K68784N83305N69153J35040J177178J291504
595F14161835J401901J456261j46637n44052j073189j757622j656990q3008N32494
$$ plain form
535.2 608627129 608999977 609040985 609541283 611523590 613727989 617024956 620523033 623671074 625693359
543.9 625693359 627444420 629686813 629399986 627332573 625137444 622164879 619471588 621011543 624059563
552.6 624059563 623641281 623126144 622576370 621102333 620363045 618150635 612857437 608164825 606991653
561.3 606991653 605732498 604454422 602589645 601033669 599865913 595279541 591048393 588137283
569 588137283 584988632 580401840 576741066 575970955 575700912 576524887 577095490 578341980 580227318
577.7 580227318 581151886 580925179 581372566 583092690 586366272 590314980 593861122 599662132 603243141
586.4 603243141 605495300 608785782 610136871 610405655 610988960 611558113 611693153 612870331 614161835
595 614161835 615563736 617019997 616873360 616329308 615256119 613498497 611841507 611758499 612290993
603.7F12290993J225204K482262M3602m99077J53847L44734k17209j647148q34389
612.4F13342819j52893J956062K755852K293282K364807J187324K337571K481689Q87566
621.1F29454079L49044k28958J322976L057708L527909L748169J964492J781082J763230
629.8F46739731N43823O42166q6365L70179k41700K63367K342529J751252J402282
638.4F53727264L96958J338959P62252j979828j505737j24130P52640Q95691K298812
647.1F56562881K073517N15671J348801J130905p11746k383194j834870m73404N60379
655.8F56788940J437760K153473K113189J610184J588364n07355j032867p71943n68084
664.5F62811661N62896J031418J98593p770462N183640N675430J503220N35889j278916
$$ plain form
603.7 612290993 613516197 615998459 616042061 615542984 615696831 616041565 615824356 614177208 613342819
612.4 613342819 613189926 615145988 617901840 620195122 622559929 623747253 626084824 628566513 629454079
621.1 629454079 629803123 629574165 630897141 633954849 637482758 641230927 643195419 644976501 646739731
629.8 646739731 647283554 647925720 647839355 648209534 647967834 648231201 650573730 652324982 653727264
638.4 653727264 654124222 655463181 656225433 654245605 652739868 652615738 653368378 654264069 656562881
647.1 656562881 658636398 659152069 660500870 661631775 660920029 658536835 656701965 656228561 656788940
655.8 656788940 658226700 660380173 662493362 664103546 665691910 665184555 664151688 663379745 662811661
664.5 662811661 663374557 664405975 664604568 656834106 662017746 667693176 669196396 669732285 668453369
673.2F68453369j427002J44348O25611J080551J168289J643372R68551J170502J683731
681.8F75511322j12381j051865l72467m36859m98504j2284J356049L264007K645417
690.5F80292435M84314j714478j558838j285476k621155j720352j146470l41033R42077
699.2F71331024J68533r47265j462555j473236k324295k678452k239685r05609L93982
707.9F59862442J46408R44595J027451J683731J988754K98157J266480J952056P28608
716.6F69898682Q79058J401978J981964L158722K903214L575668M319916K581329J390915
725.2F92091446J109695J399765R67484J534271K491837J815643K173080L024826L255539
733.9G09863586J931229J50452j944275k123261O42853J607666J045838J053771J728287
$$ plain form
673.2 668453369 667026367 667170715 667796326 668876877 670045166 671688538 672657089 673827591 675511322
681.8 675511322 675398941 674347076 673974609 673537750 673039246 673026962 674383011 677647018 680292435
690.5 680292435 680776749 679062271 677503433 676217957 673596802 671876450 670729980 670388947 671331024
699.2 671331024 671499557 670552292 669089737 667616501 665292206 662613754 660374069 659468460 659862442
707.9 659862442 660008850 660953445 661980896 663664627 665653381 665951538 667218018 669170074 669898682
716.6 669898682 670777740 672179718 674161682 677320404 680223618 683799286 688119202 690700531 692091446
725.2 692091446 693201141 694600906 695568390 697102661 699594498 701410141 703583221 706608047 709863586
733.9 709863586 711794815 711945267 710000992 707877731 708520584 710128250 711174088 712227859 713956146
742.6G13956146J010285l88260q93402j760483l046723l934402k297821j186600j799164
751.3F99659576r29794o11420j887283l258438k555466j779175k784423k855683k816772
760F80181122j503678N5085j53961M41284Q45642P43789O25763J23063J17874R57718
769.6F82433701J624145J662979K268906M909668O731491N091629L482056K769928
777.3G10974503K445983K355729J784362P25251J659546L733749L672867L892135L637543
786G34881668J873093J173706J134643L58429k45437j99128R72367K522735K365570
794.7G44837646K244721K857742K835312K122345J785812J038056m93775n52902J184311
803.4G57859268L189240K200164K408371L279801J451492R92661K25906r51919k501450
$$ plain form
742.6 713956146 714966431 714578171 713684769 711924286 708877563 704943161 702645340 701458740 699659576
751.3 699659576 698729782 698118362 696231079 692972641 690417175 688638000 685853577 682997894 680181122
760 680181122 678677444 678732529 678578568 679019852 679865494 680609283 681235046 681358109 681475983 682433701
769.6 682433701 684057846 685720825 687989731 692899399 699630890 704722519 708204575 710974503
777.3 710974503 713420486 715776215 717560577 718285828 719945374 723679123 727351990 731244125 734881668
786 734881668 736754761 737928467 739063110 739421539 739176102 738976974 739949341 742472076 744837646
794.7 744837646 747082367 749940109 752775421 754897766 756683578 757721634 757227859 756674957 757859268
803.4 757859268 761048508 763248672 765657043 768936844 770388336 771380997 771606903 770654984 768153534
812G68153534j178742N67704N55114K944336K727127J834717N30854p41959o86722
820.7G74705963k159042k021332j160431j98898r7351N07888Q21763o75965o95343
829.4G69027252k007065l794479l917847l483123l004837k339783j679077r06449n89676
838.1G47304916r69619j634293k395706k187271l982468m233627j875916j094513J80435
846.8G29111938j35421m4327J038895L35083q78754k773972l269500k660675j711426
855.4G19011841j245041m99497O76041O06384L27378r79615q54263R78699J676712
864.1G19698639J638489K220764L882675M486237N586319O245422N524445M736862
871.8G54019852L438263K445678Q38242R34601J454010K011642K113037J782227K110901
$$ plain form
812 768153534 766974792 767542496 768097610 771041946 773769073 775603790 776134644 775392685 774705963
820.7 774705963 772546921 770525589 769365158 769166260 769068909 769576797 770398560 769722595 769027252
829.4 769027252 767020187 763225708 759307861 755824738 752819901 750480118 748801041 747894592 747304916
838.1 747304916 746335297 744701004 742305298 740118027 736135559 731901932 730026016 728931503 729111938
846.8 729111938 728976517 728932190 729971085 730306168 729427414 726653442 723383942 720723267 719011841
855.4 719011841 717766800 717267303 717943344 718549728 718877106 717897491 717043228 718021927 719698639
864.1 719698639 721337128 723557892 727440567 731926804 737513123 743758545 749282990 754019852
871.8 754019852 757458115 759903793 760742035 761676636 763130646 765142288 767255325 769037552 771148453
880.5G71148453J042022j48162k874985l597336k773514l116455l355102l160706r46655
889.2G52217560j04675k56806j453552l951264m063415l270416l383255l225861k252426
897.9G30255890j658936o17981K9908k68631l56141j394958l077774m420013m622269
906.5G13869095m383392l412934k214203j539230j114960j940460l178787m476547
914.3F91608582n338517n985794o217041m331512l104706l479157j962738J94550k25601
922.9F61158066j992188j486511j229401k417984j773452j060181J678Q11081J788254
931.6F53799362K949143J658477J083146R82132Q63189J446915J841812J553879J504593
940.3F67682648L419342M236450L077850K346115J697312r6512j511536k286453l297043
$$ plain form
880.5 771148453 772190475 772042313 769167328 765569992 762796478 759680023 756324921 753164215 752217560
889.2 752217560 752112885 751856079 750402527 746451263 742387848 739117432 735734177 732508316 730255890
897.9 730255890 728596954 727978973 728008881 727740250 727384109 725989151 722911377 718491364 713869095
906.5 713869095 709485703 706072769 703858566 702319336 701204376 699263916 696085129 691608582
914.3 691608582 686270065 680284271 674067230 669735718 666631012 663151855 661189117 661383667 661158066
922.9 661158066 659165878 657679367 656449966 654031982 652258530 651198349 651200027 652011108 653799362
931.6 653799362 656748505 658406982 659490128 660472260 661335449 662782364 664624176 666178055 667682648
940.3 667682648 671101990 675338440 678416290 680762405 682459717 682363205 680851669 678565216 675268173
949F75268173l496475l664398l567658k979965m061890n457229n635605o027832q401833
957.7F31975288r322013p906151p388001p425804p348289o311074p569999q216896
965.4E70487061q130074r699821j0186806j0531311r566536j0441780r985581r233856
973.1D92711296r790230q825760r013786q384857j0004082j0014534r239235q068924
980.8D19369888p104301p542114n060540n023498l500443l330307k550430k589836
988.5C82668419l442307q85353j857795m45519j217384n11856J347503J450310K046471
997.2C79152489J10931J383553j76659N02434R20906j65138Q10928J84555J863441
1005.9C84587440R2736P34176M36898j228524j251831j748428P248j649170j39389
$$ plain form
949 675268173 671771698 668107300 664539642 661559677 657497787 652040558 646404953 640377121 631975288
957.7 631975288 622653275 614747124 607359123 599933319 592585030 586273956 578703957 570487061
965.4 570487061 562356987 552657166 542470360 531939049 522372513 511930733 501945152 492711296
973.1 492711296 482921066 474095306 465081520 456696663 446692581 436678047 427438812 419369888
980.8 419369888 412265587 404723473 399662933 394639435 391138992 387808685 385258255 382668419
988.5 382668419 379226112 378340759 376482964 376037445 374820061 374308205 375655708 377106018 379152489
997.2 379152489 379263420 380646973 380470314 380972748 381893654 381728516 382539444 382723999 384587440
1005.9 384587440 384680176 385414352 385851250 384622726 383370895 381622467 381629715 379980545 379841156
1014.6C79841156L57437Q00362J483269L83415J417846P2785J012916M79584J248856
1023.2C87097626J099052J043472K634163J458016L283767K279091L028298K185936
1031D04109421J346245J968193M1618K014046J580276J860352J284981K042694K245063
1039.6D18492889L33062P85980r11179M18015k67R94911J294746J152420K378006P50504
1049.3D25689087K647819J055718J922531K171440J895981K997627J587067L881645
1057D43848915L579292N335350M930001N449943O235047L843536N222511M555474N952644
1065.7D88952713M631004L450470K919312O20918q77914m815598n437088q091316q427315
1074.4D72925186p023353n656128k954674m050293j545372j001015J116829P83119
$$ plain form
1014.6 379841156 380198593 380998955 382482224 382865639 384283485 384356270 385369186 385848770 387097626
1023.2 387097626 388196678 389240150 391874313 393332329 396616096 398895187 401923485 404109421
1031 404109421 405455666 407423859 407465477 409479523 411059799 412920151 414205132 416247826 418492889
1039.6 418492889 418825951 419611931 418700752 419118767 419118500 420113411 421408157 422560577 424938583 425689087
1049.3 425689087 428336906 429392624 431315155 433486595 435382576 438380203 439967270 443848915
1057 443848915 447428207 452763557 457693558 463143501 469378548 473222084 478444595 483000069 488952713
1065.7 488952713 493583717 497034187 499953499 500574417 499696503 494880905 489443817 481352501 472925186
1074.4 472925186 465901833 460245705 457291031 453240738 451695366 450694351 451811180 452594299
1082.1D52594299r1972J556740M80118K365150J602516K152481K127381L377075M002113
1090.7D70165901K525826M239921L448334L683319K162705J691932Q17452P81517K691726
1099.4D92208633R63936J353264Q73985J500550M95681K83776P53403m53759J153221
1108.1D99132690j8844J987686K442818K217979K895737J848106K969589J269036J135635
1116.8E15880432Q76694J348877J185875j04370Q63647J198197K748069J394501J165276
1125.5E26557198Q00666M94767J399688R97277K550468K120934K977371K194519J559868
1134.1E41652756J847076N3597n58167k470703k302551l479882m138259l941155m784317
1142.8E21878395l516006l893586l578300m819679m047509l974571m212494k529792
$$ plain form
1082.1 452594299 452502327 454059067 454539185 456904335 458506851 460659332 462786713 466163788 470165901
1090.7 470165901 472691727 476931648 480379982 484063301 486226006 487917938 488735390 489516907 492208633
1099.4 492208633 493172569 494525833 495399818 496900368 497396049 497679825 498433228 497979469 499132690
1108.1 499132690 499113846 501101532 503544350 505762329 508658066 510506172 513475761 514744797 515880432
1116.8 515880432 516757126 518106003 519291878 519187508 520051155 521249352 523997421 525391922 526557198
1125.5 526557198 527357864 527852631 529252319 530249596 532800064 534920998 537898369 540092888 541652756
1134.1 541652756 543499832 543553429 542995262 540524559 538222008 534742126 530603867 526662712 521878395
1142.8 521878395 518362389 514468803 510890503 506070824 502023315 498048744 493836250 491306458
1150.5D91306458l643609k488327k734947m03709j09177o34842M84085j075020J56823
1159.2D80857735n79415R76563R93042J106376L045044L197747M420166L792495N261536
1167.9E03071289M354553M566002M767838M599189O481286N603179O846886O790276
1175.6E47080498P739181P590370O448746P010613O050300N926323N009270M777870
1183.3E97633171M516716O030006O685601M952965N270881M612274M097824K787362
1191F36586800J365394Q58994P83119J916923K102814J995087J465530J791840J149978
1199.7F50016479J9684J84784m03595K23542J13067M66080J948852K029267K152099
1208.4F56750259K571869K265549Q84857J126633J488876P77283J162338K175064K800980
$$ plain form
1150.5 491306458 487662849 485174522 482439575 482035866 481926689 481291847 481775932 480700912 480857735
1159.2 480857735 480278320 481254883 482247925 483354301 486399345 489597092 494017258 497809753 503071289
1167.9 503071289 507425842 511991844 516759682 521358871 527840157 533443336 540290222 547080498
1175.6 547080498 554819679 562410049 568858795 575869408 581919708 587846031 592855301 597633171
1183.3 597633171 602149887 608179893 614865494 619818459 625089340 629701614 633799438 636586800
1191 636586800 637952194 638811188 639594307 641511230 643614044 645609131 647074661 648866501 650016479
1199.7 650016479 650036163 650220947 649817352 650040894 650153961 650620041 652568893 654598160 656750259
1208.4 656750259 659322128 661587677 662472534 663599167 665088043 665865326 667027664 669202728 672003708
1217.1F72003708K624512K976684K434082R02863N74722L54157m55018j261749r63974
1225.8F79189987j27868K31781P79342Q52127J98517m66080r77935j326218j310120
1234.4F77043533j541824j506882n91278L08762Q67615P69805Q65326J88980o04934
1243.1F75799103n11933p74383m32511J33820N54962J164780K027588J996689J436538
1251.8F81394653J716309R36661k96402o22788n58166K55890R08050J250992J473160
1260.5F86458359J522445J533280R80377K50702k96707m20990r384M68521Q64181J402207
1270.1F92752991J900940J935806J980820J170501l07083p50122j060943q99582n20172
1278.8F96203156k04545J29166M01154Q45794O79932Q163p60192j058274j577987j913681
$$ plain form
1217.1 672003708 674628220 677604904 680038986 680941849 681516571 681870728 681415710 680153961 679189987
1225.8 679189987 679062119 679293900 680073242 680925369 681123886 680657806 679679871 678353653 677043533
1234.4 677043533 675501709 673994827 673403549 673712311 674579926 675349731 676215057 676404037 675799103
1243.1 675799103 675287170 674512787 674080276 674214096 674769058 675933838 677961426 679958115 681394653
1251.8 681394653 683110962 684047623 683751221 683128433 682570267 682826157 683734207 684985199 686458359
1260.5 686458359 687980804 689514084 690494461 690745163 690448456 690027466 690018082 690486603 691350784 692752991
1270.1 692752991 694653931 696589737 698570557 699741058 699433975 698683853 697622910 696723328 696203156
1278.8 696203156 695998611 696127777 696528931 697374725 698054657 698062820 697302628 696244354 694666367 692752686
1288.4F92752686j040574j48773K28272K99301K91900j26495q28094j508637j518097
1297.1F88401489j508941k070237j365738K1668M97208L58352O28510L94287j43509
1305.8F85213089o08826j706161j643524j211472q95462j17493O66504J070481J48544
1314.5F80915680k12402l21351j175079j400070j762619j786118j358413j080780l17612
1323.2F71501236l0212m27781j115493k208710k626724k992554l241653k937241k353668
1331.8F53567200j139527q03680n57098p27845r43908j076050j333847j890946k191925
1340.5F42902374R9945K97547O2790N44281J021881J374817N66253n4168o12793p71332
1350.2F45431595j179810j375961n82352j59225K65579N34592P34329k11258m32129
$$ plain form
1288.4 692752686 691712112 691563339 691791611 692090912 692382812 692256317 691428223 689919586 688401489
1297.1 688401489 686892548 684822311 683456573 683478241 683975449 684333801 684962311 685356598 685213089
1305.8 685213089 684604263 682898102 681254578 680043106 679147644 679030151 679696655 680767136 680915680
1314.5 680915680 680703278 680381927 679206848 677806778 676044159 674258041 672899628 671818848 671501236
1323.2 671501236 671471024 671043243 669927750 667719040 665092316 662099762 658858109 655920868 653567200
1331.8 653567200 652427673 651623993 651066895 650339050 649395142 648319092 646985245 645094299 642902374
1340.5 642902374 643002319 643299866 643362656 643906937 644928818 646303635 646869888 646815720 646202927 645431595
1350.2 645431595 644251785 642875824 642293472 642134247 642399826 642934418 643668747 643457489 643025360
1358.8F43025360k77634k067947k174797j400299j338387N38712J048813N85060O46858
1367.5F38585739l42178m85764N22423m05960k38876o56090o90155P56950J883774
1376.2F38929863K281380J042938J026611K99912J33667R7427m86526K05383O42853
1384.9F44173508J920166J974029K385407L117218K479553J313629J072159Q97293
1392.6F59332962m56161j620636j058350J663284J446915N30395l21502L88870J052093
1401.3F60957870j095275j268540j583481l388748o88171P13882N23758J98441J71661
1409.9F54541397m16031o11725r47952j179199j218948j217347q45565m69056O40564
1418.6F48276138k179794J585083K920837M42810n82885k450943M04358J072540j25656
$$ plain form
1358.8 643025360 642747726 640679779 638504982 637104683 635766296 636305008 637353821 637938881 638585739
1367.5 638585739 638243561 637757797 638280220 637874260 637635384 636979294 636289139 637046089 638929863
1376.2 638929863 641211243 642254181 643280792 643580704 643714371 643811798 643325272 643530655 644173508
1384.9 644173508 646093674 648067703 650453110 653570328 656049881 657363510 658435669 659332962
1392.6 659332962 658876801 657256165 656197815 657861099 659308014 659838409 659516907 659905777 660957870
1401.3 660957870 659862595 658594055 657010574 653621826 652933655 653647537 654171295 654369736 654541397
1409.9 654541397 654125366 653513641 652565689 651386490 650167542 648950195 648104630 647635574 648276138
1418.6 648276138 646096344 647681427 650602264 651045074 650462189 648011246 648415604 649488144 649362488
1427.3F49362488R87701N35507N75562J580124K381744J85089o99310Q94852m54026
1436F55349731l701248O18439L480453J859665J589432J579666N97000R94339n03311
1444.7F61864166m35180j035233j496429j547547J050720K317963l0060k3498p88269
1453.3F59876633k44904o83288q64182l173981o894531J897354J584473L555069J275558
1462F56328201J043167K339936j566162R80987Q68836K394332J230622K235718L657455
1470.7F69513092J347199L799819K424241P145538L737869J202316L050538L418655
1478.4F95639267L384247J854706K978515K318421M312591L878098K730102K906571
1486.1G20002518J49231K261963J170730l04642k6474M445954M535980K297363L641815
$$ plain form
1427.3 649362488 650350189 650885696 651461258 653041382 655423126 655608215 654908905 655803757 655349731
1436 655349731 651648483 652266922 655747375 657607040 659196472 660776138 661373138 662367477 661864166
1444.7 661864166 661428986 660393753 658897324 657349777 658400497 660718460 660688400 660664902 659876633
1453.3 659876633 659631729 658948441 658084259 654910278 648015747 649913101 651497574 655052643 656328201
1462 656328201 657371368 659711304 658145142 659126129 659994965 662389297 663619919 665855637 669513092
1470.7 669513092 670860291 674660110 677084351 684229889 687967758 689170074 692220612 695639267
1478.4 695639267 699023514 700878220 703856735 706175156 710487747 714365845 717095947 720002518
1486.1 720002518 720151749 722413712 723584442 723279800 723253326 727699280 732235260 734532623 738174438
1494.8G38174438Q46634j142730K478561M74701j4954K371903K148895J101456L006286
1503.5G49445190K266770J683807m484405m042054N724335O00815K132874K632827
1511.2G55960159J281967J26648L145905K446670N5771O4698j915741N068435K201615
1519.9G68436127n136185l597107J263580N573044K347183J14899J263886K023239
1527.6G72288666l45993N78918J791153m96902P50885k584305j972351M239120L166275
1536.3G77415466L025284J734390m414672j0671616O924133Q53806o12335L781127
1544G78035583r74121j29242M031067L390732J181412j457825j885376J415329J488877
1552.7G85096436k84501l612289J181641N516204L333283q524246j0304795L766251
$$ plain form
1494.8 738174438 739021072 737878342 740356903 740831604 740816650 743188553 745337448 746438904 749445190
1503.5 749445190 751711960 753395767 748911362 744869308 750593643 751194458 753327332 755960159
1511.2 755960159 757242126 757368774 760514679 762961349 763017120 763081818 761166077 766234512 768436127
1519.9 768436127 763299942 759702835 760966415 766539459 768886642 769001541 770265427 772288666
1527.6 772288666 771942673 772521591 774312744 773815842 774566727 771982422 770010071 774249191 777415466
1536.3 777415466 780440750 782175140 777760468 767088852 774012985 774866791 774254456 778035583
1544 778035583 777061462 776932220 780963287 784354019 785535431 784077606 782192230 783607559 785096436
1552.7 785096436 784811935 781199646 782381287 787897491 791230774 782706528 772401733 776167984
1560.4G76167984Q702469L051376J131973n74646k313919J196061K562484K227326
1568.1G92151108p52411m135208K434845K073059l80249j84326J348114j579895o571732
1576.8G84403305L896713L855133J133271M82101j38779q06350q16956j088028k70157
1585.5G90650253m41131j47858M47922M65774n722p04879o77491o74133j098022j994553
1595.1G85820160j549301j116791j81961J19095j97754n75562j296692j652450k432175
1603.8G76936569j312790j178207k122192k256928r67941j250992j596298k86255k216110
1612.5G63748856k150269j925964r17740l229370j1560288L097077J419296o77796
1620.2G47803802j429824l9368j725998o693497K80075m76989q17261m348373k978516
$$ plain form
1560.4 776167984 784870453 787921829 789053802 788479156 786165237 787361298 789923782 792151108
1568.1 792151108 791398697 787263489 789698334 791771393 791391144 791206818 792554932 790975037 784403305
1576.8 784403305 788300018 792155151 793288422 793770523 793631744 792825394 792008438 790920410 790650253
1585.5 790650253 790209122 790061264 790509186 790974960 790969238 790264359 789586868 788912735 787814713 785820160
1595.1 785820160 784270859 783154068 782972107 783091202 782893448 782317886 781021194 779368744 776936569
1603.8 776936569 775623779 774445572 772323380 770066452 769098511 767847519 766251221 765964966 763748856
1612.5 763748856 761598587 759672623 758754883 755525513 743965225 747062302 748481598 747803802
1620.2 747803802 746373978 746334610 744608612 737915115 738195190 737718201 736900940 732552567 729574051
1628.9G29574051Q45718o54068k33001r78470N90286J244507q021088k416382O16837
1637.5G20568390r613P79190K79083n59234O13250L30506J685867J124573l603668
1646.2G21208344k079850o36368L539124K962189L159561K930603r800186o024170
1653.9G15259247Q744201N784531K973404J657639J069946J065216J514282J760788
1661.6G39829254n04303n70373L905105K877350J647186J991959J139374k686692J305237
1670.3G48934097K378922Q68606M058915L996276o68563r62449L966294L032837K022781
1679G67627716K07062j410599L775177M960022J10092q866653M689483N876694K584534
1687.7G79553528M84390J663361L56903J019439J715546J519013K971725Q31986o743241
$$ plain form
1628.9 729574051 730419769 729765701 729532700 728554230 729144516 730389023 722367935 719951553 720568390
1637.5 720568390 720558777 721337967 721617050 721057816 721671066 722001572 723687439 724812012 721208344
1646.2 721208344 719128494 718492126 722031250 724993439 728153000 731083603 721283417 715259247
1653.9 715259247 724003448 729787979 732761383 734419022 735488968 736554184 738068466 739829254
1661.6 739829254 739324951 738754578 742659683 745537033 747184219 749176178 750315552 747628860 748934097
1670.3 748934097 751313019 752181625 756240540 760236816 759568253 758605804 762572098 765604935 767627716
1679 767627716 767834778 766424179 770199356 775159378 775269470 766402817 771092300 776968994 779553528
1687.7 779553528 780037918 781701279 782058182 783077621 784793167 786312180 789283905 790115891 783372650
1696.4G83372650M188004N304031N155029k949752j0333405O960220M634934J156006
1704.1G97487717q02689K31247p2937L029938L210754L45001n80215R90982R43451
1712.8H04783249j00861j941375J89209M028396O1112n887528N406037M004058J518021
1721.4H12060318K33765o46210k84805J269760J228943N71289J299896J279831j490784
1730.1H15522003J99127K949067Q36410n552750m924545N347748L794861J585541K326812
1738.8H22084274j802826j358032L921585P87125k998734m4708K579422O35223K77634
1747.5H24080963j75857j41602L274612j493988r71374K802963P90405P15714J03149
1756.2H28984985k615966N98449K010422J478577J306991k621841o8131K112580K37503
$$ plain form
1696.4 783372650 787560654 792864685 798019714 795069962 784736557 791696777 796331711 797487717
1704.1 797487717 796685028 796916275 796843338 799873276 803084030 803429031 802848816 803839798 804783249
1712.8 804783249 804682388 802741013 802930222 806958618 807019730 801132202 806538239 810542297 812060318
1721.4 812060318 812294083 811647873 811363068 812632828 813861771 814433060 815732956 817012787 815522003
1730.1 815522003 815721130 818670197 819506607 813953857 809029312 814377060 818171921 819757462 822084274
1738.8 822084274 820281448 818923416 822845001 823632126 820633392 820588684 823168106 823803329 824080963
1747.5 824080963 823905106 823763504 827038116 825544128 824572754 827375717 828166122 828881836 828984985
1756.2 828984985 826369019 826967468 828977890 830456467 831763458 829141617 829073486 831186066 831423569
1764.8H31423569K29263M21448m03366k245255K744599L452606j100922l486023o62384
1773.5H30373535L910828N79986k287445J020737N57175J146850n2795r07211J376190
1782.2H35717850J742172Q28323j670913q21839N10483j90506L18298J164399M6463
1790.9H37644730l94516k345200O14929L437195l36914j344299J148605Q51669j284103
1799.5H37992096j056290K108002L20129Q41523J290817j57318L40347m56696j083908
1808.2H40138702K36817O29196j173325M91791J681976P85599O40793j75095j7166
1816.9H43239288r87777m46473L35541p6675P46307J62659J494980P58209k957993
1825.6H42268066O03028J893768M74396k253723l864365J715546K419128O51245Q29697
$$ plain form
1764.8 831423569 831652832 832074280 831670914 829425659 832170258 835622864 834521942 831035919 830373535
1773.5 830373535 834284363 834864349 832576904 833597641 834154816 835301666 835248871 834341660 835717850
1782.2 835717850 837460022 838288345 836617432 835795593 836306076 836115570 836433868 837598267 837644730
1790.9 837644730 837250214 834905014 835519943 838957138 838620224 837275925 838424530 839276199 837992096
1799.5 837992096 836935806 839043808 839363937 840205460 841496277 841338959 841679306 841222610 840138702
1808.2 840138702 840375519 841004715 839831390 840323181 842005157 842790756 843431549 843256454 843239288
1816.9 843239288 842251511 841805038 842140579 842063904 842810211 842972870 844467850 845226059 842268066
1825.6 842268066 842871094 844764862 845239258 842985535 839121170 840836716 843255844 843907089 844736786
1834.3H44736786J108704L31497o14777n20630J87302o75125O4773J51444R24606n11627
1843.9H45182953m455032L302307K394027q34579n61905J36795j30005o06232K31247
1852.6H44659576J25733M93698N09338L41187M86221j93176J98669l55758r83200q19703
1862.2H44462585J67618M17557M24118Q88977r9335K93808j249160j748352P96585
1870.9H44354401O93206J85700J07498O45828L16391M92325M80194M02298K32010o46591
1880.6H47263260k78702p11975l13644k21024o6147R59397Q02078J349945o57196k314301
1890.2H45811691R58634Q35952o55517n12009j053009m06647J799088J174622O03256
1898.9H48556061N07812m425m67758q19397k60239o41021j18332L18832K72217O91376
$$ plain form
1834.3 844736786 845845490 846176987 845562210 845041580 845228882 844553757 844618530 844769974 845694580 845182953
1843.9 845182953 840727921 844030228 846424255 845589676 845027771 845164566 845034561 844428329 844659576
1852.6 844659576 844785309 845279007 845788345 846129532 846615753 846422577 846621246 846265488 845282288 844462585
1862.2 844462585 844630203 845047760 845471878 846360855 846261520 846555328 845306168 843557816 844354401
1870.9 844354401 845047607 845233307 845340805 845986633 846303024 846795349 847275543 847677841 847909851 847263260
1880.6 847263260 846984558 846272583 845958939 845737915 845671768 846631165 847433243 848783188 848125992 845811691
1890.2 845811691 846770325 847606277 846950760 846438751 845385742 844979095 846778183 847952805 848556061
1898.9 848556061 849063873 849059448 848591690 847772293 847512054 846871033 846752701 847071533 847343750 848035126
1908.5H48035126J06659j64109L20511O74057p18689r30404l94287K40554P98645j775055
1918.2H46193008K27890K009583R78088K96250j812744j334153M67682K68784j71585
1926.8H47122803J13373J21078M07867Q02460M32129J31149n59005k40326m46778q17947
1936.5H47066803m47083j55105O79626Q19779J186371o44684j858063Q75015K91672
1945.2H47814331n87540n11627p2937O97251P86819M18091J13907K13241K1897l06473
1954.8H48586960n34821k09579k90070l22265L61633L99246M66461M48456L81546J23367
1964.5H49410934j51443l34091q28934n38177M3411K22854L65601Q71735L94897j54953
1974.1H49301834R2468j62048k74582o73523n15060M5776K14920L92227M65927Q01545
$$ plain form
1908.5 848035126 848141785 847977676 848298187 848972244 848253555 847323151 846928864 847169418 847968063 846193008
1918.2 846193008 846420898 848430481 849408569 849704819 847892075 846557922 847025604 847294388 847122803
1926.8 847122803 847236176 847357254 847765121 848567581 848999710 849130859 848571854 848331528 847884750 847066803
1936.5 847066803 846619720 846464615 847144241 847964020 849150391 848505707 846647644 847522659 847814331
1945.2 847814331 847226791 846715164 846642227 847339478 848126297 848544388 848658295 848871536 848893433 848586960
1954.8 848586960 848052139 847842560 847552490 847230225 847591858 847991104 848457565 848906021 849287567 849410934
1964.5 849410934 849259491 848925400 848096466 847558289 847601700 847824554 848190155 849061890 849456787 849301834
1974.1 849301834 849394302 849232254 848957672 848284149 847769089 847814865 848029785 848422012 848887939 849689484
1983.7H49689484O09359J82648n83801r80606q46787m69055M66156m51584j078720
1992.4H46537094R83582J265487M62113L42560j35651r70841j083145m93927M2191
2001.1H46949463P4539N67780P58972L95431R7046j09024p858n01099n94406q01163
2010.7H46829681p28912K81067N25665P08924P03735o1646j090850m17176j6556o96105
2020.4H46037827n59464o05240K64206N38330J79901M13513M731M6615l79104p56302
2030H45185013o53305n26810k47726Q773M95758M82331L01819l7766j49231m55398
2039.7H44403458q97141o89392n10330l35465j17187N05829M58450L37296M98046J61438
2049.3H43815002l7384o19812m88281n25207n36194K07062N02700P58667M87900M53034
$$ plain form
1983.7 849689484 850298843 850481491 849897690 848917084 848070297 847601242 848067398 847615814 846537094
1992.4 846537094 847520676 848786163 849248276 849590836 849455185 848484344 847401199 846907272 846949463
2001.1 846949463 847024002 847591782 848350754 848746185 848843231 848734207 848726349 848225250 847630844 846829681
2010.7 846829681 846100769 846381836 846907501 847616425 848320160 848258514 847167664 846750488 846733932 846037827
2020.4 846037827 845478363 844873123 845137329 845675659 845855560 846269073 846273804 846320419 845941315 845185013
2030 845185013 844531708 844004898 843757172 843765945 844261703 844744034 845045853 845008087 844858856 844403458
2039.7 844403458 843506317 842816925 842306595 841971130 841853943 842359772 842818222 843155518 843653564 843815002
2049.3 843815002 843777618 843157806 842669525 842144318 841608124 841815186 842317886 843076553 843564453 844017487
2059H44017487J62277o68411j156464q70819j19171l50724J59836J234207J102906
2067.6H43511124M26788L02429k05459q85239o48270o80618o3553m2953p7057P22961
2077.3H42360153M86298P84073P12661k46124p07245n37796n40466m56848J69678K33917
2086.9H42258301O88629P87582J71433k94190k36511K26517k11105p54090q60519k55966
2096.6H41520081M64630P46002Q48999P02667L03192m27246m76227n72357m03061K31629
2106.2H42938309L66821R6512o256P57370M50515j13449l9520l27225n53894l65982
2115.9H43203201l7536k02408L88031N53512O81992O99997k12174m7988m83246o75354
2125.5H43868027n53437m09469j68152l89175Q07342R34219L18375K68860m959l77426
$$ plain form
2059 844017487 844179764 843511353 842354889 841484070 841364899 841014175 841174011 842408218 843511124
2067.6 843511124 843937912 844240341 844034882 843149643 842501373 841820755 841757202 841714249 841637192 842360153
2077.3 842360153 842846451 843630524 844343185 844097061 843389816 842852020 842311554 841854706 842024384 842258301
2086.9 842258301 842946930 843734512 843905945 843611755 843375244 843601761 843390656 842636566 841776047 841520081
2096.6 841520081 841984711 842730713 843579712 844282379 844585571 844158325 843682098 843109741 842706680 842938309
2106.2 842938309 843305130 843401642 843395386 844152756 844603271 844489822 844450302 844123077 843569183 843203201
2115.9 843203201 843165665 842963257 843351288 843904800 844586792 845286789 845074615 845026627 844543381 843868027
2125.5 843868027 843314590 842905121 842736969 842347794 843155136 844089355 844407730 844676590 844671631 844294205
2135.1H44294205o97480k95562m51889R079N40695M02450P12815L56903k64130m25873
2144.8H44181213j50985l13187n12848l17917L61939P38373J09558M49295P03506J27869
2154.4H45376816l48435l48510n15900r44061k83661M41208O22329L12424O72684O99768
2164.1H45684662k34528j62735m04587m61578k39105k7542M80118O18972O22712K37426
2173.7H46113815J85013J06049J81427J58767l70483l85666l51715J55258M33960N05982
2183.4H46732407P96508L88413K35443L38821k35977q07800m82330l0213J40152L09372
2193H47384796N69229P45545P08236L73688k01340m05654n68314q0566K30331j18027
2202.6H48637924J97983M04358O18973N02548J32370K5482j45569m01993m43420O1569
$$ plain form
2135.1 844294205 843596725 843301163 842849274 842858353 843399048 843801498 844514313 844871216 844607086 844181213
2144.8 844181213 844030228 843717041 843204193 842886276 843248215 843986588 844096146 844545441 845248947 845376816
2154.4 845376816 845028381 844679871 844163971 843219910 842936249 843377457 843999786 844312210 844984894 845684662
2164.1 845684662 845450134 845287399 844882812 844421234 844182129 844154587 844634705 845253677 845876389 846113815
2173.7 846113815 846298828 846404877 846586304 846745071 846374588 845988922 845637207 845792465 846226425 846732407
2183.4 846732407 847528915 847917328 848152771 848491592 848255615 847447815 846965485 846935272 847075424 847384796
2193 847384796 847954025 848699570 849407806 849781494 849580154 849174500 848606186 848525620 848755951 848637924
2202.6 848637924 848835907 849240265 849859238 850361786 850494156 850519638 850374069 849972076 849528656 849590225
2212.3H49590225J78757L79562N12619N50537J94321r3231M32663k34146l41110j83716
2221.9H50986481k05460K45514K12860Q47092N73883J74713Q4000k84272j55029m20074
2231.6H52059708l05176k96478J1520M26178M77447O95191L45611K23847o6986m22669
2241.2H53148193m60968n16662r8572L90778L33786K58483L23258J11084J99661j43356
2250.9H53545685m52881k09656l97568l04718J66932M26864L44849M09164M41971N14679
2260.5H54485321P0725n63431n43442q65631k33612L79257N26581M62951P1640N44434
2270.2H54334793J55335k22931j96762k44294k89611j29090L41797r5901L56445O83136
2279.8H54692917N39703M32739j98898m07791m34036k29874p76520l23639M18015M51202
$$ plain form
2212.3 849590225 849768982 850148544 850661163 851211700 851406021 851312790 851745453 851511307 851170197 850986481
2221.9 850986481 850781021 851026535 851239395 852086487 852660370 852835083 852919083 852634811 852479782 852059708
2231.6 852059708 851754532 851458054 851469574 851895752 852373199 853068390 853414001 853637848 853570862 853148193
2241.2 853148193 852687225 852170563 852071991 852462769 852796555 853055038 853378296 853489380 853689041 853545685
2250.9 853545685 853092804 852883148 852485580 852180862 852347794 852774658 853119507 853528671 853970642 854485321
2260.5 854485321 854556046 853992615 853449173 852583542 852349930 852729187 853255768 853718719 853790359 854334793
2270.2 854334793 854490128 854267197 854070435 853826141 853536530 853407440 853749237 853653336 854009781 854692917
2279.8 854692917 855232620 855665359 855466461 855058670 854624634 854394760 853618240 853294601 853712616 854163818
2289.4H54163818N04074J98060N24826n86777q51669m79660n86319M8522j20162K86254
2299.1H53100967j36108M46472N60532l41187R5368p31430m60739r26743j065750k6550
2308.7H50514832K46048N40542k49634L50418m18090o72760K12249m25872n6916q45413
2318.4H49195404p42645n25360n40619M35333n8060o18362k39792j23291j341934n41382
2328H44899292j42517j006241q31604j59912J107864R94797R95483j180191j902542
2336.7H42774429M43116N73501l99628j420059n38177l96347Q90426J184311k78473
2345.4H42833099Q62503Q05207J549377J642609n41153k108841j794281j072846P9117
2354.1H42254791p51190k015839o7749n39398j470794j400528p31507R39942M60052
$$ plain form
2289.4 854163818 854667892 854865952 855390778 854804001 853952332 853472672 852886353 852934875 852814713 853100967
2299.1 853100967 852964859 853411331 853971863 853630676 853726044 852994614 852533875 851607132 850541382 850514832
2308.7 850514832 850760880 851301422 851051788 851402206 850984116 850311356 850523605 850097733 850040817 849195404
2318.4 849195404 848452759 847927399 847386780 847822113 847764053 847145691 846905899 846782608 845440674 844899292
2328 844899292 844756775 843750534 842918930 842759018 843866882 844861679 845857162 844676971 842774429
2336.7 842774429 843217545 843791046 843391418 841971359 841433182 841036835 841927261 843111572 842833099
2345.4 842833099 843695602 844500809 846050186 847692795 847151642 845042801 843248520 842175674 842254791
2354.1 842254791 841503601 839487762 839420013 838880615 837409821 836009293 835277786 836217728 836677780
2362.7H36677780J458817P65915k70539Q56705J022949L05786q4533J24359L40271
2371.4H41197510J788482J411667Q54645J686325Q85697j9150L75290L97186k060R42001
2381.1H49517593Q59681N65795P82929M05579R62066L77121k73132j52207m56695l45764
2390.7H52242966k88163k08129k17972L16849M94384M43802M62189m36325p02210m71115
2400.3H51636276j13373l86581l85132N17731N02853J17798k14844j92566q4991k22549
2410H51174622l63923l19213o41022o71158L91235N89142O02112K24075l41720j97830
2419.6H50446320l03727j29776n73959p16553k98004j00326K05307J4877J5030M2496
2429.3H48601685K975k35214o35376o27518l79104j05057J96991M29916J28021O8207
$$ plain form
2362.7 836677780 838136597 838902512 838631973 839488678 840511627 840817413 840732880 840857239 841197510
2371.4 841197510 842985992 844397659 845252304 846938629 847824326 847805176 848180466 848577652 848575592 849517593
2381.1 849517593 850377274 850943069 851725998 852131577 853093643 853470764 853197632 853045425 852588730 852242966
2390.7 852242966 851954803 851746674 851528702 851845551 852339935 852783737 853245926 852809601 852107391 851636276
2400.3 851636276 851522903 851136322 850751190 851268921 851771774 851889572 851674728 851482162 851397171 851174622
2410 851174622 850810699 850491486 849850464 849179306 849570541 850159683 850761795 850985870 850644150 850446320
2419.6 850446320 850142593 850012817 849438858 848722305 848424301 848323975 848529282 848544159 848559189 848601685
2429.3 848601685 848604660 848369446 847734070 847106552 846727448 846622391 846819382 847249298 847377319 847445526
2438.9H47445526n8136j92871k82288n91125m10004m64706k62909J0986O1112J02615
2448.6H45358200K08969M9515o40335l32565k95639l83072k37732k50702K51236K54287
2458.2H43982162L54081p6065n11780k38190k23617l25242o26983n03693k86865K38342
2467.8H41782150L94211K08283K76794k92053n68619q15353n22385M7684q6441q316
2477.5H40415955K40860K57034j32675k30332j74484k10419o21643o45141O4010p7820
2487.1H38885345J18561O75431K74353k77787K7848r8572o32324m53949o37970m4480
2496.8H37836456L82157k442K37885L80325K77100j69373k39181l38745m20685j95160
2506.4H37748337k35901l55148l78952M17709K84805j52359J66702j38397l13186k49787
$$ plain form
2438.9 847445526 847387390 847194519 846912231 846321106 845911102 845446396 845183487 845194473 845255585 845358200
2448.6 845358200 845567169 845616684 844976349 844643784 844348145 843965073 843727341 843476639 843727875 843982162
2458.2 843982162 844336243 844260178 843748398 843510208 843286591 842961349 842334366 841830673 841543808 841782150
2467.8 841782150 842176361 842384644 842661438 842369385 841800766 840985413 840463028 840510712 840424271 840415955
2477.5 840415955 840656815 840913849 840781174 840550842 840376358 840165939 839544296 838899155 838963165 838885345
2487.1 838885345 839003906 839679337 839953690 839675903 839703751 839605179 838972855 838518906 837880936 837836456
2496.8 837836456 838218613 838216171 838454056 838834381 839111481 838942108 838702927 838364182 837943497 837748337
2506.4 837748337 837512436 837157288 836778336 837196045 837480850 837328491 837495193 837356796 837043610 836793823
2516.1H36793823k3727k67029m49600o6834L1357J50452K00577J19171k22855l56216
2525.7H35909119m98047o24466j98212j25885o7062M55322L54691j75171k2965j41296
2535.4H34866028j25199j77459q59452m89654j65024M4403M71649J37101o18973n63202
2545H32520218J37253k71454l67813j55258n73655m55703J72195K81448j12304k18582
2554.6H30956345o40107k82058K25525q8730k56348n58777j34964K00348J31226J08795
2564.3H29661255L2806k00271m64402l35159o74362k19040L7689q9798L00751j21994
2573.9H27927475p5760o5994k76566l97644m37774k19117r9105J59530j72424k82746
2583.6H26059875l85284j82266J39541j58386q7738m62723j85699j45950n51911J68534
$$ plain form
2516.1 836793823 836770096 836503067 836053467 835986633 836017990 836168442 836369019 836488190 836265335 835909119
2525.7 835909119 835411072 834786606 834588394 834462509 834395447 834850769 835205460 835030289 835007324 834866028
2535.4 834866028 834740829 834563370 833703918 833214264 833049240 833093643 833565292 833702393 833083420 832520218
2545 832520218 832657471 832386017 832018204 831862946 831289291 830833588 831005783 831287231 831174927 830956345
2554.6 830956345 830316238 830034180 830259705 830170975 829914627 829355850 829220886 829421234 829552460 829661255
2564.3 829661255 829694061 829493790 829029388 828694229 828019867 827800827 827838516 827748718 828049469 827927475
2573.9 827927475 827851715 827785721 827509155 827111511 826673737 826454620 826355515 826515045 826342621 826059875
2583.6 826059875 825674591 825492325 825631866 825473480 825385742 824923019 824737320 824591370 824039459 824207993
2593.2H24207993J34811j21994J82495J50681k27204l79257m54178l05557P7438O2943
2602.9H23328171l6392L1814K97928j64337m65927q4687j61132l95279n25360l82004
2612.5H21442795n22690r2926N77240K67868l31650m59747J26495k80075p40280n61752
2622.1H19425278m39759k14309l95203k15073k62603l39737j23062j13526m07715q77227
2631.8H16037064l00827J30004k65960m52881k25372k08817j31760p9193k95105j14288
2641.4H14092865r67560j083603k40402m69742k08816J14135j24588m64859j94015
2650.1H10453415j55258n49011l65754m93011n00107k94113j40000l79028l91846j21307
2659.8H07063980l17688k36587m95072l10516j01090l70407l44772n82886l61786j983
$$ plain form
2593.2 824207993 824342804 824220810 824403305 824553986 824326782 823947525 823493347 823187790 823265228 823328171
2602.9 823328171 823291779 823323593 823621521 823457184 822991257 822906570 822745438 822350159 821824799 821442795
2612.5 821442795 820920105 820827179 821404419 821672287 821340637 820880890 821007385 820727310 819987030 819425278
2622.1 819425278 818985519 818771210 818376007 818160934 817898331 817558594 817435532 817322006 816914291 816037064
2631.8 816037064 815736237 815866241 815600281 815147400 814922028 814713211 814581451 814502258 814207153 814092865
2641.4 814092865 813125305 812041702 811801300 811331558 811122742 811236877 811112289 810647430 810453415
2650.1 810453415 810298157 809749146 809383392 808890381 808390274 808096161 807956161 807577133 807185287 807063980
2659.8 807063980 806746292 806509705 806014633 805704117 805603027 805232620 804887848 804304962 803943176 803941193
2669.4H03941193L20587N8212p89261q37250l76129J11618O4240l71018m46853j73264
2679H01502075k49939m86526o42700j84937L96194n28259r60235l45459Q2016j79291
2688.7G98402939l88489J85928O1951o8817m06494o52313l38898l67737l21350m05045
2698.3G95701675J48011K39486l52172n71824n88150j95541k86942k55737n81207q77533
2708G92380066p2479O0577m62036m96903n9738j39999m31290m64859m15115k60544
2717.6G89637680k96173k90604j8997J15357l55759j46942n265n38635o78329p75452
2727.3G86646881M3793K01034n20706n74646n07278j94092l20969l29055j10093p5683
2736.9G84259186k07443m79508j13373q9645j62659K9221m04358p78504k61764L54385
$$ plain form
2669.4 803941193 804261780 804319992 803530731 802693481 802317352 802428970 802493210 802122192 801675339 801502075
2679 801502075 801252136 800765610 800122910 799937973 800334167 799805908 798845673 798500214 798582230 798402939
2688.7 798402939 798014450 798200378 798262329 798193512 797787018 797134705 796795807 796428070 796106720 795701675
2698.3 795701675 795849686 796089172 795737000 795165176 794577026 794381485 794094543 793838806 793257599 792380066
2708 792380066 792307587 792368164 791906128 791409225 791349487 791209488 790778198 790313339 789898224 789637680
2717.6 789637680 789341507 789050903 789031906 789147263 788791504 788644562 788639297 788100662 787422333 786646881
2727.3 786646881 786690674 786891708 786371002 785796356 785289078 785094986 784774017 784444962 784334869 784259186
2736.9 784259186 784051743 783572235 783458862 783369217 783206558 783235779 782831421 782052917 781791153 782145538
2746.5G82145538L9749l76434k44675k86712n40543m89273l34091P4005k5330m92477
2756.2G79469757j45721K9983p3547n51300n09262Q8882j17493K9450N2566k36969
2765.8G78036346m10156l25317r461k48947j91574L7766k4949k28729l83987o44379
2775.5G75606613o79321o9046M349j57700K8839J74408m29153p37229J3733j26266
2785.1G73629227q54493q12530j63727k08969l94440j82418n76325p17773m94538K2049
2794.8G69246063J98136j30539l71704r44291q55255l35388l96957o24466o57959p48139
2804.4G64379501m64477j62125m26407m09851o01043p58286p87506p58896p06634j014328
2814G58289948p38450n81131m00619k90833p71331r47800p44782m51507o81763o83822
$$ plain form
2746.5 782145538 782185287 781808853 781564178 781277466 780736923 780247650 779913559 779987564 779962234 779469757
2756.2 779469757 779324036 779354019 779280472 778729172 778219910 778308792 778191299 778220749 778273315 778036346
2765.8 778036346 777626190 777300873 777291412 777042465 776850891 776888657 776863708 776634979 776250992 775606613
2775.5 775606613 774927292 774858246 774862595 774704895 774733734 774908142 774478989 773741760 773755493 773629227
2785.1 773629227 772774734 771962204 771798477 771589508 771195068 771012650 770436325 769718552 769224014 769246063
2794.8 769246063 769444199 769313660 768941956 767997665 767142410 766807022 766410065 765785599 765127640 764379501
2804.4 764379501 763915024 763752899 763326492 762916641 762315598 761557312 760769806 760010910 759304276 758289948
2814 758289948 757551498 756970367 756569748 756278915 755507584 754559784 753815002 753363495 752681732 751997910
2823.7G51997910o66123q76160j114730j228714m93164o83365r52683l14712o47202
2832.4G45021057j196899o55136p14875j463241o09360l50494j271210j636353j605148
2841.1G35518341j022110j103973j318360j056823r17511r87397j345062j730804j863556
2849.7G24172745q60672n37796j087036o51169q07877j478653j222763q05969j072846
2858.4G15647964j382827j421280j093064q34884j362610j391449j066818j657715
2866.1G05437317k104111j761398j683121j855774j916275j933288j926194k325821
2873.8F89931335k579116k161332j595840j830902k335205j909485j332626j641159
2881.6F74545670k371674j814117r28345j014404j202012j313934j192322r11483k15912
$$ plain form
2823.7 751997910 751331787 750455627 749340897 748112183 747619019 746935654 745982971 745668259 745021057
2832.4 745021057 743824158 743169022 742454147 740990906 740381546 740031052 738759842 737123489 735518341
2841.1 735518341 734496231 733392258 732073898 731017075 730099564 729112167 727767105 726036301 724172745
2849.7 724172745 723312073 722774277 721687241 721036072 720228195 718749542 717526779 716720810 715647964
2858.4 715647964 714265137 712843857 711750793 710915909 709553299 708161850 707095032 705437317
2866.1 705437317 703333206 701571808 699888687 698032913 696116638 694183350 692257156 689931335
2873.8 689931335 687352219 685190887 683595047 681764145 679428940 677519455 676186829 674545670
2881.6 674545670 672173996 670359879 669431534 668417130 667215118 665901184 664708862 663797379 663581467
2890.2F63581467n43900r41696K93503K54669m20227o74133o57730k04697j68839k91671
2899.9F60226746m51584l53318l64303l57361p31049p14721j62964p68585o28128o28815
2909.5F55065918j228943j117554j212539j235962j181107j094055j468277j584320
2917.2F44943161j070175j376496k201156j781845q75511j357384j262169r31320q24661
2925.9F33262444l87574m10003k54441k43072J67198p8316m37622L65334R09958J074180
2935.6F33968086O66962J274834K037124J589012J511345K016297K414169K089996
2943.3F47567825J729355J693878K011414K148132K328263K353363J973877K583236
2951F64389343K867813K508698J963577J580582J657409K049714K768173K455368K103424
$$ plain form
2890.2 663581467 663037567 662095871 662389374 662644043 662223816 661549683 660891953 660687256 660518417 660226746
2899.9 660226746 659775162 659421844 659057541 658700180 657969131 657254410 657091446 656322861 655694733 655065918
2909.5 655065918 653836975 652719421 651506882 650270920 649089813 647995758 646527481 644943161
2917.2 644943161 643872986 642496490 640295334 638513489 637637978 636280594 635018425 634087105 633262444
2925.9 633262444 632874870 632464867 632210426 631967354 632134552 632056236 631618614 631983948 632893906 633968086
2935.6 633968086 634635048 635909882 637947006 639536018 641047363 643063660 645477829 647567825
2943.3 647567825 649297180 650991058 653002472 655150604 657478867 659832230 661806107 664389343
2951 664389343 667257156 669765854 671729431 673310013 674967422 677017136 679785309 682240677 684344101
2959.7F84344101J955032J986008K297134J795578J467972J525498J779327J957779
2967.4F99108429J908188J760635J125107R21555J773223J958619J554870J499787
2975.1G11610413R60388J155090J509705J561813J656342R85489J019134J245575J275940
2983.8G22979889J229477J032104P46155M11453Q51517R99832J220017R32541P05490
2992.5G31108475J152496M24805K05383M70123N18570L23716J25274L38822J66015
3001.1G34833679K65885L66211M98962K72217l07465m84314n12924O3629K08893k27203
3010.8G34977570n67704o90155m04510n3253J20620k80456q10471q71429n95856r43451
3020.4G29880905q35113J9989l91617p65839p22275q18023o44760q19474p14416n33753
$$ plain form
2959.7 684344101 686299133 688285141 690582275 692377853 693845825 695371323 697150650 699108429
2967.4 699108429 701016617 702777252 703902359 704823914 706597137 708555756 710110626 711610413
2975.1 711610413 712570801 713725891 715235596 716797409 718453751 719439240 720458374 721703949 722979889
2983.8 722979889 724209366 725241470 725987625 726399078 727250595 728250427 729470444 730402985 731108475
2992.5 731108475 732260971 732685776 732891159 733361282 733879852 734203568 734328842 734667664 734833679
3001.1 734833679 735099564 735465775 735964737 736236954 735929489 735445175 734932251 734995880 735204773 734977570
3010.8 734977570 734409866 733719711 733315201 733261948 733382568 733102112 732291641 731420212 730824356 729880905
3020.4 729880905 729045792 729065781 728674164 727908325 727186050 726368027 725723267 724903793 724189377 723655624
3030.1G23655624j296615j381302m52881o02493j007233p62253n49087o23780r25140
3038.7G16054840r77859j047593j126709j149520j004334o27975n10712o78635j117019
3047.4G07814484j332550j300965j036148q77685j025925p06787p24869j308441j416092
3056.1F98085022r92661p11212o19888p77054j665268j988220j081162o25915q86917
3064.8F88736725q50983r62982j101608j034394j167144j401749j775513j223144m38004
3073.5F78781204q02536j134414r17588p05719q76388j381455j726761j420288j284408
3082.1F68531647j399994j222687p32803m68445j285706j110000p66526j334838j422577
3090.8F58788071j553727j165390j442031j415863o16990j048355j110077p54089o43082
$$ plain form
3030.1 723655624 722359009 720977707 720524826 719922333 718915100 718152847 717603760 716979980 716054840
3038.7 716054840 715076981 714029388 712902679 711753159 710748825 710120850 709610138 708931503 707814484
3047.4 707814484 706481934 705180969 704144821 703267136 702241211 701534424 700809555 699501114 698085022
3056.1 698085022 697092361 696381149 695761261 694984207 693318939 691330719 690249557 689623642 688736725
3064.8 688736725 687885742 686922760 685821152 684786758 683619614 682217865 680442352 679219208 678781204
3073.5 678781204 677978668 676844254 675926666 675220947 674344559 672963104 671236343 669816055 668531647
3082.1 668531647 667131653 665908966 665176163 664707718 663422012 662312012 661545486 660210648 658788071
3090.8 658788071 657234344 656068954 654626923 653211060 652594070 651545715 650435638 649681549 649038467
3099.5F49038467j427993j684494j103974j377334q78754o59485j276245j558609j169395
3108.2F37902184p53365j209488j294136j241341j278610j188927j064415r11827j281051
3116.9F27679024j268578q14171j077232j227646q39882j345253j547584q56858q80661
3125.5F17821159j493072j647225q31489m77944o98890q09288r75113j460686j629944
3134.2F07797508j107483j453590j198349n28717q97675j207847j233063o93054p26776
3142.9E98750954j276360j693878j716843j113434p25669p31850j126595n41572n75180
3151.6E89249573j572418j258393j001129p72324q32138j234474q42552q98323j329155
3160.3E79508667q10089n92232q23021o32858j015663j405983j564865j103096p75147
$$ plain form
3099.5 649038467 647610474 645925980 644822006 643444672 642565918 641906433 640630188 639071579 637902184
3108.2 637902184 637148819 635939331 634645195 633403854 632125244 630936317 629871902 628960075 627679024
3116.9 627679024 626410446 625596275 624519043 623291397 622451515 621106262 619558678 618701820 617821159
3125.5 617821159 616328087 614680862 613849373 613371429 612672539 611863251 610888138 609427452 607797508
3134.2 607797508 606690025 605236435 604038086 603509369 602611694 601403847 600170784 599477730 598750954
3142.9 598750954 597474594 595780716 594063873 592950439 592224770 591492920 590366325 589824753 589249573
3151.6 589249573 587677155 586418762 585417633 584645309 583813171 582578697 581736145 580837822 579508667
3160.3 579508667 578698578 578106346 577283325 576650467 575634804 574228821 572663956 571560860 570785713
3168.9E70785713j063766p89910j073303p98569p28454j133194q34694q56247p96623
3177.6E62710953j462975j302109n54466p09495j103516j141891p0610m25988j207046
3186.3E54732857j078339r82895o23512j221924j543884p41692j78680l22762p81898
3195E47257271j242485r34944p36618j035958o77185q09746m79850n22271q83483m24920
3204.6E39509811p81211r76525j273498r10340m35409p36199o85234p85484n20401
3213.3E32405510q38509o81686l01132n80559n46455j176987j204109q16803m88549
3222E25770721n1612j79787m94385q29964q48274n53589k66456p99332j089516o22367
3231.6E20035439l49694o12793q37211l45154o20041n10635r5749p02439j161918r60312
$$ plain form
3168.9 570785713 569721947 568932037 567858734 567060165 566331711 565198517 564363823 563507576 562710953
3177.6 562710953 561247978 559945869 559391403 558681908 557578392 556436501 556365891 555939903 554732857
3186.3 554732857 553654518 552671623 552048111 550826187 549282303 548540611 548361931 548039169 547257271
3195 547257271 546014786 545079842 544343224 543307266 542630081 541820335 541340485 540818214 539934731 539509811
3204.6 539509811 538728600 537752075 536478577 535568237 535132828 534396629 533711395 532925911 532405510
3213.3 532405510 531567001 530885315 530584183 530003624 529457169 528280182 527076073 526259270 525770721
3222 525770721 525719109 525539322 525044937 524214973 523366699 522813110 522546654 521747322 520657806 520035439
3231.6 520035439 519685745 519072952 518235741 517890587 517270546 516759911 516664162 515961723 514799805 513839493
3241.3E13839493j35803K75306k8686j126671j299629m69857k18010j95312o26793
3249.9E10014038l37105k55584p87125r85527m45213L05671k69737l87535l23868n59921
3259.6E05968094n25513k37541j53923o94313n62401n92308l39470k23160m89463j71967
3269.2E01978035k35329p50999r89418K71988N722q83141l99132o04362M9820M8065
3278.9D98491249j05286k07595o82221k36397o48880n63964m74778q72078k39906L8834
3288.5D94498978k30561R995P5722o23932p28340p73621n36690r7465o72913o29005
3298.2D90292168K23007L50075n28717p32346q9798q736j84021l47442p06711p19833
3307.8D87547646m95797m73060n6877l29056o50978n78614p48901j54762j90430l83873
$$ plain form
3241.3 513839493 513703690 513978996 513950310 512823639 511524010 511054153 510836143 510640831 510014038
3249.9 510014038 509676933 509421349 508634224 507648697 507203484 507509155 507239418 506851883 506528015 505968094
3259.6 505968094 505442581 505205040 505051117 504356804 503794403 503202095 502862625 502639465 502150002 501978035
3269.2 501978035 501742706 500991707 500002289 500274277 500279999 499396858 498997726 498393364 498443184 498491249
3278.9 498491249 498385963 498178368 497496147 497259750 496610870 496046906 495572128 494700050 494460144 494498978
3288.5 494498978 494268417 494278412 494354134 493730202 493001862 492228241 491691551 491594086 490921173 490292168
3298.2 490292168 490515175 490865250 490336533 489604187 489514389 489505653 489321632 488974190 488267479 487547646
3307.8 487547646 487051849 486578789 486521912 486192856 485541878 484963264 484214363 484059601 483869171 483485298
3317.4D83485298n99327n78079p7095m98352l56674o73218q21419k39830n26886o62498
3327.1D78451920m96293l2005k50130m44221n20859r39255m41513m02259n04723o46248
3336.7D73774414q09975K1401r7962p00149l35007k98881n42908m29764m56467j020736
3346.4D69103966j263466m86031n12619o66771j72081k79045l83835n32569k34604
3355.1D64572945m31672r83161p43180o46209l09983o88209j094246p13120p7476K29873
3364.7D59115562m67224r47189q12798j54533q80203j178665o3630k11334k11982p64657
3374.3D53423347p79876k41738o03942k10915k82631k73514k98385q83675m99649k98500
3384D49050522q95004n91240k4758l46832k55051j95427j61209K0752l64036p07512
$$ plain form
3317.4 483485298 482885971 482307892 482230797 481732445 481375771 480702553 479881134 479641304 479114418 478451920
3327.1 478451920 477955627 477923622 477673492 477229271 476708412 475769157 475327644 474925385 474420662 473774414
3336.7 473774414 472964439 472985840 472887878 472187729 471852722 471553841 471010933 470581169 470124702 469103966
3346.4 469103966 467840500 467354469 466841850 466175079 466002998 465723953 465340118 464807549 464572945
3355.1 464572945 464141273 463158112 462414932 461768723 461458740 460770531 459676285 458963165 458885689 459115562
3364.7 459115562 458648338 457701149 456888351 456733818 455853615 454674950 454611320 454399986 454188004 453423347
3374.3 453423347 452643471 452401733 451797791 451586876 451304245 451030731 450732346 449848671 449349022 449050522
3384 449050522 448155518 447564278 447539520 447192688 446937637 446742210 446581001 446601753 446237717 445530205
3393.6D45530205k79083J71165q34351j143684n074L43247J1749l76434k15759j15548
3403.3D43086433m96215l83492J68724l53393p77207l39241k3270J90125l06587k28234
3412.9D40537643j25236k39678K11945J49994p8697n13649j63002K1057l67737j96495
3422.6D39236145l01552l32527j97983K01798j57280k30408L91045J31607k00653k9030
3432.2D38511162N09682J73683M3754P8812k95906n1193J37291K2163J90086Q13980
3441.8D40133514k80075n55496J00670J19896Q47778j92528K62261M68330p3509O34117
3451.5D41464958K4262L19976K05460K41470N63050K11143L01552j15471M35867L45917
3461.1D43998184K09999J99242K70691R65652Q0796j76354R2278M37545M97742M17900
$$ plain form
3393.6 445530205 445251122 445422287 444587936 443444252 443439178 443782425 443794174 443417740 443201981 443086433
3403.3 443086433 442590218 442206726 442375450 442022057 441244850 440905609 440882339 441072464 440765877 440537643
3412.9 440537643 440412407 440172729 440384674 440534668 440455971 439942322 439779320 439800377 439432640 439236145
3422.6 439236145 438934593 438602066 438404083 438605881 438448601 438218193 438609238 438740845 438540192 438511162
3432.2 438511162 439020844 439194527 439238281 439317093 439021187 438969994 439107285 439129448 439319534 440133514
3441.8 440133514 439853439 439297943 439398613 439518509 440366287 440173759 440436020 440904350 440830841 441464958
3451.5 441464958 441489220 441809196 442014656 442256126 442819176 443030319 443331871 443216400 443652267 443998184
3461.1 443998184 444208183 444407425 444678116 445643768 445724564 445548210 445640488 446078033 446575775 446993675
3470.8D46993675R23882M25491M03175L12005j60981L68538P89376L70330J71051O12069
3480.4D51208611Q77304K67n97573J328926J069489k14920O09169J3504J35460J209907
3490.1D55640144P56684q6747L61329P71980J09787N3444K54974N26390N25666P94448
3499.7D59708099J019593O31179Q4038l30086N31960R02329Q78982O57654O79321j18599
3509.4D64644470m30527J606141Q54911L11242P87887N66864Q36792J64833K95639
3518D69638252P94602R01146J017685J281509N81932q78525K28157J123009J017723
3526.7D75705490K57301K79656J124153J279793M07066J7243J098709M26674R17549
3535.4D81513634Q84704m62761P11556N76820J011582J375999Q61664N17769O88019
$$ plain form
3470.8 446993675 447917557 448343048 448746223 449058228 448897247 449265785 450055161 450425491 450596542 451208611
3480.4 451208611 452085915 452086182 451488609 452817535 453887024 453672104 454281273 454294777 454430237 455640144
3490.1 455640144 456396828 456310081 456671410 457443390 457553177 457606621 457861595 458387985 458913651 459708099
3499.7 459708099 460727692 461358871 461442909 461112823 461644783 462547112 463426094 464083748 464763069 464644470
3509.4 464644470 464213943 465820084 466674995 466986237 467774124 468340988 469177780 469342613 469638252
3518 469638252 470432854 471334000 472351685 473633194 474215126 473336601 473564758 474687767 475705490
3526.7 475705490 475962791 476242447 477366600 478646393 479053459 479070702 480169411 480596085 481513634
3535.4 481513634 482398338 481935577 482647133 483223953 484235535 485611534 486473198 486990967 487678986
3544.1D87678986M92668J6441J218109M94156J169624J034165J392898J924782q03528
3552.7D94618301J256905J566734J147881J137733L24135J632996Q68835M17557L17192
3561.4E03288269K239151J234970n8136L404808j158867j529045R01489J452713L841439
3570.1E13616791J362648J410293J596794J449204J064110J372757J968994r308J803932
3578.8E25636215J075783L97987K103501K237282J731338R34982M307709J885338j840820
3587.5E38469315Q19625j475410L158531L607521K866631Q49418M31595L182717j636353
3596.1E50273590K235375L583450P77511L029137O46782J100769K087669J578179K624016
3604.8E67936478L502693K255821j428261L060341j041260O79360P909012r43604j903267
$$ plain form
3544.1 487678986 488171654 488188095 489406204 489900360 491069984 492104149 493497047 495421829 494618301
3552.7 494618301 495875206 497441940 498589821 499727554 500051689 501684685 502553520 502971077 503288269
3561.4 503288269 505527420 506762390 506704254 510109062 508950195 507421150 508322639 509775352 513616791
3570.1 513616791 514979439 516389732 517986526 519435730 520499840 521872597 523841591 523832283 525636215
3578.8 525636215 526711998 527109985 529213486 531450768 533182106 534117088 538424797 540310135 538469315
3587.5 538469315 539288940 537813530 540972061 544579582 547446213 548295631 548727226 551909943 550273590
3596.1 550273590 552508965 556092415 556869926 559899063 560545845 561646614 563734283 565312462 567936478
3604.8 567936478 571439171 573694992 572266731 575327072 574285812 574965172 582874184 581930580 580027313
3613.5E80027313M484062m92019M615631L843155r69925J646614j104050J971817M050179
3622.2E98072777K324943K478257K684021J467666K005654O314506l151398j1369285
3629.9F00827141O358032N851097N708008Q61092j873780L039322L203354K354469
3637.6F26328735O60515J091271K268562K595062R02024K13966K385292L672447N873032
3646.3F45990906k090607m030151M754104k415390l537903J211052P426644N298309
3654F52606964L885422L196564r121857K953186N429840J114655J420059R68246K258148
3662.7F64711227P94907J761398J878891O82679M172515J700364j705628j153259n480881
3671.4F67362213M319153R580383R121552n288544k1670151P126313J0828018N130615
$$ plain form
3613.5 580027313 584511375 584019356 588634987 592478142 591508217 593154831 592050781 594022598 598072777
3622.2 598072777 600397720 602875977 605559998 607027664 609033318 615347824 612196426 600827141
3629.9 600827141 607185173 613036270 618744278 619605370 617731590 620770912 623974266 626328735
3637.6 626328735 626989250 628080521 630349083 632944145 633846169 634060135 636445427 640117874 645990906
3646.3 645990906 643900299 639870148 644624252 642208862 638670959 639882011 647308655 652606964
3654 652606964 656492386 659688950 650567093 653520279 658950119 660064774 661484833 662453079 664711227
3662.7 664711227 665506134 667267532 669146423 669829102 674001617 675701981 673996353 672843094 667362213
3671.4 667362213 671681366 681261749 690383301 685094757 663424606 670550919 681378937 686509552
3679.1F86509552k907028M34875L069001K115325J862259R4834K17132M744110M803696
3687.8G00943756j3317566m36096R629288o136856J433868N439835Q37936K651901
3695.5G01046066O99692j11847J412125M95910K374573K379303n696869j848297N156479
3704.1G05907135J433258K86789R42993K986298L481979q014908M417038K984467j3603211
3712.8G00821838O773301N427627P84149J416245K258072J59988m293518J635819O072311
3721.5G21055832l867264l398895N988922P40356j188507k539978O10276L739318J279908
3730.2G22419968O065673l135910o253433R526291k515335j1855926J568832L317566
3737.9G19137726J735306L421936L004226l009796M693070J2128143j4711227j4448090
$$ plain form
3679.1 686509552 683602524 684037399 687106400 689221725 691083984 691178818 691395950 696140060 700943756
3687.8 700943756 687626190 687190094 696819382 690682526 692116394 697556229 698394165 701046066
3695.5 701046066 701745758 701633911 703046036 703541946 705916519 708295822 702598953 700750656 705907135
3704.1 705907135 707340393 707627182 708570175 711556473 715038452 707023544 711440582 714425049 700821838
3712.8 700821838 707595139 713022766 713806915 715223160 717481232 717641220 713347702 714983521 721055832
3721.5 721055832 717188568 713789673 719778595 720518951 719330444 716790466 717400742 721140060 722419968
3730.2 722419968 728485641 725349731 719096298 728622589 726107254 714251328 715820160 719137726
3737.9 719137726 720873032 724294968 727299194 724289398 728982468 741110611 726399384 711951294
3745.6G11951294J2445373O576920N924301p437515j0725479J2021637o969757l451004
3753.3G20335770Q230590N182953K479096n732880K403031M157867q892059l891N707397
3762G33867874K020798J392898L845139m475479m944229M539871N164032j874619r207077
3770.7G30329208L618546L898849M37012Q49762o6833J122665O92978K580261k240524
3779.4G41221924q403626M351426L536224J336059J307221l606339l83682J797409
3787.1G41156616J563645K34909n51606J496125R0255J92414O00204K133713K817764
3795.8G49734039n479049l491822K772904M440231M149094j0472260p866592N272369
3803.5G39058914M319382O113281M969025j1712876l054351N641250J863861Q70514
$$ plain form
3745.6 711951294 724396667 730973587 736897888 729460373 718734894 730756531 723786774 720335770
3753.3 720335770 728566360 733749313 736228409 730495529 732898560 737056427 728164368 728160477 733867874
3762 733867874 735888672 737281570 741126709 736651230 731707001 736246872 741410904 739536285 730329208
3770.7 730329208 733947754 737846603 738283615 739133377 739066544 740189209 740882187 743462448 741221924
3779.4 741221924 732818298 737169724 740705948 742042007 743349228 739742889 739359207 741156616
3787.1 741156616 742720261 742955170 742403564 743899689 743989944 744182358 744782562 746916275 749734039
3795.8 749734039 744254990 740763168 743536072 747976303 752125397 741653137 733786545 739058914
3803.5 739058914 743378296 749491577 754460602 742747726 739693375 745334625 747198486 748069000
3811.2G48069000J252594M29001Q33893M944839l291702j3425293P377625N870819
3818.9G52060776L393783n53131j7554703M053956O196365K802353L258743m12140
3826.6G53246002m500198J247787K292862K895203k18201q948746N185547O321106
3834.3G57521362q443527P65610Q131180r490509k566300P866135o320877J817627
3842.1G49280701P096786l753357k315979L910141J440506m40826J687240r16900K135010
3850.7G58123322L524093j1165466p74155j4646683P995530J2369232j631546j102295
3858.4G52692032K824097K899246J818619o262894J367721O996766o798325m405746
3866.2G51131516N029907N082779M641494j1321182p356415O111222O985778K841645
$$ plain form
3811.2 748069000 749321594 749750595 750584488 755529327 752237625 738812332 746189957 752060776
3818.9 752060776 755454559 754901428 737346725 741400681 747597046 750399399 753658142 753246002
3826.6 753246002 748745804 749993591 752286453 755181656 754963455 746014709 751200256 757521362
3834.3 757521362 749077835 749843445 757974625 748484116 745917816 753783951 747463074 749280701
3842.1 749280701 756377487 752624130 750308151 754218292 755658798 755217972 756905212 755988312 758123322
3850.7 758123322 761647415 750481949 749707794 735061111 743056641 755425873 753794327 752692032
3858.4 752692032 755516129 758415375 760233994 753971100 755338821 762335587 755537262 751131516
3866.2 751131516 756161423 761244202 765885696 754564514 747208099 753319321 760305099 763146744
3873.9G63146744j0696182K695465M427108o71310K191467K862549p594986m912720
3881.6G51448135P989197J968994J763535L135910j4398041L095627M964218J127548
3889.3G61095123L901062l194961q999863L300400M400177j188965J357269J572266
3897G62242508K672729l17382r852143P673416K757264n945588L739396m499283j387711
3905.7G57083206J925278J373825J911316r5749k41089p36008O71616J272736L44162
3914.4G63509293J522445J602631n185318l153076N220413j164856l359833L102722
3922.1G62094421J486435J088333k741928k405090K468796R88540J099625m40292P7896
3930.8G63716736J982040k831039j338501J761703Q92029M41361m4175l66134p39746
$$ plain form
3873.9 763146744 752450562 755146027 759573135 758901825 761093292 763955841 756360855 751448135
3881.6 751448135 759437332 761406326 763169861 766305771 751907730 755003357 759967575 761095123
3889.3 761095123 764996185 761801224 752801361 756101761 760501938 759312973 760670242 762242508
3897 762242508 764915237 764597855 754745712 762419128 765176392 759230804 762970200 758470917 757083206
3905.7 757083206 759008484 760382309 762293625 762197876 761956787 761220779 761892395 763165131 763509293
3914.4 763509293 765031738 766634369 761449051 758295975 763516388 762351532 758991699 762094421
3922.1 762094421 763580856 764669189 761927261 759522171 761990967 762979507 764079132 763638840 763716736
3930.8 763716736 765698776 762867737 761529236 763290939 764182968 764624329 764580154 764214020 763474274
3939.5G63474274l78342J708221J71280m094619O22863K341309J810074Q77838l395462
3948.1G63137436N13077K0141j841507L119049Q56858j280823p5378N15594N20859
3956.8G65485306L4485J72195n79681N84869n8441j552506J51902M28772K44140N04074
3966.5G65415115L19138K060k18201m12292M47921O5995r22470O97708J401367k62528
3976.1G66533813j897659K08054J168136q01162m8447P03735Q66394M35181m49829
3984.8G66718216k77557o5766K70539R0026k14157l63083K34528K50244o9351K08588
3994.4G66782227l12348K08512O73217K22321m58145l75443
4000.2G66740341
$$ plain form
3939.5 763474274 763095932 764804153 764975433 760880814 761503677 763844986 765655060 766532898 763137436
3948.1 763137436 763650513 763670654 761829147 764948196 765805054 764524231 764448853 764964447 765485306
3956.8 765485306 765519791 765691986 765112305 765697174 765638733 764086227 764238129 764666901 764911041 765415115
3966.5 765415115 765734253 765736313 765518112 765105820 765553741 765619736 764697266 765394974 766796341 766533813
3976.1 766533813 764636154 764844208 766012344 765211182 765162735 765866470 766732864 767168045 766718216
3984.8 766718216 766440659 766374893 766645432 766735458 766521301 766158218 766392746 766642990 766573639 766782227
3994.4 766782227 766469879 766678391 767351608 767573929 767115784 766740341
4000.2 766740341
##END=$$ End of the data block
