##TITLE=$$ Begin of the data block
##JCAMP-DX=5.00 $$ ACD/SpecManager v 10.08
##SPECTROMETER/DATA SYSTEM=Varian
##DATE=15 Jan 2013 14:56:36
##DATA TYPE=INFRARED SPECTRUM
##DATA CLASS=XYDATA
##ORIGIN=
##OWNER=
##NPOINTS=3735
##FIRSTX=399.26403809
##LASTX=4000.35498047
##MAXX=4000.35498047
##MINX=399.26403809
##MAXY=85.66925812
##MINY=37.52935791
##XFACTOR=1.0000000000
##YFACTOR=0.000000100000000
##FIRSTY=70.65497589
##DELTAX=0.96440572
##XUNITS=1/CM
##YUNITS=TRANSMITTANCE
##XYDATA=(X++(Y..Y))
$$ plain form
399.3 706549759 687542038 668879166 670471497 675605698 659378510 649549637 648530350 644833374
407 644833374 648818970 652845154 655665894 656572876 659309235 659795074 655066452 652865906 652348404
415.7 652348404 654932098 654253693 647609406 653641357 657777252 661595383 662803421 656912613 658075333
424.3 658075333 662058105 658119659 652006989 652059555 657175522 657298050 652506943 650970612 652403488
433 652403488 652228394 647407608 642761383 645101471 647324600 648189468 654612732 656055222 650409851
441.7 650409851 651216125 653799667 654844894 652292709 648042450 652755890 661472015 663601685 660920410
450.4 660920410 662747421 662190475 663130493 667787247 665518646 660871964 652110138 649886932 661465759
459.1 661465759 667931747 668827972 666553955 667697220 665287247 660065994 657060699 655412445 654811478
$$ packed form
399.3G06549759j9007721j8662872J592331N134201j6227188r828873j019287l696976
407F44833374L985596M026184K820740R06982K736359M85839m728622k200546n17502
415.7F52348404K583694o78405o644287O031951M135895L818131J208038n890808J162720
424.3F58075333L982772l938446o112670N2566N115967J22528m791107j536331J432876
433F52403488j75094m820786m646225K340088K223129Q64868O423264J442490n645371
441.7F50409851Q06274K583542J045227k552185m250259M713440Q716125K129670k681275
450.4F60920410J827011n56946R40018M656754k268601m646682q761826k223206J1578827
459.1F61465759O465988Q96225k274017J143265k409973n221253l005295j648254o00967
$$ plain form
467.7 654811478 654246140 654700623 655315628 654752350 648763351 647733994 648456497 644510422 641935349
476.4 641935349 638748436 637642212 637680740 640283203 643756180 642234726 642264404 639495544 637491074
485.1 637491074 637801208 638036003 640356369 641353531 640149765 637295723 640289307 643602371 642054291
493.8 642054291 639647713 637047386 636617699 634066811 631964912 632809486 637250977 638648605 632808495
502.5 632808495 634226189 637717705 636789207 629573135 625441513 629300957 627919846 624832993 624023209
511.1 624023209 623765717 623194847 623098984 620549812 614518280 608923874 606532784 607816734 606175270
519.8 606175270 603827629 604561577 608115997 609025841 604618530 602686653 600995140 599387703 598317833
528.5 598317833 598740349 600270424 600430641 602889137 604591255 606081963 608718758 610853500 610745888
$$ packed form
467.7F54811478n65338M54483O15005n63278n988999j029357P22503l946075k575073
476.4F41935349l186913j106224L8528K602463L472977j521454K9678k768860k004470
485.1F37491074L10134K34795K320366R97162j203766k854042K993584L313064j548080
493.8F42054291k406578k600327m29687k550888k101899Q44574M441491J397628n840110
502.5F32808495J417694L491516r28498p216072m131622L859444j381111l086853q09784
511.1F24023209k57492n70870r5863k549172o031532n594406k391090J283950j641464
519.8F06175270k347641P33948L554420R09844m407311j931877j691513j607437j069870
528.5E98317833M22516J530075J60217K458496J702118J490708K636795K134742j07612
$$ plain form
537.2 610745888 610264740 611143227 611868439 615397987 618631630 622385330 626810760 629074478 630259666
545.9 630259666 628664818 626645508 623910599 621567116 621201324 621909599 623347321 622990303 623590469
554.5 623590469 623656120 622574539 619719772 615029335 612978554 610431519 607274704 605478058 606361694
563.2 606361694 605622215 603096771 601090279 596302948 591893120 585888252 581196289 578254204 575716515
571.9 575716515 576073837 575641289 576535072 578457565 580544701 580613785 579535027 579474640 579953499 582189369
581.5 582189369 585132942 589890976 594711838 599619102 603215828 604015312 606047211 607986526 608809776
590.2 608809776 610958481 611957207 610949821 611883659 613389282 615251617 617462120 617426147 617707977
598.9 617707977 616835213 614209099 612305489 611191788 612334442 612880096 613237610 614646873 616002045
$$ packed form
537.2F10745888m81148Q78487P25212L529548L233643L753700M425430K263718J185188
545.9F30259666j594848k019310k734909k343483l65792P08275J437722l57018O00166
554.5F23590469O5651j081581k854767m690437k050781k547035l156815j796646Q83636
563.2F06361694p39479k525444k006492m787331m409828o004868m691963k942085k537689
571.9E75716515L57322m32548Q93783J922493K087136O9084j078758o0387M78859K235870
581.5E82189369K943573M758034M820862M907264L596726P99484K031899J939315Q23250
590.2F08809776K148705R98726j007386R33838J505623J862335K210503l5973K81830
598.9F17707977q72764k626114j903610j113701J142654N45654L57514J409263J355172
$$ plain form
607.6 616002045 618050919 619019737 617147331 613486290 612366943 614622154 616071205 616923752 619746437
616.3 619746437 622813606 624961014 626879883 627387924 628149986 630562477 631734390 632522507 635267067
624.9 635267067 638190842 640255432 642132034 644203568 646219635 648059769 648834686 648145752 647889938
633.6 647889938 647531433 648168716 650432053 652407303 653738785 654405670 655748138 655562439 653923416
642.3 653923416 652905045 652091217 652610168 653812714 655372086 657059631 658422852 659720764 660537338
651 660537338 660819855 659557877 657729645 656506882 656273041 657937698 660535660 662817612 665082550
659.7 665082550 666209106 665271606 664661484 663682404 663142853 664978485 667429276 667006989 657339249
668.3 657339249 663035812 668284531 670697327 671415710 669461441 668538132 668289337 667712021 668785248
$$ packed form
607.6F16002045K048874R68818j872406l661041j119347K255211J449051Q52547K822685
616.3F19746437L067169K147408J918869N08041P62062K412491J171913P88117K744560
624.9F35267067K923775K064590J876602K071534K016067J840134P74917o88934k55814
633.6F47889938l58505O37283K263337J975250J331482O66885J342468j85699j639023
642.3F53923416j018371q13828N18951J202546J559372J687545J363221J297912Q16574
651F60537338K82517j261978j828232j222763k33841J664657K597962K281952K264938
659.7F65082550J126556r37500o10122r79080n39551J835632K450791m22287r667740
668.3F57339249N696563N248719K412796P18383j954269r23309k48795n77316J073227
$$ plain form
677 668785248 670980072 673260651 674814682 675857697 675998917 675622864 674634399 673854752 673956833
685.7 673956833 673690720 674163437 676156845 678704224 679503174 679524307 679758148 678540497 676628113
694.4 676628113 674910507 673868408 672601471 671677856 671477356 670237045 669953842 669952545 668599167
703.1 668599167 666640244 663995819 661673660 660169754 659845200 660458908 661639252 663369064 665061951
711.7 665061951 666185837 667066193 668628311 669890594 670284042 670817337 672140503 674970398 678507462
720.4 678507462 681228561 684906998 689073639 691165543 692339172 693204117 694058228 695718765 697611465
729.1 697611465 699628601 702107315 705076370 708453903 710650635 711837158 713012695 711914139
736.8 711914139 710609131 711164474 711514053 710990524 711158066 713866348 715949020 715232239 714151917
$$ packed form
677F68785248K194824K280579J554031J043015J41220l76053r88465p79647J02081
685.7F73956833k66113M72717J993408K547379P98950K1133K33841j217651j912384
694.4F76628113j717606j042099j266937r23615k00500j240311k83203j297j353378
703.1F68599167j958923k644425k322159j503906l24554O13708J180344J729812J692887
711.7F65061951J123886Q80356J562118J262283L93448N33295J323166K829895L537064
720.4F78507462K721099L678437M166641K091904J173629Q64945Q54111J660537J892700
729.1F97611465K017136K478714K969055L377533K196732J186523J175537j098556
736.8G11914139j305008N55343L49579n23529J67542K708282K082672p16781j080322
$$ plain form
745.5 714151917 712917175 710011749 706027985 702451019 699744415 698226852 698143539 698288727 696744919
754.2 696744919 694259186 691667480 688939056 686415405 683391037 680900879 679534912 678057404
761.9 678057404 677366867 678523941 679850311 680510178 681688385 682622986 683356705 685000763 686365128
770.6 686365128 687769699 689982681 693942795 699750290 704754486 708067627 710787277 713438721
778.3 713438721 716019897 718659592 719491959 720364609 723940277 728384628 732706680 735737915 737448807
787 737448807 738928986 740351715 740193863 739613724 740005798 740302887 742364807 745248947 747790451
795.6 747790451 750999527 753976898 755965424 757207413 757320480 756410065 756837463 758400650 761247253
804.3 761247253 763725433 765687714 769670029 772147217 772170334 771159515 769817963 768595123 768366013
$$ packed form
745.5G14151917j234742k905426l983764l576966k706604j517563q3313J45188j543808
754.2F96744919k485733k591706k728424k523651l024368k490158j365967j477508
761.9F78057404o90537J157074J326370O59867J178207R34601P33719J644058J364365
770.6F86365128J404571K212982L960114N807495N004196L313141K719650K651444
778.3G13438721K581176K639695Q32367Q72650L575668M444351M322052L031235J710892
787G37448807J480179J422729j57852n80139L92074K97089K061920K884140K541504
795.6G47790451L209076K977371J988526J241989J13067r10415M27398J563187K846603
804.3G61247253K478180J962281L982315K477188K3117j010819j341552j222840k29110
$$ plain form
813 768366013 768657074 768985519 771294098 773802719 775760193 776105423 775322571 775140381 773847961
821.7 773847961 772283707 770748596 769472656 769131317 770065308 771044388 770690231 769034500 765610657
830.4 765610657 762174683 759163818 756014404 752531204 750007935 749369659 748550644 746941910 745600357
839 745600357 744472275 742509537 739746017 736069870 733182755 731824265 730302582 728954010 728235092
847.7 728235092 729110184 730345459 730533981 729455795 726434784 723653870 721373825 719155807 717683105
856.4 717683105 717426910 718299713 719018326 719339142 719332352 719210358 719705505 720817642 721567459 723624115
866 723624115 727899780 732139664 737447510 743825378 749581680 753968506 757266541 759896240 760832291
874.7 760832291 761681442 762521744 765028152 768250885 770080414 772365265 773234100 771941071 768545914
$$ packed form
813G68366013K91061L28445K308579K508621J957474L45230p82852j82190j292420
821.7G73847961j564254j535111j275940l41339R33991R79080l54157j655731l423843
830.4G65610657l435974l010865l149414l483200k523269o38276q19015j608734j341553
839G45600357j128082j962738k763520l676147k887115j358490j521683j348572p18918
847.7G28235092Q75092J235275J88522j078186l021011k780914k280045k218018j472702
856.4G17683105k56195Q72803P18613L20816o790j21994M95147J112137P49817K056656
866G23624115M275665M239884N307846O377868N756302M386826L298035K629699R36051
874.7G60832291Q49151Q40302K506408L222733J829529K284851Q68835j293029l395157
$$ plain form
883.4 768545914 764773636 761687164 758511276 755557098 753399734 752066422 750381393 749466324 748709335
892.1 748709335 746350632 742836456 739482269 736022644 732093124 729927826 728935089 728390884 728486404
900.8 728486404 728713226 728441467 726263199 721854172 716715927 712941666 709482040 706424561 704048767
909.4 704048767 701804047 700143051 697873306 695027084 690647278 684802856 679775391 674975662
917.2 674975662 670250168 666489868 663477707 661767578 661256332 660410995 658793564 657886581 656659470
925.8 656659470 653432846 650917130 649884109 650459518 652746735 654638596 656643829 658577423 659779358
934.5 659779358 661120071 662049103 662414551 663402481 665053635 667224197 670669632 674613876 677658615
943.2 677658615 680376434 682307510 682252884 680654373 677631836 674290161 670741196 667174911 664230957
$$ packed form
883.4G68545914l772278l086472l175888k954178k157364j333312j685029r15069p56989
892.1G48709335k358703l514176l354187l459625l929520k165298r92737n44205R5520
900.8G28486404K26822k71759k178268m409027n138245l774261l459626l057479k375794
909.4G04048767k244720j660996k269745k846222m379806n844422n027465m799729
917.2F74975662m725494l760300l012161j710129n11246q45337j617431r06983j227111
925.8F56659470l226624k515716j033021N75409K287217J891861K005233J933594J201935
934.5F59779358J340713R29032L65448R87930J651154K170562L445435L944244L044739
943.2F77658615K717819J931076n4626j598511l022537l341675l548965l566285k943954
$$ plain form
951.9 664230957 661053848 657557831 653308792 647799606 640360107 631323471 622932777 614564056
959.6 614564056 606453133 599317169 592107277 585598602 578281746 570681534 561961823 551489487
967.3 551489487 541553917 531379395 521488800 511183052 502070236 492535858 482744789 474607849
975 474607849 465130424 455952682 445476761 435618019 426756172 418412781 411349525 404699440 399735031
983.7 399735031 394131393 391316795 387947006 384173813 381739693 378322144 377101669 375527611
991.4 375527611 375411644 375293579 375608788 376572342 377403183 379617043 380164375 380994186 380421715 380543289
1001.1 380543289 381196327 381576958 382754784 382881241 384013176 384042244 384769936 384659996 384463768
1009.7 384463768 383847733 381390610 380870895 379393387 379844818 380282860 380888710 381969490 382323418
$$ packed form
951.9F64230957l177109l496017m249039n509186p439499r036636q390694q368721
959.6F14564056q110923p135964p209892o508675p316856p600212q719711j0472336
967.3E51489487r935570j0174522r890595j0305748r112816r534378r791069q136940
975D74607849r477425r177742j0475921r858742q861847q343391p063256o650085m964409
983.7C99735031n603638k814598l369789l773193k434120l417549j220475j574058
991.4C75527611j15967j18065L15209R63554Q30841K213860N47332Q29811n72471J21574
1001.1C80543289O53038L80631J177826J26457J131935K9068P27692j09940j96228
1009.7C84463768o16035k457123n19715j477508M51431M38042O05850J080780L53928
$$ plain form
1018.4 382323418 384166107 384603767 385804176 385815926 386912117 388462830 389944992 392633286 393571396
1027.1 393571396 396894989 399749031 402117996 403041191 404635887 407578735 407959290 409635620 410877190
1035.8 410877190 412853050 413507004 414733887 417362595 418500099 419704170 419035225 419608955 419082184
1044.5 419082184 419500237 420730247 421920471 424682732 425394859 427602463 429142723 431867294 434314232
1053.1 434314232 435812988 438320198 440228882 444179153 446982079 452042885 457868156 463638916
1060.9 463638916 469267044 473612785 479563141 484310493 489693222 493225746 497251244 500356941
1068.6 500356941 500295982 499998360 494498024 488001022 480640373 472648468 466144409 460666656 456872330
1077.2 456872330 453034821 451898651 451059418 451967354 452423019 452865105 454295273 455165215 457423820
$$ packed form
1018.4C82323418J842689M37660J200409J1750J096191J550713J482162K688294R38110
1027.1C93571396L323593K854042K368965R23195J594696K942848L80555J676330J241570
1035.8D10877190J975860O53954J226883K628708J137504J204071o68945N73730n26771
1044.5D19082184M18053J230010J190224K762261P12127K207604J540260K724571K446938
1053.1D34314232J498756K507210J908684L950271K802926N060806N825271N770760
1060.9D63638916N628128M345741N950356M747352N382729L532524M025498L105697
1068.6E00356941o0959k97622n500336o497002p360649p991905o504059n477753l794326
1077.2D56872330l837509j136170q39233R07936M55665M42086J430168Q69942K258605
$$ plain form
1085.9 457423820 457512169 459758759 462367744 465980682 470645714 473872414 477451324 479485054 483842010
1094.6 483842010 486153831 487042465 488466301 489712067 492063942 492738190 493935509 494569244 496919670
1103.3 496919670 499024925 499836121 499448166 497509499 498759155 499154472 501127357 503552895 505547409
1112 505547409 508788071 511435814 514507332 515110855 516620750 517951393 517898903 517994003 518704300
1120.6 518704300 521131897 522447319 524200554 525196533 526393127 527767754 528846703 530032387
1128.4 530032387 530112686 531637497 533729019 537290268 539780388 541606560 543531837 543558159 543433113
1137 543433113 540861473 538079758 534580917 530019302 526221199 522229309 518347015 513875847 510605583
1145.7 510605583 506150703 502297935 498685760 494273338 491197510 487873306 485660095 482480850
$$ packed form
1085.9D57423820Q8349K246590K608985L612938M665032L226700L578910K033730M356956
1094.6D83842010K311821Q88634J423836J245766K351875O74248J197319O33735K350426
1103.3D96919670K105255Q11196l87955j938667J249656L95317J972885K425538J994514
1112E05547409L240662K647743L071518O03523J509895J330643n2490R5100P10297
1120.6E18704300K427597J315422J753235R95979J196594J374627J078949J185684
1128.4E30032387Q0299J524811K091522L561249K490120J826172J925277K6322j25046
1137E43433113k571640k781715l498841m561615l798103l991890l882294m471168l270264
1145.7E10605583m454880l852768l612175m412422l075828l324204k213211l179245
$$ plain form
1153.4 482480850 482008133 482368660 482147789 483093224 481965294 481337433 480553169 481579247 482585373
1162.1 482585373 484133148 487185364 489910431 493938560 497727203 503403130 508101692 512682152
1169.8 512682152 517366295 521917076 527977257 533457260 540773468 547378807 554542847 562459106
1177.5 562459106 569380989 575633392 581178207 587678833 592990990 597968178 602664566 608019638
1185.3 608019638 614081917 619768333 625554276 629559517 633095856 635727654 637349968 638444328
1193 638444328 639911652 642063446 643209152 645245285 646968613 648482208 649826965 649888153 649800797
1201.6 649800797 649623795 650243683 649964828 650403214 652340240 654167633 656975327 659390182 661408768
1210.3 661408768 662848969 664074173 665337143 666113281 667583313 669440308 671743164 674328461
$$ packed form
1153.4D82480850m72717L60527k20871R45435j127930o27861p84264J026078J006126
1162.1D82585373J547775L052216K725067M028129L788643N675927M698562M580460
1169.8E12682152M684143M550781O060181N480003P316208O605339P164040P916259
1177.5E62459106O921883O252403N544815O500626N312157M977188M696388N355072
1185.3F08019638O062279N686416N785943M005241L536339K631798J622314J094360
1193F38444328J467324K151794J145706K036133J723328J513595J344757O1188q7356
1201.6F49800797j77002O19888k78855M38386J937026J827393K807694K414855K018586
1210.3F61408768J440201J225204J262970P76138J470032J856995K302856K585297
$$ plain form
1218 674328461 677400131 680355682 681705627 682379837 682405167 681245499 679876022 679376678 679192276
1226.7 679192276 679490051 680830994 681389694 681109009 680622177 679883575 678642349 676759033 675306702
1235.4 675306702 674168930 673510056 673747025 674374771 675056686 675773849 676055222 675707321 675168762
1244.1 675168762 674672470 674242554 674136200 674888916 676249924 678250961 680450363 682166061 683288879
1252.8 683288879 683590164 683571014 683288879 682958984 683239136 683861160 685073776 686803894 688414078
1261.4 688414078 689742279 690828552 691078186 690449448 690154114 690026932 690417480 691666565 693124466
1270.1 693124466 694957047 696604614 698272705 699381714 699370499 699117661 697911987 696611328 695899963
1278.8 695899963 695917969 696484833 697174606 698189392 698273926 697909317 697559128 696417847 694700317
$$ packed form
1218F74328461L071670K955551J349945O74210K5330j159668j369477m99344j84402
1226.7F79192276K97775J340943N58700k80685m86832p38602j241226j883316j452331
1235.4F75306702j137772o58874K36969O27746O81915P17163K81373l47901n38559
1244.1F75168762m96292m29916j06354P52716J361008K001037K199402J715698J122818
1252.8F83288879L01285j9150k82135l29895K80152O22024J212616J730118J610184
1261.4F88414078J328201J086273K49634o28738k95334j27182L90548J249085J457901
1270.1F93124466J832581J647567J668091J109009j1215k52838j205674j300659p11365
1278.8F95899963J8006N66864O89773J014786Q4534l64609l50189j141281j717530
$$ plain form
1287.5 694700317 693138504 692160110 691664963 691737595 692173920 692613831 692536316 691833115 690493774 688762512
1297.1 688762512 687072678 685322723 684052887 683556900 683953094 684570923 684977646 685530396 685659637
1305.8 685659637 684694519 683184814 681962967 680501175 679487915 679483719 680183716 681053467 680895767
1314.5 680895767 680731125 680356369 679351501 678167267 675843582 673938751 673048401 672333145 671922760
1323.2 671922760 671532822 671101990 669975739 667936249 665509796 662537079 659707260 657018280 654320831
1331.8 654320831 652720642 651537399 650854263 650264435 649281235 648144073 646726837 645120468 643370209
1340.5 643370209 643066254 643707733 644055481 644173965 645402908 646640244 646884613 647000427 646683578
1349.2 646683578 646017685 644557419 643010025 642453995 642453461 642613983 643106766 644114456 644121780 643683395
$$ packed form
1287.5F94700317j561813r78394m95147P2632M36325M39911p7515p03201j339341j731262
1297.1F88762512j689834j749955j269836m95987L96194O17829M06723N52750J29241
1305.8F85659637r65118j509705j221847j461792j013260m196O99997Q69751j57700
1314.5F80895767j64642l74756j004868j184234k323685j904831q90350p15256m10385
1323.2F71922760l89938m30832j126251k039490k426453k972717k829819k688980k697449
1331.8F54320831j600189j183243o83136n89828r83200j137162j417236j606369j750259
1340.5F43370209l03955O41479L47748J18484J228943J237336K44369J15814l16849
1349.2F46683578o65893j460266j547394n56030n34J60522M92783J007690P324m38385
$$ plain form
1358.8 643683395 643074265 641324921 639581261 638086433 636576996 636701927 637735443 638274498 638752403
1367.5 638752403 638589363 638177299 638503227 637962036 637646332 636960411 636917152 637890434 639255638 641369095
1377.2 641369095 642571945 643625031 643827133 643986969 643794708 643243179 643648300 644305115 646420441
1385.8 646420441 648327179 650774536 653886490 656262436 657506561 658133316 659311142 659335175 657487030
1394.5 657487030 656421738 658086243 659521866 660222778 659838181 659749908 660534744 659662170 658833313
1403.2 658833313 657728271 654804077 653811951 654232483 654722137 654714050 654655457 654023666 653346100 652677155
1412.8 652677155 651679459 650577316 649634552 648841171 648001328 648905182 646863022 647779312 650733871
1421.5 650733871 651417236 651305084 648875580 648722687 649405899 649305878 650879440 651575012 651588516
$$ packed form
1358.8F43683395o09130j749344j743660j494828j509437J24931J033516N39055M77905
1367.5F38752403j63040m12064L25928n41191l15704o85921m3259R73282J365204K113457
1377.2F41369095J202850J053086K02102J59836j92261n51529M05121O56815K115326
1385.8F46420441J906738K447357L111954K375946J244125O26755J177826K4033j848145
1394.5F57487030j065292J664505J435623P00912l84597q8273P84836q72574q28857
1403.2F58833313j105042k924194r92126M20532M89654q087n8593o31791o77566o68945
1412.8F52677155r97696j102143r42764p93381q39843R03854k042160R16290K954559
1421.5F50733871O83365j12152k429504j52893O83212j00021J573562O95572J3504
$$ plain form
1430.2 651588516 652788315 655253220 655966797 655551529 656290512 655908661 652806778 653143921 656639481
1438.9 656639481 658461685 659454651 660691910 661276703 662362823 662070541 662027740 661373291 660086288
1447.6 660086288 658383331 658869858 660838089 660508347 660477753 660371246 660715332 660139160 658075867
1456.2 658075867 653732681 649154816 651852036 652448807 655189819 656607895 657904510 659813690
1464 659813690 657496109 659028549 660551224 662749252 663490524 665931931 670149307 671612091 675182877
1472.6 675182877 678162003 684954529 688616028 690449905 692995529 695818100 699154282 700996628
1480.3 700996628 704030228 706879349 711344452 714916229 717639008 720606995 720205994 722068176
1488.1 722068176 723221436 722815170 723112030 727621231 732527390 735397949 738934479 739487762 738555679
$$ packed form
1430.2F51588516J199799K464905P13577m15268P38983l81851l101883L37143L495560
1438.9F56639481J822204R92966J237259N84793J086120k92282m2801o54449j287003
1447.6F60086288j702957M86527J968231l29742l0594j06507L44086n76172k063293
1456.2F58075867m343186m577865K697220N96771K741012J418076J296615J909180
1464F59813690k317581J532440J522675K198028P41272K441407M217376J462784L570786
1472.6F75182877K979126O792526L661499J833877K545624K822571L336182J842346
1480.3G00996628L033600K849121M465103L571777K722779K967987m01001J862182
1488.1G22068176J153260m06266K96860M509201M906159K870559L536530N53283r32083
$$ plain form
1496.7 738555679 741241837 741885529 741827850 744058762 745533447 746292191 749706955 752284775 755156784
1505.4 755156784 752910767 743594666 749474258 752531509 755133286 756682587 757099915 757021027 760031738
1514.1 760031738 762400284 763231583 763633118 760787735 765927811 767960205 762375183 759009323 761009979
1522.8 761009979 767084885 769510193 769738007 770878296 772783508 772808456 773355484 774946289 774432907
1531.5 774432907 774850464 771781082 770143280 774220428 777154541 780447540 782832642 779794617
1539.2 779794617 770713043 776614227 776128922 775242081 778525848 777432251 777710648 781576462 784958038
1547.9 784958038 786067352 784395676 782082901 783601303 785459824 785001526 781008682 782088699
1555.6 782088699 787825394 791995850 786551285 778237991 776555862 784951859 788186569 789216766
$$ packed form
1496.7G38555679K686158O43692n7679K230912J474685P58744L414764K577820K872009
1505.4G55156784k246017r316101N879592L057251K601777J549301M17328p8888L010711
1514.1G60031738K368546Q31299M01535k845383N140076K032394n585022l365860K000656
1522.8G61009979O074906K425308K27814J140289J905212K4948N47028J590805n13382
1531.5G74432907M17557l069382j637802M077148K934113L292999K385102l038025
1539.2G79794617r081574N901184m85305q86841L283767j093597K78397L865814L381576
1547.9G84958038J109314j671676k312775J518402J858521m58298l992844J080017
1555.6G82088699N736695M170456n444565q313294j682129Q395997L234710J030197
$$ plain form
1563.3 789216766 788500061 786316376 787969971 790456238 792439270 791647949 787866364 790308914 792335663
1572 792335663 792381744 792355728 793264084 791486664 785525360 788966522 792391586 793247910 793619156 793903122
1581.6 793903122 793468323 792887573 791796570 791027603 790492859 790611038 791080170 791179504 790769119 790050201
1591.2 790050201 789606857 789282303 788069992 785808716 784700699 783923950 783543167 783586578 783393021
1599.9 783393021 782495346 780989075 779648285 777405167 775802536 774605331 772846146 770512619
1607.6 770512619 769164505 767809219 766145935 766053085 764483948 762711716 760769119 759559555 756085587
1616.3 756085587 744094086 747014618 748831253 748259430 746583710 746342773 744484787 738051071
1624 738051071 738336029 738167343 737222290 732496109 730004730 730564194 729692993 729686127 728842010 729252853
$$ packed form
1563.3G89216766p16705k183685J653595K486267J983032p91321l781585K442550K026749
1572G92335663M6081k6016R08356j777420n961304L441162L425064Q56324L71246K83966
1581.6G93903122m34799n80750j091003p68967n34744J18179M69132R9334m10385p18918
1591.2G90050201m43344l24554j212311k261276j108017p76749l80783M3411j93557
1599.9G83393021q97675j506271j340790k243118j602631j197205j759185k333527
1607.6G70512619j348114j355286j663284r2850j569137j772232j942597j209564l473968
1616.3G56085587j1991501K920532J816635n71823j675720k40937j857986o433716
1624G38051071K84958j68686r45053m726181k491379N59464q71201o866q44117M10843
$$ plain form
1633.7 729252853 729689331 721698456 720180664 721170578 721326981 721956100 722307892 722132187 723008881
1642.4 723008881 722743683 724099045 725739899 722341309 720635986 720375366 723274536 725638351 728290482
1651 728290482 731780548 728616257 719566803 725978928 731356354 734047928 735550995 736320038 736935959
1659.7 736935959 738199463 739936218 739802399 739647598 743815613 747012024 748577576 750307465 751680832
1668.4 751680832 749086380 750000992 753068390 754075623 757409515 761323547 760791168 759551697 763643036
1677.1 763643036 767096710 769247284 769013290 767881546 771797256 776271515 775537720 767284393 772709427
1685.8 772709427 778608627 781315308 781342621 782606583 783221664 784293594 786187668 787776566 790844650
1694.4 790844650 791810379 784417419 788344421 793274460 797817459 791785355 785191956 792882690
$$ packed form
1633.7G29252853M36478p990875j517792R89914J56403O29119L51792j75705Q76694
1642.4G23008881k65198J355362J640854l398590j705323k60620K899170K363815K652131
1651G28290482L490066l164291r049454O412125N377426K691574J503067P69043O15921
1659.7G36935959J263504J736755j33819j54801M168015L196411J565552J729889J373367
1668.4G51680832k594452R14612L067398J007233L333892L914032n32379j239471M091339
1677.1G63643036L453674K150574k33994j131744L915710M474259p33795q253327N425034
1685.8G72709427N899200K706681K7313J263962O15081J071930J894074J588898L068084
1694.4G90844650R65729p392960L927002M930039M542999o032104o593399P690734
$$ plain form
1702.1 792882690 796738586 798104248 797939911 798482513 797880936 800493622 804141541 804347458 803497391
1710.8 803497391 804478836 805572433 805888977 804187012 804542618 808023529 807559814 801913910 807146912
1719.5 807146912 811229095 812912827 813324356 812612534 812230988 813372879 814458618 815301590 816876144
1728.2 816876144 818262634 816621094 816740417 820005493 820664825 812973175 808408813 815084991 819078827
1736.9 819078827 820446854 822564850 820990601 820077896 823810120 824382401 821528473 821512756 823849564
1745.5 823849564 824278488 824608383 824767990 824855728 828325577 827293320 825912094 828227768 829009705
1754.2 829009705 830017700 830277252 827337799 827942200 830372849 831975479 833164215 829900894 829458542
1762.9 829458542 832166367 832663345 832654953 833274994 832959518 830376587 832921753 836130676 835256882
$$ packed form
1702.1G92882690L855896J365662j64337N42602o01577K612686L647919K05917q50067
1710.8H03497391R81445J093597L16544j701965L55606L480911m63715n645904N233002
1719.5H07146912M082183J683732M11529p11822l81546J141891J085739Q42972J574554
1728.2H16876144J386490j641540J19323L265076O59332p691650m564362O676178L993836
1736.9H19078827J368027K117996j574249r12705L732224N72281k853928j5717K336808
1745.5H23849564M28924L29895J59607Q7738L469849j032257j381226K315674P81937
1754.2H29009705J007995K59552k939453O04401K430649J602630J188736l263321m42352
1762.9H29458542K707825M96978q392O20041l15476k582931K545166L208923q73794
$$ plain form
1771.6 835256882 831999588 830710602 834501343 835485306 833899307 834978333 835015259 835675964 835518341
1780.3 835518341 834690933 836257477 838076859 838773956 837163773 836532059 837180786 837040405 837268372
1788.9 837268372 838507385 838562622 837701797 835082474 835988770 839633713 839618683 838270111 838975220
1797.6 838975220 839860077 839032974 837843246 839840851 840392838 841188431 842534790 842478027 842516632
1806.3 842516632 841849442 841093521 841559830 841892471 840565796 841132965 842727737 843728256 844738922
1815 844738922 844519348 844020081 842910385 842607040 842876892 842838287 843347092 843428726 845308304 846313553
1824.6 846313553 843595123 843925476 845519104 845987320 843408737 839328461 841667328 844266052 844627457
1833.3 844627457 845372849 846479568 847163086 846828003 845859833 845910950 845079269 844854431 844888916 845937881
$$ packed form
1771.6H35256882l257294j288986L790741R83963j585999J079026L6926O60705j57623
1780.3H35518341q27408J566544J819382O97097j610183o31714O48727j40381K27967
1788.9H37268372J239013N5237q60825k619323R06296L644943j5030j348572P05109
1797.6H38975220Q84857q27103j189728J997605N51987P95593J346359n6763L8605
1806.3H42516632o67190p55921M66309L32641j326675N67169J594772J000519J010666
1815H44738922k19574m99267j109696l03345K69852l8605N08805Q1634J879578J005249
1824.6H46313553k718430L30353J593628M68216k578583m080276K338867K598724L61405
1833.3H44627457P45392J106719O83518l35083r68170N1117q31681k24838L4485J048965
$$ plain form
1842.9 845937881 846172714 841713943 844780350 847530212 846665802 845823441 845884018 845796280 845352478
1851.6 845352478 845453262 845341568 845870514 846545563 847073975 847493668 847201843 847147293 846408310 845700455
1861.3 845700455 845169678 845245590 845773315 846519241 847458572 847150574 847423782 845811996 844130859
1869.9 844130859 845341797 846091232 846112518 845911942 846706085 847210999 847741470 848404770 848521881 848232956
1879.6 848232956 847480392 847436676 846839371 846655426 846555557 846487656 847544708 848353500 849647522 848808441
1889.2 848808441 846555405 847687073 848582993 847933350 847181320 846088333 845562668 847285156 848515854
1897.9 848515854 849156418 849806290 849603729 849309616 848670807 848266830 847761459 847613983 848056870 848324814
1907.6 848324814 848861847 849036636 848724136 848899460 849607315 849182281 848369522 847777939 847750015 848085327
$$ packed form
1842.9H45937881K34833m458771L066407K749862q64410q42361O0577q7738m43802
1851.6H45352478J00784j11694N28946O75049N28412M19693k91825n4550p38983p07855
1861.3H45700455n30777P5912N27725P45926R39331l07998K73208j611786j681137
1869.9H44130859J210938P49435K1286k00576P94143N04914N30471O63300J17111k88925
1879.6H48232956p52564m3716n97305j83945r9869o7901J057052Q08792J294022q39081
1889.2H48808441k253036J131668Q95920o49643p52030j092987n25665J722488J230698
1897.9H48515854O40564O49872k02561k94113o38809m03977n05371j47476M42887K67944
1907.6H48324814N37033J74789l12500J75324P07855m25034q12759n91583k7924L35312
$$ plain form
1917.2 848085327 846129913 846992340 849396133 850149231 850250549 848798981 847805405 848026657 847985077
1925.9 847985077 847896118 847992020 848077469 848358765 848849716 849381485 849956131 849374695 848576279 848169022
1935.5 848169022 847787704 847641983 847747955 848193893 848544312 849466705 848925705 847572174 848767166
1944.2 848767166 849127884 848528137 847962952 847550430 848047180 848820114 849329605 849637756 849512787 849096832
1953.8 849096832 848843460 848411560 848198776 848034134 847755737 848035660 848507919 849140472 849690704 849947281
1963.5 849947281 850002747 850135727 849946365 848771133 848051071 848229904 848347702 848545914 849409256 850084152
1973.1 850084152 850236816 850357285 850241547 849722595 848885651 848474579 848319168 848318176 848629913 849276505
1982.8 849276505 850307312 850859680 850966568 850635223 849955597 848930206 848415375 848940277 848719940
$$ packed form
1917.2H48085327j955414Q62427K403793P53098J01318j451568r93576K21252m1580
1925.9H47985077q8959R5902Q5449K81296M90951N31769N74646n81436p98416m07257
1935.5H48169022l81318j45721J05972M45938L50419R22393n41000j353531J194992
1944.2H48767166L60718n99747n65185m12522M96750P72934N09491L08151j24969m15955
1953.8H49096832k53372m31900k12784j64642k78397K79923M72259O32553N50232K56577
1963.5H49947281N5466J32980j89362j175232p20062J78833J17798J98212Q63342O74896
1973.1H50084152J52664J20469j15738n18952q36944m11072j55411r92L11737O46592
1982.8H49276505J030807N52368J06888l31345o79626j025391n14831N24902k20337
$$ plain form
1991.5 848719940 848174896 848817749 849741364 850211029 850326233 850068359 849339828 848465195 847790909 847824478
2001.1 847824478 847840652 848177719 848984451 849372177 849739304 849822083 849550934 848853302 848025818 847279816
2010.7 847279816 846991348 847682724 848052368 848206482 848741150 848731461 847851181 847653046 847861633 847325058
2020.4 847325058 846592255 845718384 845634689 846324539 846820068 847125320 847165070 847180786 846779404 846063232
2030 846063232 845284729 844674072 844575729 844584198 844621735 845168915 845890503 846160736 846162872 845189285 844012756
2040.6 844012756 843555298 843189850 843190384 843338776 843658447 844060669 844531555 845007019 845120773 844679565
2050.3 844679565 843784714 843311005 842706985 842416000 842616577 843015442 843679276 843787231 844277191 844623032
2059.9 844623032 844121094 843148804 842375412 842476120 842204437 842043686 842912216 844016266 844536514
$$ packed form
1991.5H48719940n45044O42853R23615M69665J15204k57874p28531q74633o74286L3569
2001.1H47824478J6174L37067Q06732L87726L67127Q2779k71149o97632q27484p46002
2010.7H47279816k88468O91376L69644J54114N34668r689q80280j98135K08587n36575
2020.4H47325058p32803q73871q3695O89850M95529L05252L9750J5716m01382p16172
2030H46063232p78503o10657r8343Q469L7537N47180P21588K70233K136r73587j176529
2040.6H44012756m57458l65448N34J48392L19671M02222M70886M75464J13754m41208
2050.3H44679565q94851m73709o04020k90985K00577L98865O63834J07955M89960L45841
2059.9H44623032n01938r72290p73392J00708k71683j60751Q68530J104050N20248
$$ plain form
2068.6 844536514 844938660 845014572 844354935 843826141 843183594 842762833 842346039 842523956 843504028 843990784
2078.2 843990784 844559402 845152664 845273132 844428406 843566818 843184662 842707748 842526016 842626114 843471527
2087.9 843471527 844155273 844481430 844563599 844309387 844364853 843941727 843306808 842835159 842796783 843090057
2097.5 843090057 843736038 844592209 844909439 845170746 844939346 844641418 844302444 843685226 843473892 843408585
2107.2 843408585 843593826 844050980 844848328 845263977 845327606 845380249 845037308 844589539 844213943 844044113
2116.8 844044113 843743591 844088364 844918671 845581055 846138306 846290054 846229248 845456314 844735031 844220505
2126.5 844220505 844062958 844101944 843673706 844113846 844840164 845529556 845805588 845431290 844929810 844325714
2136.1 844325714 844058990 843370743 843457489 844322739 844611816 845010452 845512390 845590363 845077362 844718323
$$ packed form
2068.6H44536514M02146P5912o59637n28794o42547m20761m16794J77917R80072M86756
2078.2H43990784N68618N93262J20468q44726q61588l82156m76914j81732J00098Q45413
2087.9H43471527O83746L26157Q2169k54212N5466m23126o34919m71649l8376K93274
2097.5H43090057O45981Q56171L17230K61307k31400k97928l38974o17218k11334o5307
2107.2H43408585J85241M57154P97348M15649O3629N2643l42941m47769l75596j69830
2116.8H44044113l00522L44773Q30307O62384N57251J51748o0806p72934p21283n14526
2126.5H44220505j57547L8986m28238M40140P26318O89392K76032l74298n01480o04096
2136.1H44325714k66724o88247Q6746Q65250K89077L98636N01938P7973n13001l59039
$$ plain form
2145.8 844718323 844349213 844088058 844115143 844414444 844803009 844739532 845391083 846008835 846095428 845954208
2155.4 845954208 845448074 845064087 844410782 844273529 844674683 845026016 845483551 846103516 846480865 846264038
2165 846264038 846075058 845701599 845577316 845645294 845310440 845213013 845731812 846541214 847108154 847649536
2174.7 847649536 847610931 847101593 846999359 846968460 846746979 846630020 847066422 847736740 848321991 848703003
2184.3 848703003 849176102 849645844 849688568 849436264 848733826 848272018 848245621 848323593 848395538 848815384
2194 848815384 849708481 850206680 850388641 850361252 850298386 849948044 849573288 849656601 849589996 849710541 850024719
2204.6 850024719 850766907 851513367 851500397 851332397 851248474 851148682 850896530 850761948 850642242 850984573
2214.2 850984573 851922531 852635956 852945557 852883911 852735214 852297211 852049179 851939545 851679687 851733170
$$ packed form
2145.8H44718323l69110k61155K7085K99301L88565o3477O51551O17752Q6593j41220
2155.4H45954208n06134l83987o53305j37253M01154L51333M57535O19965L77349k16827
2165H46264038j88980l73459j24283O7978l34854r7427N18799Q09402N66940N41382
2174.7H47649536l8605n09338j02234l0899k21481j16959M36402O70318N85251L81012
2184.3H48703003M73099M69742M2724k52304p02438m61808k6397P7972P1945M19846
2194H48815384Q93097M98199J81961k7389o2866l50342l74756Q3313o6605J20545L14178
2204.6H50024719P42188P46460j2970j68000q3923r9792k52152j34582j19706L42331
2214.2H50984573R37958P13425L09601o1646j48697m38003k48032j09634k59858N3483
$$ plain form
2223.9 851733170 852000961 852532272 852792969 853288651 853842239 853618240 853346252 852985229 852525558 852550354
2233.5 852550354 853209305 853538742 853607254 853914261 854061584 854165649 854166183 854370117 854189148 853343658
2243.2 853343658 852924500 853236923 853977661 854553680 854625854 854679794 854985962 854777603 854336624 853916931
2252.8 853916931 853546219 853421860 853033752 853273010 854143982 854684906 854725800 855014496 855414124 854831696
2262.4 854831696 854309006 853968048 853534851 853692017 854444809 854991837 855283966 855747147 855707397 855501251
2272.1 855501251 855208664 855031204 854801178 854425354 854510498 854549408 855078735 855817413 856534348 856692581
2281.7 856692581 856307220 856140366 855550079 855264969 854902802 854815521 855105515 855451660 856008911 856270676
2291.4 856270676 856588974 855721207 855224838 855018234 854082489 853908386 853821793 854201279 854210892 854860229
$$ packed form
2223.9H51733170K67791N31311K60697M95682N53588k23999k71988l61023m59671K4796
2233.5H52550354O58951L29437O8512L07007J47323J04065N34K03934j80969q45490
2243.2H53343658m19158L12423P40738N76019P2174N3940L06168k08359m40979m19693
2252.8H53916931l70712j24359l88108K39258Q70972N40924M0894K88696L99628n82428
2262.4H54831696n22690l40958m33197J57166P52792N47028K92129M63181l9750k06146
2272.1H55501251k92587j77460k30026l75824Q5144L8910N29327P38678P16935J58233
2281.7H56692581l85361j66854n90287k85110l62167q7281K89994L46145N57251K61765
2291.4H56270676L18298q67767m96369k06604r35745j74103q6593L79486R613O49337
$$ plain form
2301 854860229 855317459 854478836 854333115 854103546 854207153 853180313 852072220 852020416 852032242 852746582
2310.7 852746582 852532349 852404633 851906509 851468735 851344376 850723724 850829239 850170135 849669418 849048920
2320.3 849048920 848530502 848600845 848510437 848401031 847269211 846448135 845532532 845480652 845496750 844890442
2329.9 844890442 845009689 844989777 845831985 846197968 845706711 844191055 843416061 844548721 844881210
2338.6 844881210 843622742 842524109 843873825 844189072 844867859 846204758 845999680 845756073 845201111
2347.3 845201111 846708603 848466721 847938919 845807266 843595886 842206268 842299957 842268219 840329437
2356 840329437 839688263 838697662 837681656 837633972 836709442 837096481 837571869 839458618 840463257 840090179
2365.6 840090179 840900421 841862411 842524643 841966705 842195816 843125992 844237671 845164948 845924759
$$ packed form
2301H54860229M57230q38623j45721k29569J03607j026840j108093n1804J1826P14340
2310.7H52746582k14233j27716m98124m37774j24359o20652J05515o59104n00717o20498
2320.3H49048920n18418P0343r0408j09406j131820q21076r15603n1880J6098o06308
2329.9H44890442J19247j9912Q42208L65983m91257j515656p74994J132660L32489
2338.6H44881210j258468j098633J349716L15247O78787J336899k05078k43607n54962
2347.3H45201111J507492J758118n27802k131653k211380j389618R3689l1738j938782
2356H40329437o41174r90601j016006m7684r24530L87039M75388J886749J004639l73078
2365.6H40090179Q10242R61990O62232n57938K29111R30176J111679R27277P59811
$$ plain form
2374.3 845924759 847344666 848438339 849391785 850015259 849993210 849693298 850121231 850995865 852013779
2383 852013779 853338242 853856354 854255447 854503555 854311676 854143524 853842163 853586426 853249512 853114014
2392.6 853114014 853082886 853482513 853983307 854023666 853952255 853416290 852964401 852748718 852564926 852107162
2402.3 852107162 851759872 852303314 852992554 853311310 853192291 853327942 853303375 852554245 851943283 851537781
2411.9 851537781 850916290 850569611 851149673 851372833 851527939 852135162 852004242 851652985 851274109 850797577
2421.6 850797577 850395737 849957581 849583054 849602356 849863358 849922562 850166016 850331726 850051346 849288559
2431.2 849288559 848666916 848452682 847939758 847523804 847674255 848380508 848706970 848480682 848608398 848717880
2440.8 848717880 848479462 847976151 847159424 846132202 845759583 846313324 846788712 846854248 846704025 846320419
$$ packed form
2374.3H45924759J419907J093673R53446O23474k2049k99912M27933Q74634J017914
2383H52013779J324463N18112L99093K48108j91879j68152l01361k55737l36914j35498
2392.6H53114014l1128L99627N00794M0359p1411n35965m51889k15683j83792m57764
2402.3H52107162l47290N43442O89240L18756j19019J35651k4567p49130o10962m05502
2411.9H51537781o21491l46679N80062K23160J55106O07223j30920l51257l78876m76532
2421.6H50797577m01840m38156l74527J9302K61002N9204K43454J65710k80380p62787
2431.2H49288559o21643k14234n12924m15954J50451P06253L26462k26288J27716J09482
2440.8H48717880k38418n03311q16727j027222l72619N53741M75388O5536j50223l83606
$$ plain form
2450.5 846320419 845779953 845180588 844862671 844947968 844493866 844156952 844854355 845672455 846021805 845628204
2460.1 845628204 845379105 845302505 844533005 843601837 843107224 843049927 842997208 843213730 843353348 843224869
2469.8 843224869 843344269 843413162 843124237 842289886 841805420 842004166 841963882 841491394 841430740 841847763
2479.4 841847763 841961746 841937714 841775055 841692581 841421738 840955048 840695343 840205231 840024643 840385818
2489.1 840385818 840842514 840851669 841093597 841327896 840517502 840022278 839730377 839481277 839521561 839524231
2498.7 839524231 839734116 839892731 840112457 840219345 840027390 839435349 839108582 839108887 838640366 838352585
2508.3 838352585 838332825 838729019 839182892 839296112 839196243 838620682 838410721 838382797 837927856 837483292
2518 837483292 837351837 837489014 837689514 837879410 838011932 837906342 837420120 837033997 836847229 836553726
$$ packed form
2450.5H46320419n40466n99365l17917Q5297m54102l36914O97403Q18100L49350l93601
2460.1H45628204k49099p6600p69500r31168m94613n7297n2719K16522J39618j28479
2469.8H43224869J19400O8893k88925q34351m84466J98746m0284m72488o0654M17023
2479.4H41847763J13983k4032j62659q2474k70843m66690k59705m90112j80588L61175
2489.1H40385818M56696R155K41928K34299q10394m95224k91901k49100M0284K670
2498.7H39524231K09885J58615K19726J06888j91955n92041l26767L05m68521k87781
2508.3H38352585j9760L96194M53873J13220r9869n75561k09961k7924m54941m44564
2518H37483292j31455J37177K00500J89896J32522j05590m86222l86123j86768k93503
$$ plain form
2527.6 836553726 836159515 835990982 836153412 836381454 836374817 836073761 836156845 836006317 835623932 835566330
2537.3 835566330 835118179 834770737 834586639 834478378 834645081 834993744 835021820 834539948 834476624 833845901
2546.9 833845901 832644196 832576599 832830658 832181854 832053757 832762909 832621307 832276154 832081985 831842728
2556.6 831842728 831750259 831356125 830859146 830568237 830797882 831050491 830999680 830919647 830946503 830912781
2566.2 830912781 830642853 830280991 829649734 829562378 829459457 828707504 828421783 828577728 828845291 829024963
2575.9 829024963 829032059 828454437 827816544 827723083 827859039 827815704 827089615 826960983 827288666 827357101
2585.5 827357101 827453537 827285538 827011871 826364899 826019211 826054153 825844421 825653381 825527115 825746460
2595.1 825746460 826107635 826290131 826172104 825799713 825186081 824657745 824445648 824391022 824805603 825211411
$$ packed form
2527.6H36553726l94211j68533J62430K28042o637l01056Q3084j50528l82385n7602
2537.3H35566330m48151l47442j84098j08261J66703L48663K8076m81872o3324o30723
2546.9H33845901j201705o7597K54059o48804j28097P09152j41602l45153j94169k39257
2556.6H31842728r2469l94134m96979k90909K29645K52609n0811q0033K6856l3722
2566.2H30912781k69928l61862o31257q7356j02921p51953k85721J55945K67563J79672
2575.9H29024963P096n77622o37893r3461J35956m3335p26089j28632L27683O8435
2585.5H27357101R6436j67999k73667o46972l45688L4942k09732j91040j26266K19345
2595.1H25746460L61175J82496j18027l72391o13632n28336k12097n4626M14581M05808
$$ plain form
2604.8 825211411 825102615 824646606 824513931 824499512 824021835 823569641 823284531 823046570 822462082 822493362
2614.4 822493362 823157501 823112030 822843552 822303467 821731644 821610565 821575241 821160126 820399017 820079880
2624.1 820079880 820211334 820064621 819344635 819036407 819035339 818611984 818278503 817927322 817459564 817247772
2633.7 817247772 817089310 816564713 816406708 816672516 816382217 815660019 815124207 814991608 814522934 813577805
2643.4 813577805 812789307 812568588 812579346 812440262 812403412 812175064 811943970 811616898 811296997 811022110
2653 811022110 810482483 810171204 809683762 809251556 808960571 808643494 808491745 808341141 808378830 808034897
2662.6 808034897 807641296 807467270 806986084 806408844 806036987 805797882 805514908 805526657 805489731 805216217
2672.3 805216217 804549561 803726501 803498535 803386002 803153915 802920609 802880630 802624512 802363815 802336044
$$ packed form
2604.8H25211411j08796m56009j32675j4419m77677m52194k85110k37961n84488L1280
2614.4H22493362O64139m5471k68478n40085n71823j21079l5324m15115p61109l19137
2624.1H20079880J31454j46713p19986l08228j068m23355l33481l51181m67758k11792
2633.7H17247772j58462n24597j58005K65808k90299p22198n35812j32599m68674r45129
2643.4H13577805p88498k20719J0758j39084l6850k28348k31094l27072l19901k74887
2653H11022110n39627l11279m87442m32206k90985l17077j51749j50604L7689l43933
2662.6H08034897l93601j74026m81186n77240l71857k39105k82974J1749l6926k73514
2672.3H05216217o66656q23060k27966j12533k32087k33306l9979k56118k60697k7771
$$ plain form
2681.9 802336044 802030182 802002487 801540146 800688171 800414276 800568314 800724869 800250702 799703598 799564667
2691.6 799564667 799450378 798953400 798555069 798493805 798175888 797776947 797528839 797447662 797129517 796734238
2701.2 796734238 796449203 795994720 795665283 795549545 795394974 794896393 794581451 794322891 793718338 793326645
2710.9 793326645 793165359 792980804 792856064 792705688 791809464 791026230 790992661 791100388 791127930 790629120
2720.5 790629120 790394440 790390472 790298233 790288467 789920044 789293518 788568878 788278503 787954712 787644653
2730.2 787644653 787714844 787586899 787235641 786650391 786359634 786052933 785875778 785721512 785024414 784878540
2739.8 784878540 784817429 784673920 784757614 784437027 783948822 783843231 784041138 783774719 783261871 783130569
2749.4 783130569 783055420 782440033 781935501 781928635 781708755 781682968 781601791 781297760 781243744 780992050 780483246
$$ packed form
2681.9H02336044l05862k7695m62341q51975k73895J54038J56555m74167n47104j38931
2691.6G99564667j14289m96978l98331o1264l17917l98941k48108q1177l18145l95279
2701.2G96734238k85035m54483l29437j15738j54571m98581l14942k58560o04553l91693
2710.9G93326645j61286j84555j24740j50376q96224p83234l3569J07727K7542m98810
2720.5G90629120k34680l968r2239r766l68423o26526p24640k90375l23791l10059
2730.2G87644653P0191j27945l51258n85250k90757l06701j77155j54266o97098j45874
2739.8G84878540o1111j43509Q3694l20587m88205j05591J97907k66419n12848j31302
2749.4G83130569p5149o15387n04532o866k19880k5787q1177l04031n4016k51694n08804
$$ plain form
2760 780483246 779893875 779770889 780352631 780726013 780359573 779662247 779127045 778743744 778475266 778469238
2769.7 778469238 778385773 778244858 778466873 778385239 777887192 777630463 777599792 777347031 776669846 776390915
2779.3 776390915 776333466 775663223 775043945 774846954 774751816 774682617 774458847 774169006 774002686 773812332
2789 773812332 773530807 772984924 772280960 771719131 771543350 771595078 771151581 770643539 770447998 769829178
2798.6 769829178 768712692 767942047 767740936 767426224 766641083 765748672 765456924 765177917 764594574
2807.3 764594574 764260635 763799591 763031540 762237015 761836853 761187820 760551834 760236435 759166946
2816 759166946 758535538 758230057 757348099 756678085 756178055 755491104 754696121 754200134 753298340 751981888
2825.6 751981888 750895004 749895935 749172592 748259583 747331467 747074738 746848755 745888824 744741974
$$ packed form
2760G80483246n89371j22986N81742L73382l66440o97326n35202l83301k68478o028
2769.7G78469238q3465j40915K22015q1634m98047k56729l0671k52761o77185k78931
2779.3G76390915n7449o70243o19278j96991r5138o9199k23770k89841j66320j90354
2789G73812332k81525n45883p03964n61829j75781N1728m43497n08042j95541o18820
2798.6G69829178j116486p70645k01111l14712p85141q92411k91748k79007n83343
2807.3G64594574l33939m61044p68051p94525m00162o49033o35986l15399j069489
2816G59166946o31408l05481q81958o70014n00030o86951p94983m95987r01794j316452
2825.6G51981888j086884r99069p23343r13009r28116k56729k25983r59931j146850
$$ plain form
2834.3 744741974 743725357 742902756 742454758 741351395 739872589 738560715 737294998 736409454 735534973
2843 735534973 734502029 733302536 732328339 731466904 730020599 728057480 726071930 724956055 724301987
2851.7 724301987 723306503 722484207 721777725 720544586 719337692 718558578 717619553 716210022 714541931
2860.3 714541931 713288651 712252579 711158752 710120239 708773041 706983032 704982834 703298492
2868.1 703298492 701524887 699606552 697888489 695851288 693752289 691795578 689592819 687233734
2875.8 687233734 685290451 683377304 681065216 678909302 677107849 675525360 673786011 672240372
2883.5 672240372 671005783 669730530 668361664 666882553 666147003 665875854 665439148 664932556 664445953
2892.2 664445953 663955231 663380890 663705673 663917923 662945786 662220917 662019653 661743698 661332016 660927353
$$ packed form
2834.3G44741974j016617q22601m47998j103363j478806j311874j265717q85544q74481
2843G35534973j032944j199493r74197q61435j446305j963119j985550j115875o54068
2851.7G24301987r95484q22296p06482j233139j206894p79114r39025j409531j668091
2860.3G14541931j253280j036072j093827j038513j347198j790009k000198j684342
2868.1G03298492j773605j918335j718063k037201k098999j956711k202759k359085
2875.8F87233734j943283j913147k312088k155914j801453j582489j739349j545639
2883.5F72240372j234589j275253j368866j479111p35550k71149m36706n06592m86603
2892.2F64445953m90722n74341L24783K12250r72137p24869k01264k75955m11682m04663
$$ plain form
2901.8 660927353 660342102 659719238 659200668 658739700 658391190 657913208 657442474 656708450 655600357
2910.5 655600357 654367294 652959290 651623230 650305710 649001389 648013687 646746140 645016022
2918.2 645016022 643551025 641930237 640403442 639238853 637953491 636950722 635808716 634608192
2925.9 634608192 633751259 633359756 633398743 633429565 633426704 633086586 633210831 633690567 634021263 634812393
2935.6 634812393 635795975 637140350 638880119 640597153 642095718 644145355 646756058 648922882
2943.3 648922882 650723038 652352219 654291000 656256943 658283539 660417557 662663269 665669327
2951 665669327 668461609 670653534 672557907 674762192 677082291 679022064 681112747 683351593 685917892
2959.7 685917892 688299255 690689545 692863998 694283524 695953598 697482224 698758240 700478973
$$ packed form
2901.8F60927353n85251o22864n18570m60968l48510m77982m70734p34024j108093
2910.5F55600357j233063j408004j336060j317520j304321r87702j267547j730118
2918.2F45016022j464997j620788j526795j164589j285362j002769j142006j200524
2925.9F34608192q56933l91503L8987L0822k861l40118J24245M79736L30696P91130
2935.6F34812393R83582J344375J739769J717034J498565K049637K610703K166824
2943.3F48922882J800156J629181J938781J965943K026596K134018K245712L006058
2951F65669327K792282K191925J904373K204285K320099J939773K090683K238846K566299
2959.7F85917892K381363K390290K174453J419526J670074J528626J276016J720733
$$ plain form
2967.4 700478973 702366486 703821487 705311356 707021713 708617859 710548096 712142181 712870407
2975.1 712870407 713614807 715204086 717115173 718692245 719996796 721161804 722756729 724296112
2982.8 724296112 725287552 725984650 726692734 727690353 728560333 729215546 730089493 731074829 731890488 732854309
2992.5 732854309 734024048 735341492 736094437 736284409 736671677 736339951 736044235 736428452 736670456
3001.1 736670456 736920471 737229080 737799377 738432999 738758087 738381653 737405319 736803665 736779480 736586533
3010.8 736586533 736375580 736362152 735803833 735647202 735912552 735600815 734322281 732821655 732732315 732603760
3020.4 732603760 731912155 731311111 730810089 730437393 729561005 728959808 728370895 727397079 726552429 725933151
3030.1 725933151 724918060 723484879 723232880 723209686 722522812 721476822 720373840 719563675 718533630
$$ packed form
2967.4G00478973J887513J455001J489869J710357J596146J930237J594085P28226
2975.1G12870407P44400J589279J911087J577072J304551J165008J594925J539383
2982.8G24296112R91440O97098P08084R97619Q69980O55213Q73947R85336Q15659R63821
2992.5G32854309J169739J317444P52945J89972L87268l31726k95716L84217K42004
3001.1G36670456K50015L08609N70297O33622L25088l76434r76334o01654k4185j92947
3010.8G36586533k10953j3428n58319j56631K65350l11737j278534j500626q9340j28555
3020.4G32603760o91605o01044n01022l72696q76388o01197n88913r73816q44650o19278
3030.1G25933151j015091j433181k51999k3194o86874j045990j102982q10165j030045
$$ plain form
3038.7 718533630 717591400 716583862 715425568 714331207 713274078 712652359 712059326 710975189 709635773
3047.4 709635773 708445663 707533569 706702957 705290298 703848877 703045731 702601700 702238083 701118622
3056.1 701118622 699751282 698876190 698297577 697334518 695880051 694752731 693700943 692429123 690782700
3064.8 690782700 689688339 688968658 687777939 686691742 685478287 684569016 683687744 682478333 681227417
3073.5 681227417 679845734 678837357 678178329 677633286 676811066 675666199 674018707 672559128 671630859
3082.1 671630859 670128937 668499451 667484055 667042618 665857391 664417725 663526001 662447662 661447144
3090.8 661447144 660050583 658771057 657166595 655631256 655020294 653833618 652957077 652277985 651037598
3099.5 651037598 649540558 648529663 647816315 646069107 644443359 643300552 642348404 641414108 640530396
$$ packed form
3038.7G18533630r42230j007538j158294j094361j057129o21719n93033j084137j339416
3047.4G09635773j190110r12094q30612j412659j441421q03146m44031l63617j119461
3056.1G01118622j367340q75092n78613r63059j454467j127320j051788j271820j646423
3064.8F90782700j094361p19681j190719j086197j213455r09271q81272j209411j250916
3073.5F81227417j381683j008377o59028n45043q22220j144867j647492j459579r28269
3082.1F71630859j501922j629486j015396m41437j185227j439666q91724j078339j000518
3090.8F61447144j396561j279526j604462j535339o10962j186676q76541o79092j240387
3099.5F51037598j497040j010895p13348j747208j625748j142807r52148r34296q83712
$$ plain form
3108.2 640530396 639727364 638460579 637504883 636454887 635100212 633782387 632479858 631091385 629703178
3116.9 629703178 629192619 628404655 627025337 626274261 625596619 623980827 621992035 620797386 620098801
3125.5 620098801 619230118 617704697 616293983 615603180 614650116 613570633 612835388 611739807 610553093
3134.2 610553093 609477959 607730331 606136284 604965019 604120293 603625069 602635803 601405449 600046997
3142.9 600046997 599141998 598431435 597216797 595950737 594401970 593255157 592799377 592266846 591211205
3151.6 591211205 590089645 589117661 587845345 586705322 585512428 584351921 583536682 582934113 582159119
3160.3 582159119 580943756 579914398 578906670 577869225 577078018 576137695 574819107 573794098 573024025
3168.9 573024025 571966896 571163216 570415115 569328079 568213463 567490997 566368675 565035248 564221802
$$ packed form
3108.2F40530396q03032j266785r55696j049996j354675j317825j302529j388473j388207
3116.9F29703178n10559p87964j379318p51076o77642j615792j988792j194649o98585
3125.5F20098801q68683j525421j410714o90803r53064j079483p35245j095581j186714
3134.2F10553093j075134j747628j594047j171265q44726m95224r89266j230354j358452
3142.9F00046997r04999p10563j214638j266060j548767j146813m55780n32531j055641
3151.6E91211205j121560r71984j272316j140023j192894j160507q15239o02569p74994
3160.3E82159119j215363j029358j007728j037445p91207r40323j318588j025009p70073
3168.9E73024025j057129q03680p48101j087036j114616p22466j122322j333427q13446
$$ plain form
3177.6 564221802 562937737 561944389 561120644 560307274 559662170 558595276 558132858 557577629 556468315
3186.3 556468315 555331802 554279251 553370018 552404976 551555634 550410805 549527817 549252777 548874588
3195 548874588 548082275 547344627 546646500 545480881 544180260 542828827 542149696 541778717 541358833
3203.6 541358833 540960350 540435867 540123596 538876495 537503090 536675072 535863914 534895744 533725014
3212.3 533725014 533278542 532783165 532358246 531937180 531339455 531013336 529996948 529019432 528395576
3221 528395576 527673607 526985359 526471481 526353226 526315079 525728302 524695396 524044876 523331833 522259445
3230.7 522259445 521404953 521175537 520470619 519427071 519242973 518781738 518463287 518386650 517826805 516574326
3240.3 516574326 515641212 515842972 515321121 514407654 513326797 512767296 512818298 512514420 512574387 511887779
$$ packed form
3177.6E64221802j284065r93348q23745q13370o45104j066894m62418n55229j109314
3186.3E56468315j136513j052551r09233r65042q49342j144829q82988k75040l78189
3195E48874588p92313p37648o98127j165619j300621j351433o79131l70979m19884
3203.6E41358833l98483n24483l12271j247101j373405q28018q11158r68170j170730
3212.3E33725014m46472m95377m24919m21066n97725l26119j016388r77516o23856
3221E28395576p21969o88248n13878j18255l8147n86777j032906o50520p13043j072388
3230.7E22259445q54492k29416p04918j043548j84098m61235l18451p6637n59845j252479
3240.3E16574326r33114K01760n21851r13467j080857n59501N1002l03878N9967o86608
$$ plain form
3249.9 511887779 511120758 510566864 509831123 509325180 508886528 508691597 507787323 507208519 507056122 506831055
3259.6 506831055 506515160 505665627 505285797 504845200 504446144 504022217 503584404 503468132 503066750 503090973
3269.2 503090973 503258667 502678680 501654243 501187439 500704727 500005188 499794464 499705887 499791832 499594841
3278.9 499594841 499444389 499084244 498547287 498244667 497296944 496665878 496757851 496819153 496107674 495395126
3288.5 495395126 495428200 495290298 494974022 494345551 493886566 493459625 493090210 492872620 491884880 490938644
3298.2 490938644 490469284 490706482 491119461 490687447 490092125 489429855 488604393 488182182 488244514 488167686
3307.8 488167686 487942123 487838440 487402077 486739807 486206093 485361633 484797096 484921379 484439545 483827362
3317.4 483827362 483564453 482840538 482203979 481914635 481558990 481387291 481049042 479954185 479060707
$$ packed form
3249.9E11887779p67021n53894p35741n05943m38652j94931r04274n78804j52397k25067
3259.6E06831055l15895q49533l79830m40597l99056m23927m37813j16272m01382K4223
3269.2E03090973J67694n79987j024437m66804m82712o99539k10724q8577Q5945j96991
3278.9D99594841j50452l60145n36957l02620r47723o31066R1973O1302p11479p12548
3288.5D95395126L3074j37902l16276o28471m58985m26941l69415k17590r87740r46236
3298.2D90938644m69360K37198M12979m32014n95322o62270q25462m22211O2332p6828
3307.8D88167686k25563j03683m36363o62270n33714q44460n64537J24283m81834o12183
3317.4D83827362k62909p23915o36559k89344l55645j71699l38249j094857q93478
$$ plain form
3326.1 479060707 478500900 477997971 477760010 477505951 477426376 477210121 476930656 476347389 475355644 474934082
3335.8 474934082 474539337 473582153 472619171 472196007 471980438 471617928 471103630 470680275 470577431 470280914
3345.4 470280914 469600487 468415413 467394447 467015533 467118721 467125587 466537247 465977707 465243187 464855003
3355.1 464855003 464247665 462983894 462436600 462063408 461492462 460553551 459775696 459436111 459056969
3363.7 459056969 458834877 458347969 457791481 457346268 456689682 455503197 454792442 454789619 454242210 453607788
3373.4 453607788 453111763 452484055 451580772 450837784 450553589 450666809 450644875 449825439 449236794 448616600
3383 448616600 448056755 447691994 447124062 447034836 446780739 446505165 446588860 446537628 445992355 445615845
3392.7 445615845 445532875 445100899 445040703 444734154 443820610 443331947 443428993 442983055 442113342 441911049
$$ packed form
3326.1D79060707n59807n02929k37961k54059p9575k16255k79465n83267r91745m21562
3335.8D74934082l94745r57184r62982m23164k15569l62510n14298m23355j02844k96517
3345.4D70280914o80427j185074j020966l78914J03188O866n88340n59540p34520l88184
3355.1D64855003o07338j263771n47294l73192n70946r38911p77855l39585l79142
3363.7D59056969k22092m86908n56488m45213o56586j186485p10755k823n47409o34422
3373.4D53607788m96025o27708r03283p42988k84195J13220k1934q19436n88645o20194
3383D48616600n59845l64761n67932q9226k54097k75574Q3695n1232n45273l76510
3392.7D45615845q2970m31976o0196l06549r13544m88663R7046m45938q69713k02293
$$ plain form
3402.3 441911049 441887703 441925583 441736679 441531487 441062889 440790749 441461029 441253815 440492058 440087967
3412 440087967 440077972 440074654 439866600 439837685 439728622 439608345 439137726 438768806 438107567 437719154 438488655
3422.6 438488655 438866997 438617897 438078156 438078651 437727776 437003517 437467766 437917137 437936249 437986107
3432.2 437986107 438397942 438439255 437787628 437693672 437940521 437985725 438495331 438992043 439185562 439655533
3441.8 439655533 438957443 438631859 439151840 439117813 439375420 439098129 439604187 440053253 439915695 440691338
3451.5 440691338 440996819 441031723 441436234 441827660 441559601 441632080 442207375 442837601 443715935 443700600
3461.1 443700600 443930511 444040642 444297638 444958229 444948730 445066948 445170975 445923309 446352348 446727943
3470.8 446727943 447793083 448364563 448704872 448562088 448336372 448517265 449490471 449815063 449719353 450825577
$$ packed form
3402.3D41911049k3346L7880j88904k05192m68598k72140O70280k07214p61757m04091
3412D40087967r995l318k08054k8915j09063j20277m70619l68920o61239l88413P69501
3422.6D38488655L78342k49100n39741M95l50875p24259M64249M49371J9112M9858
3432.2D37986107M11835M1313o51627r3956K46849M5204N09606M96712J93519M69971
3441.8D39655533o98090l25584N19981l4027K57607k77291N06058M49066j37558P75643
3451.5D40691338L05481L4904M04511L91426k68059P2479N75295O30226Q78334j5335
3461.1D43700600K29911J10131K56996O60591r499J18218J04027P52334M29039L75595
3470.8D46727943J065140N71480L40309j42784k25716J80893R73206L24592r5710J106224
$$ plain form
3480.4 450825577 451642761 451728516 451449356 452427025 453006172 452668304 453512001 453740196 454073067 455239754
3490.1 455239754 455910797 455617752 455920219 456815605 456954079 457649231 458313713 458824615 459304619 459499092
3499.7 459499092 459953346 460856628 461641006 461181145 461395798 462266884 463222351 464439583 465321770
3508.4 465321770 464854431 464013977 465381584 466404343 466607246 467140656 467884789 468525887 468682747
3517.1 468682747 469766388 470691605 470942917 471690445 473269234 474115829 473466606 474016991 475116959
3525.7 475116959 476284065 476970291 477042313 477060776 477341042 477766151 478530922 479998360 480385551 481473503
3535.4 481473503 482305946 482169495 483311615 483978081 485067520 485847893 486935616 488198586 488509979
3544.1 488509979 488713150 489007072 490564346 490214806 491016045 492902832 494349174 495498314 494111862
$$ packed form
3480.4D50825577Q17184Q5755k79160R77669N79147l37868Q43697K28195L32871J166687
3490.1D55239754O71043k93045L02467Q95386J38474O95152O64482N10902M80004J94473
3499.7D59499092M54254R03282P84378m59861K14653Q71086R55467J217232Q82187
3508.4D65321770m67339q40454J367607J022759K02903N33410P44133O41098J56860
3517.1D68682747J083641R25217K51312P47528J578789Q46595o49223N50385J099968
3525.7D75116959J167106O86226P2022J8463K80266M25109P64771J467438L87191J087952
3535.4D81473503Q32443j36451J142120O66466J089439P80373J087723J262970L11393
3544.1D88509979K03171K93922J557274l49540Q01239J886787J446342J149140j386452
$$ plain form
3552.7 494111862 495577202 497376137 498769798 499909859 499874344 501914215 503327065 503761711 503595886
3561.4 503595886 505459824 506804276 507144089 511279602 510686989 509461555 509301453 509342346 513521385
3570.1 513521385 515265045 517233887 519623795 521097832 521696129 522093735 523458061 524446373 527276802
3578.8 527276802 528226204 528191986 530029297 531872673 533292961 534226189 538709793 540610046 538681946
3587.5 538681946 539377098 538197479 542160568 546081886 548939323 550069008 550230026 553136864 552060471
3596.1 552060471 554825439 558393135 558717880 561066818 560800514 562523804 565672455 567141190 569282341
3604.8 569282341 572524910 575343933 574251785 577182350 576767159 577162933 584852562 584060478 581846809
3613.5 581846809 586056480 585548592 590692863 595655060 595031166 595912209 594963226 596368446 599888535
$$ packed form
3552.7D94111862J465340J798935J393661J140061l5515K039871J412850M34646j65825
3561.4E03595886J863938J344452L39813M135513n92613j225434j60102M0893M179039
3570.1E13521385J743660J968842K389908J474037N98297L97606J364326R88312K830429
3578.8E27276802R49402l4218J837311J843376J420288R33228M483604J900253j928100
3587.5E38681946O95152j179619L963089L921318K857437J129685J61018K906838j076393
3596.1E52060471K764968L567696L24745K348938k66304J723290L148651J468735K141151
3604.8E69282341L242569K819023j092148K930565m15191L95774P689629p92084k213669
3613.5E81846809M209671n07888N144271M962197o23894Q81043r48983J405220L520089
$$ plain form
3622.2 599888535 602665863 605166359 607501640 608589401 610455551 617518311 616303253 604960861
3629.9 604960861 609951134 614984779 620451546 621438293 619342155 622616539 626629982 628945961
3637.6 628945961 628998718 629688797 631973228 634755630 635379562 635884171 638927040 642885361 648959656
3646.3 648959656 646620483 641938782 646940613 645306473 642475128 644053345 651105957 655515671
3654 655515671 658626862 661390457 652192841 655597992 661387405 662773209 664374466 665107346 667349930
3662.7 667349930 668585052 670230560 671482391 672122803 676712723 678664246 677698517 676236801 669482040
3671.4 669482040 674074478 683374252 691448212 684424210 664444199 672650528 683260040 688424759
3679.1 688424759 685512619 686597443 690187683 692029343 693495483 693361740 693608170 697815933 702921219
$$ packed form
3622.2E99888535K777328K500496K335281J087761J866150P062760j215058j1342392
3629.9F04960861M990273N033645N466767R86747k096138L274384M013443K315979
3637.6F28945961N2757O90079K284431K782402O23932N04609L042869L958321O074295
3646.3F48959656k339173m681701N001831j634140k831345J578217P052612M409714
3654F55515671L111191K763595r197616L405151N789413J385804J601257P32880K242584
3662.7F67349930J235122J645508J251831O40412M589920J951523r65729j461716o754761
3671.4F69482040M592438R299774Q073960p024002j9980011Q206329J0609512N164719
3679.1F88424759k912140J084824L590240J841660J466140j33743K46430M207763N105286
$$ plain form
3687.8 702921219 691407166 689921646 699289017 692604828 693868332 699967499 701188965 703558884
3695.5 703558884 703603897 703820114 705206146 705330734 708648758 711624298 705578232 703625031 708584518
3704.1 708584518 710242462 710872421 711772690 714986954 718647614 710282135 714766693 717219772 702590714
3712.8 702590714 709813004 715671005 716299667 717647552 720140915 720366516 716634521 718565369 724507904
3721.5 724507904 720260010 715516281 720729065 721921921 721731949 718852158 719105072 723326569 725040970
3730.2 725040970 730824738 725984192 719397659 729354477 727052612 716271896 718521805 722744293
3737.9 722744293 724736481 728005829 730770187 727221298 731466370 742600174 727365112 714192276
3745.6 714192276 726238785 732604523 739378662 733570633 722153168 734415283 727864914 723345413
$$ packed form
3687.8G02921219j1514053j485520R367371o684189J263504O099167J221466K369919
3695.5G03558884M5013K16217J386032J24588L318024K975540o046066j953201M959487
3704.1G08584518J657944O29959R00269L214264L660660q365479M484558K453079j4629058
3712.8G02590714P222290N858001O28662J347885K493363K25601l731995J930848N942535
3721.5G24507904m247894m743729N212784J192856j89972k879791K52914M221497J714401
3730.2G25040970N783768m840546o586533R956818k301865j0780716K249909M222488
3737.9G22744293J992188L269348K764358l548889M245072J1133804j5235062j3172836
3745.6G14192276J2046509O365738O774139n808029j1417465J2262115o550369m519501
$$ plain form
3753.3 723345413 731107178 735564423 737692261 732729034 735645447 739666748 731377945 731856308
3761 731856308 736874542 737768707 738549728 742527466 738335724 733944473 738655777 743735046 742656326
3769.7 742656326 733744888 736979446 740789566 741210709 741872711 741147842 742208099 743481903 746412964
3778.4 746412964 744808731 736989899 740868988 743631821 744518127 745827179 742183762 741723480 743701096
3787.1 743701096 745060577 745347748 745511703 746950760 746757355 746883850 746911469 748532486 751298141
3795.8 751298141 746400833 743858871 746611023 750405045 755285645 746661301 737641678 743125610
3803.5 743125610 747370300 752202377 755964355 744773102 742674255 748485565 750300522 750958786
3811.2 750958786 752155380 752571259 753376541 757887726 752876205 739704971 747955170 754403076
$$ packed form
3753.3G23345413P761765M457245K127838m963227K916413M021301q288803M78363
3761G31856308N018234Q94165P81021L977738m191742m391251M711304N079269j078720
3769.7G42656326q911438L234558L810120M21143O62002p24869J060257J273804K931061
3778.4G46412964j604233p818832L879089K762833Q86306J309052l643417m60282J977616
3787.1G43701096J359481K87171J63955J439057j93405J26495K7619J621017K765655
3795.8G51298141m897308k541962K752152L794022M880600q624344r019623N483932
3803.5G43125610M244690M832077L761978j1191253k098847N811310J814957O58264
3811.2G50958786J196594M15879Q05282M511185n011521j3171234Q250199O447906
$$ plain form
3818.9 754403076 758801346 757326126 737323990 742851486 750157394 753234329 755949554 754481812
3826.6 754481812 749762497 751940765 754887543 757581100 757872849 749646912 754371033 761152802
3834.3 761152802 752854080 752931976 761183014 751507950 748871307 756350327 749352341 751565475 758912506
3843 758912506 754872513 752224350 756120071 757961502 757828751 759321671 758529053 760796356 764749527
3851.7 764749527 755680618 756119156 740867157 746376038 757938232 756711578 755792465 758762512
3859.4 758762512 761373825 762962952 757145309 757921677 763844604 756822739 753489838 758794632
3867.1 758794632 763801270 768669968 757988281 750301971 756153641 763486481 765751572 753773804
3874.8 753773804 756674576 761526794 761287460 763472977 766605835 759241943 754176712 762084503
$$ packed form
3818.9G54403076M398270j475220k0002136N527496P305908L076935K715225j467742
3826.6G54481812m719315K178268K946778K693557K91749q225937M724121O781769
3834.3G61152802q298722P7896Q251038r675064k636643P479020o997986K213134P347031
3843G58912506m039993k648163L895721J841431j32751J492920p92618K267303L953171
3851.7G64749527r068909M38538j5251999N508881J1562194j226654r19113K970047
3859.4G58762512K611313J589127n817643P76368N922927p021865l332901N304794
3867.1G58794632N006638M868698j0681687p686310N851670P332840K265091j1977768
3874.8G53773804K900772M852218k39334K185517L132858p363892n065231P907791
$$ plain form
3882.6 762084503 763435593 765461121 769361649 755371552 758155975 762760849 764200134 767930756
3890.3 767930756 763796768 755492477 759879913 763691101 761552277 763504028 765303268 767283936
3898 767283936 766946259 758569946 766080475 767011871 761347961 765942993 761495285 759512558 760239792
3906.7 760239792 761685257 763949738 764090271 764605255 764227982 764267044 764862289 765401459 767268372
3915.3 767268372 768909607 764173965 761609573 766692734 764875336 761064453 764331436 766060867
3923.1 766060867 766880722 763992081 761612244 764416199 765733643 766532898 766390076 766620636 768514786
3931.7 768514786 765404510 763119736 765214233 766587524 767202301 767320175 766795044 766687164 766419525
3940.4 766419525 767585602 768008194 764350510 764775925 766575546 768132172 768981247 766017914 766797104
$$ packed form
3882.6G62084503J351090K025528L900528j3990097K784423M604874J439285L730622
3890.3G67930756m133988q304291M387436L811188k138824J951751J799240J980668
3898G67283936l37677q376313P510529R31396n663910M595032m447708j982727P27234
3906.7G60239792J445465K264481J40533N14984l77273L9062N95245N39170J866913
3915.3G67268372J641235m735642k564392N083161j817398l810883L266983J729431
3923.1G66060867Q19855k888641k379837K803955J317444P99255j42822K30560J894150
3931.7G68514786l110276k284774K094497J373291O14777J17874n25131j07880k67639
3940.4G66419525J166077M22592l657684M25415J799621J556626Q49075k963333P79190
$$ plain form
3949.1 766797104 766405258 764860535 767736893 767952347 766953430 767004929 767748566 768059845 767422104
3957.8 767422104 767841949 767430649 767941589 767845993 766564636 767672729 768599472 768622055 768442688 768389740
3967.4 768389740 769032440 769268341 768593674 768395309 768310699 768002625 768201675 768519058 768655777 767839584
3977.1 767839584 767851562 768210907 767782898 768310318 768367538 768427887 769172516 769275131 768955231 769240112
3986.7 769240112 769868240 769841385 769846268 769193192 769099121 770083008 770228195 770101318 769511871 768893585
3996.3 768893585 769202805 769992905 770231400 770329514
4000.2 770329514
$$ packed form
3949.1G66797104l91846j544723K876358K15454r98917N1499P43637L11279o37741
3957.8G67422104M19845m11300N10940r5596j281357J108093R26743K2583j79367n2948
3967.4G68389740O42700K35901o74667j98365q4610l08074J99050L17383J36719q16193
3977.1G67839584J1978L59345m28009N27420N7220O0349P44629J02615l19900K84881
3986.7G69240112O28128k6855M883o53076r4071R83887J45187j26877n89447o18286
3996.3G68893585L09220P90100K38495R8114
4000.2G70329514
##END=$$ End of the data block
