##TITLE=$$ Begin of the data block
##JCAMP-DX=5.00 $$ ACD/SpecManager v 10.08
##SPECTROMETER/DATA SYSTEM=Varian
##DATE=15 Jan 2013 14:56:32
##DATA TYPE=INFRARED SPECTRUM
##DATA CLASS=XYDATA
##ORIGIN=
##OWNER=
##NPOINTS=3735
##FIRSTX=399.26403809
##LASTX=4000.35498047
##MAXX=4000.35498047
##MINX=399.26403809
##MAXY=85.76209259
##MINY=37.45439911
##XFACTOR=1.0000000000
##YFACTOR=0.000000100000000
##FIRSTY=69.96038818
##DELTAX=0.96440572
##XUNITS=1/CM
##YUNITS=TRANSMITTANCE
##XYDATA=(X++(Y..Y))
399.3 699603882 697065887 680073318 675269394 664362106 655338287 651619110 643118744 643000870
407 643000870 642927322 645191345 657849426 663785858 664799652 664026413 661635971 660818176 660801773
415.7 660801773 658872147 662774277 674903870 661002121 656918869 666322632 676164780 667696609
423.4 667696609 658343430 658475571 654808655 653319397 649171524 641303406 641156921 649216995 651629562
432.1 651629562 650230408 654177856 648400803 637470818 636295280 638440819 640706482 643137894
439.8 643137894 645338516 648576889 648673096 643930359 648057556 653664703 652013321 654611053 657691193
448.4 657691193 657415161 659407043 662691193 662634125 663388214 664199905 659157486 654976730 652768860
457.1 652768860 647459946 649126740 654857407 660218811 664677658 666854782 663949203 662336502
464.8 662336502 659973755 653324738 647335815 649462509 654019470 654276733 653397903 650276184 649174652
473.5 649174652 644874954 642544174 644670563 639993324 640303879 641225281 638888092 640962067 642936783
482.2 642936783 643182449 638027229 637948990 639232216 633801804 631852264 635125809 638914795 639090157
490.9 639090157 640775909 642496567 641705551 640806274 637280197 630819740 626372871 629501343 631354027
499.6 631354027 632189674 635797234 634283485 632726440 633912735 634312820 633075943 631065979 629295006
508.2 629295006 626306305 622521477 621035461 621638260 620357132 619969711 620188026 618407745 613400154
516.9 613400154 605908394 601875076 599247437 599764671 602262688 604821815 605370255 602674408 601855202
525.6 601855202 602025490 599222641 595801620 597894707 600956421 601732826 604546890 606233978 607573929
534.3 607573929 608162498 609054222 610552330 609856949 609579430 610776482 614557228 619062958 621729813
543 621729813 623307877 624988327 626052971 625736008 625218735 624337311 622462006 620665855 621501389
551.6 621501389 622773476 622189522 622338219 622315674 620677795 617848625 614558067 611146622 607492790
560.3 607492790 604956322 603959961 604999046 605060158 603265915 600132294 594917755 590647011 587650757
569 587650757 584512253 580055695 575918465 574080620 574665718 575308075 575994225 578513298 578526001
577.7 578526001 578326988 578779564 580760498 583901787 586904793 590337524 592954941 597449417 601155968
586.4 601155968 604044914 607009964 609435806 610153999 609654350 610716476 610712395 612090530 614298706
595 614298706 615889816 616697540 615513802 615349922 615050049 614687004 613285446 611697044 612363663
603.7 612363663 613442879 614566956 614987450 616015663 616989746 617508469 617076111 615168762 614628677
612.4 614628677 615160065 616242828 617889023 620408096 622502251 624880371 627285271 627966385 629228630
621.1 629228630 630204887 630950699 632684746 635421028 638878555 641979752 643982620 645006104 646871643
629.8 646871643 648695145 649608231 649889526 650102615 649887085 650049057 651241684 652337418 654029694
638.4 654029694 654978027 656492996 657016907 655154648 653853149 652504807 653002777 655055389 657304459
647.1 657304459 658571014 659177246 661609497 662554016 661728439 659672852 657690125 656921692 656550751
655.8 656550751 658791962 661969604 664599991 666557007 666800385 666061554 665515366 664750366 663952255
664.5 663952255 664547958 666552200 667110138 659529343 664896393 670292740 671603165 671711121 670688095
673.2 670688095 669082489 668298264 668712921 669409561 670477905 673376846 676162262 677114716 676445694
681.8 676445694 675862198 675438919 675116119 674812546 674292450 674818115 676310501 678587189 679198303
690.5 679198303 679268799 679653244 678642349 677604599 675876770 674635315 673129425 671492004 671999359
699.2 671999359 672164001 672201157 671626358 670247879 668164368 664960251 662733154 661551819 661446838
707.9 661446838 661507645 662249374 663951416 665457764 667259979 668293457 669066086 670203400 671462936
716.6 671462936 673248367 674856949 676770477 679532089 682458954 685483170 688475342 691172638
724.3 691172638 692351685 693204117 696172180 698684845 700070114 701009064 702305069 705898209 709758911
733 709758911 712051773 713035202 713085022 711678238 710536499 711153259 712063293 713105774 714069672 715168228
742.6 715168228 716496048 717042618 715712204 713136597 710549088 707313232 704331970 701794205 699167709
751.3 699167709 698152847 698150482 697324753 695629349 693199081 690217590 687047577 684034958 681499176
760 681499176 679827499 679389648 680192261 681719818 682777863 682771683 682899628 683227844 683307953 684487762
769.6 684487762 686034927 687746887 690783691 695279007 701129761 706480713 709867935 712539902
777.3 712539902 715333176 717068787 718874741 720687408 722580490 725797424 729054337 732235565
785 732235565 735485535 738430786 739951935 740707932 740925522 740415573 740940018 741997375 744154739
793.7 744154739 747367935 750432663 753138275 754951782 756247940 757494888 758003082 758187790 759340134
802.4 759340134 759701843 761152954 764639664 767880402 770654678 771846161 772757034 772603531 771078873
811.1 771078873 769749756 769421082 770009689 770192642 771873779 774484634 776937561 778151627 776788635
819.7 776788635 775035477 773602829 772239609 770818863 769771347 769637451 770802841 771484909 770613937
828.4 770613937 769925842 767943497 764088593 760428391 756712112 752744980 750811386 749874649 748964005
837.1 748964005 748045120 746189117 744714966 742553482 739657974 736409912 732895203 730685043 729442520
845.8 729442520 729437332 729370804 729324265 730132141 729964371 728587952 726206970 724182434 722134018 719718628
855.4 719718628 718550339 718333206 718806763 719134598 719123001 719396057 719719315 719837265 719499435 720371704
865.1 720371704 723720169 728413620 733054581 738023300 743758926 749414062 754673615 758558578
872.8 758558578 760515747 761921692 763111496 762940445 764270477 767052536 769304123 771271057 772286606
881.5 772286606 772163315 768676682 763955460 760886230 758353729 755622787 753269882 751712341 750284958
890.2 750284958 750166397 749554901 746341324 742489929 739239197 736219025 732996597 730532837 728806076
898.8 728806076 727383194 727462692 728607559 727876358 724977493 721452103 717282639 712647858 708311768
907.5 708311768 705711365 703793030 701818314 700190887 697556992 694140244 689869537 684378510
915.2 684378510 679179459 674830933 670565567 666282806 662575455 660958328 660751724 660182114 658779907
923.9 658779907 657016602 655716324 653926620 652379303 651294785 651049118 652350540 653570786 655839233
932.6 655839233 658552399 660132675 661375122 661832199 662271271 663546448 665028000 666951447 670004272
941.3 670004272 674641113 679085083 681519928 682648926 682165070 680039597 677342606 674277344 670486069
949.9 670486069 666813812 663768539 660593491 656385880 651116257 645498810 638714104 630459785
957.7 630459785 622427254 614214973 605918121 598736382 591942177 585234032 577620010 569833374
965.4 569833374 560974693 551125298 541426773 530697365 520976677 511309357 501836700 491888008
973.1 491888008 482149658 473377838 463901978 455706253 445706062 435801811 426445770 418075829
980.8 418075829 411403503 404275398 399457245 394784050 391608086 387872734 384266357 381753654
988.5 381753654 378556976 376606331 374543991 375085373 374811058 375069160 376264725 377197151 379242554
997.2 379242554 379535599 381049919 380781975 380696754 381313171 381464615 382582741 383307724 385045204
1005.9 385045204 384675484 385460587 385705261 384770622 383729324 381692810 381881180 380764580 380668373
1014.6 380668373 380147324 380430412 382233887 383350029 384963455 384547424 385324669 385368614 386646156
1023.2 386646156 388225365 389139099 391848602 394031296 397690239 399381104 401838608 404476128
1031 404476128 406337166 408262291 409229202 411581764 411921234 413585892 414755821 416403275 418546066
1039.6 418546066 418157120 418941269 418976250 420094528 419788742 420202179 421687965 423065948 425499496
1048.3 425499496 426122780 428155098 428435478 430722008 434325333 436530533 439193497 441075516 445376320
1057 445376320 448979568 453613777 457890205 462598686 468777542 473803329 479175682 483262787 488507423
1065.7 488507423 492962189 497624359 500524673 500360374 499179001 494251595 488791542 481079292
1073.4 481079292 473448563 466042671 459559364 456414909 453347778 453093796 452110863 452618828 453017235
1082.1 453017235 453559456 455085754 455046844 457236862 458113251 460159149 462369995 466350060 471000900
1090.7 471000900 473511429 477606621 480771446 484726410 485750465 486412926 488427544 489806213
1098.5 489806213 491680069 492159958 494403725 495248413 496283875 497790489 498468857 498489876 497375145
1107.1 497375145 498497772 498792534 501032066 503550568 505763817 508951759 511162872 513927689
1114.9 513927689 515081940 516868210 517527008 517847633 518782387 519581985 521293755 522104454 524578056
1123.5 524578056 525803909 526908798 528142700 528601570 529231186 528954506 531490974 534328957 537221222
1132.2 537221222 539515305 541531143 543666573 543834839 543591423 541026497 537862930 533382492 529106560
1140.9 529106560 526363640 522665291 519172554 514315529 510582275 506487160 502326775 498663635
1148.6 498663635 494532013 491382217 488010559 485749321 482653503 482012100 481760216 480997238 482063332
1157.3 482063332 481737442 481915627 481309166 482111015 483133621 484779510 487738686 490748520 495465622
1166 495465622 498973618 503697815 507993965 512641716 517877350 522628136 528557396 534078941 541155701
1174.6 541155701 548119469 555991936 563443642 569167404 575282555 581709976 588034744 592246475
1182.4 592246475 597090454 602178841 608047600 615128365 620907097 626389046 630651512 633948746
1190.1 633948746 636081848 637468948 639024200 640456619 642087250 643613510 645553818 647454605
1197.8 647454605 649571762 650499115 650121078 650037079 649800262 650355682 650772629 651229477 652360992
1206.5 652360992 654148254 656733627 659257050 661608582 662910156 664093399 665227661 666065140
1214.2 666065140 667698669 670040741 672745514 675085602 677721024 680200272 681529236 682190247
1221.9 682190247 682173538 681644135 680667648 679752121 679399490 679870224 681060104 681686630 681532822 680858841
1231.5 680858841 679591370 678052750 676638184 675234070 674228592 673907394 673933182 674705276 675639725
1240.2 675639725 676466522 676737823 676193771 675580826 675048599 674785233 674599609 675128784 676548004
1248.9 676548004 678206482 680200577 682198257 683371887 683614273 683616180 683655701 683531723 683407364
1257.6 683407364 683865967 685298309 687204361 689048309 690511551 691217651 691226196 690779572 690277863
1266.3 690277863 690047150 690259705 691212769 692920837 695100021 697108536 698659286 699749832 699812317
1274.9 699812317 699011002 697835236 696889038 696234512 696095810 696505737 697234650 698163910 698454819
1283.6 698454819 698211975 697727432 696743774 695115433 693357315 692252197 691898804 692062988 692370682
1292.3 692370682 692659531 692662735 692011566 690552979 688761978 687020187 685577087 684672241 684225464
1301 684225464 684566116 685110474 685715637 686301575 686119308 685062027 683194427 681464310 680430374
1309.7 680430374 679838104 679694519 680647125 681595306 681462250 681751709 681546783 680290985 678588638
1318.3 678588638 676021881 674356537 673311844 672198181 672068481 672139282 671778030 670819778 668684158
1327 668684158 665828247 662505188 659422302 656884842 654273834 652465897 651603928 651374130 650754166
1335.7 650754166 649945908 649204330 647798157 645843811 644067535 643713989 643902206 644302292 644624329
1344.4 644624329 645588226 646900940 647466278 647543488 646844788 645965118 644771347 643710632 643407440
1353.1 643407440 643486481 643524246 643574600 644375610 644386597 644218597 643795395 641916580 640035629 637974548
1362.7 637974548 636518898 636984291 637823219 638398514 639013748 638801804 638370438 638987427 638552895
1371.4 638552895 638183708 637538452 637009430 637956696 639813347 642104721 643177338 644321289 644761658
1380.1 644761658 644803009 644661179 644143143 644286041 644694443 646983948 649111252 651019592 654277191
1388.7 654277191 656612778 657592239 658492661 659399643 659053421 657730331 656991196 658545151 660298767
1397.4 660298767 661169586 660468674 660352325 661159439 660162888 659016876 657760086 655011749 654197083
1406.1 654197083 654790497 655007324 654783859 654997787 654303207 653459091 652885056 652180862 651263046 649822464
1415.7 649822464 648741760 648124008 648745270 647259979 648591080 651273117 651887131 651848602 649532852
1424.4 649532852 649335556 650133057 650168152 651380463 651724625 652123566 653597870 655638885 655999603
1433.1 655999603 655714111 656829147 656920166 653433380 653544312 657331161 659251251 660205307 661643372
1441.8 661643372 662386703 663427429 662962418 662457123 661936798 661007156 658929749 659594650 661811523
1450.5 661811523 661685638 661703644 661039047 660852051 660038605 658341446 654831848 650094528 652558746
1459.1 652558746 653233871 655872498 656880035 658185120 660560532 658447266 659633713 660975037
1466.8 660975037 663411407 664780197 667048950 670371475 671562805 675465240 678227081 685260925
1474.6 685260925 688692017 690442352 693841400 696703644 699719696 701715469 704807892 707325287
1482.3 707325287 711640549 715364075 718400879 721805344 721939850 723472061 724450531 724469681 724220505
1491 724220505 728419647 733090668 735697021 739431992 740004807 738588257 741531677 742431564 742054291
1499.6 742054291 743928986 745836945 747073441 750361176 753351212 756135254 752324829 745900497
1507.3 745900497 750820770 753169708 755435486 757029953 757726746 757697296 761114960 763909073 764575272
1516 764575272 764458313 761637497 766609116 768327713 763963013 761093903 761983490 767770920 770026093
1524.7 770026093 770023651 771135635 773456726 773681564 774274368 775764313 775003204 775639496 772569122
1533.4 772569122 770841064 775316772 778419266 781430893 783403244 780578079 770848923 776971054
1541.1 776971054 776531754 775351868 779422379 779052353 779161987 782537918 785473251 786452484 784613495
1549.8 784613495 782357025 784068909 786041946 785843277 782200851 783269043 788681259 792412567
1557.5 792412567 786462021 781459198 779978714 785996170 788518448 789710846 789399719 787542343
1565.2 787542343 788787460 791050949 793289871 792976990 788295288 790545044 793217545 793155518 792707062
1573.9 792707062 793816986 792384872 786134338 789539337 793068771 794216690 794640732 794405289 793819962
1582.6 793819962 793294373 792395096 791946869 791200638 791123428 791564560 791714783 791400452 791106339 791006393
1592.2 791006393 790186996 788650894 786229630 785030289 784276810 783725128 783703995 783651810 783262177
1600.9 783262177 782036209 780578232 778286896 776687851 775295105 773181152 771000290 769645920
1608.6 769645920 768262634 766744461 766305313 764649353 762929764 760760803 759363708 756129532
1616.3 756129532 745206528 747538910 748882828 748702545 747519226 747143173 744876480 738199081
1624 738199081 738656082 738581772 737752533 733328400 730762329 731480637 730605392 730142975 729329681 729930725
1633.7 729930725 730575485 722759399 720127106 721166611 721930161 722761536 723171539 722805481 723487778
1642.4 723487778 723441544 725059509 726700516 722714767 720911331 720990829 724010239 726756592 729877396
1651 729877396 733513336 728230743 718265152 725675049 731796875 734832840 736220474 737468643 738838959
1659.7 738838959 740099945 741475067 741627808 742071381 745746002 748254471 749638138 751615219 752632217
1668.4 752632217 749456787 751159592 754136887 755023499 758705673 762835236 762458954 761022415 764812851
1677.1 764812851 767894592 770068665 770307999 769438324 773516617 777992783 776037903 766719742 773296890
1685.8 773296890 779867477 782873459 782959137 784291916 784769287 785891037 787720871 789041977 791763306
1694.4 791763306 791642227 784565353 789336395 794440918 798910065 792251740 786005859 793815231
1702.1 793815231 797804947 798509750 797657166 798667831 799031067 801860580 805131378 805721130 804988174
1710.8 804988174 805616150 806834183 807366409 805820160 805180588 808389359 808202438 803149872 808740845
1719.5 808740845 812289658 813813400 814374084 813767090 813243942 814159698 815737686 816880875 818076096
1728.2 818076096 819038849 817044754 817201309 820795517 821886826 814042816 808722000 815640945 819914169
1736.9 819914169 821221008 823212204 821504745 820713043 824786758 825339279 822431564 822396698 824795990
1745.5 824795990 825368958 825252075 825319595 826023254 829470978 827650757 826285172 829137268 830016479
1754.2 830016479 830777893 830874863 827987061 828477402 830978241 832840424 834165344 831243591 830731812
1762.9 830731812 833052063 833287430 833337097 833874893 833398285 831018524 833488312 836633377 835425110
1771.6 835425110 832276154 832025146 835695267 836268234 834266357 835350189 835787201 836722717 836485596
1780.3 836485596 835455780 837419205 839574509 839942017 837847214 837274857 837857819 837411118 837884598
1788.9 837884598 839281769 839260254 839049072 836993484 837555084 840610733 840082932 838895721 839968567
1797.6 839968567 840965118 839857330 838577805 840700150 841213531 841983185 843266830 843203125 843295059
1806.3 843295059 842689056 841779327 841940308 842187500 841050110 841827164 843469086 844547272 845497284
1815 845497284 845271149 844987183 843767776 843389664 843495255 843341141 844096832 843976135 845643311 846643600
1824.6 846643600 844172668 844947128 846434860 846812515 844795303 841063461 842772980 845025864 845532074
1833.3 845532074 846341629 847330246 847731018 847162704 846443100 846699905 845927429 845988388 846265488 846847153
1842.9 846847153 846252823 841819305 845015030 847870026 847546768 846878281 846755142 846614456 846118698
1851.6 846118698 846460800 846572800 846964035 847545776 847983780 848391418 848078995 848288498 847962875 846994095
1861.3 846994095 846115952 846203232 846774139 847283401 848097916 847891083 847961426 846726303 845302277 846220169
1870.9 846220169 846789322 846806793 846760559 847332230 847834778 848591537 849219055 849197540 848810883 848220749
1880.6 848220749 848215866 847818222 847691116 847445221 847564697 848453445 848946915 850210419 849816666 847918167
1890.2 847918167 848800812 849444046 848797760 848434219 847481079 847105103 848670197 849384613 849998856
1898.9 849998856 850680771 850676651 850361633 849554291 849140472 848320007 848186264 848828659 849168549 849425735
1908.5 849425735 849320450 849545364 850106964 850618439 850005493 849240189 848712387 848890152 849626007 847637482
1918.2 847637482 847785339 849720764 850602493 850965652 849403381 848355713 848889313 849028549 848808823
1926.8 848808823 848899765 849219131 849845428 850242996 850322189 850446548 849705658 849440918 849456100 848863449
1936.5 848863449 848325195 848356628 848754196 849123535 850454407 849847717 848091965 849166031 849563904
1945.2 849563904 849074326 848314743 847941513 848550110 849506683 850203400 850306168 850641708 850984650 850561066
1954.8 850561066 849652176 849313736 849119415 848697357 848948059 849573364 850184097 850638199 850805511 850760956
1964.5 850760956 850819778 850419006 849394455 849011993 849135971 849242325 849560928 850460434 850989227 851255646
1974.1 851255646 851669922 851346436 850743256 850082169 849384537 849149780 849480133 849708176 850223312 851236191
1983.7 851236191 851558456 851491394 851123962 850590897 849738541 849204712 849708176 849540024 849223328 850211258
1993.4 850211258 850990067 851018753 851264343 851245193 850543060 849593506 848768082 848901825 848869019 848999176
2003 848999176 849809341 850538406 851156006 850941315 850380173 849637070 848846970 848134079 847868881 848392029
2012.7 848392029 848829422 849488144 849968338 849743347 849051285 848902512 848758850 847773285 847037811 846700287
2022.3 846700287 847030563 847372665 847737579 848102188 847919464 848017960 847658234 847073746 846432114 845632553
2032 845632553 845175934 845235062 845924911 846644058 847169724 847121506 846963882 846417313 845540237 844961319
2041.6 844961319 844277267 843983231 843993607 844594955 845099106 845382309 845896530 845836487 845495682 844785080
2051.2 844785080 844219360 843641205 843162842 843289261 843767929 844541473 845176697 846013336 845943604 845111847
2060.9 845111847 844297867 843547821 843424988 843035812 843172684 844010849 844887390 845669785 846085892 845981369
2070.5 845981369 845194702 844346313 843677750 843825607 843768311 843518143 844114075 844754791 845480118 845838623
2080.2 845838623 845867233 845402908 844720993 844111710 843537979 843706284 844038925 844704361 845219116 845549164
2089.8 845549164 845844803 845793533 845662994 844902573 844357071 843923874 843666153 844093246 844866943 845837555
2099.5 845837555 846444397 846766586 846523437 846148605 845593414 844943924 844852295 844752274 844781570 845309906
2109.1 845309906 846256104 846624832 846716003 846798477 846236115 845444946 844971313 844982529 844634476 844886475
2118.7 844886475 845724182 846281204 846936646 847245407 847160416 846415634 845854874 845414505 845079575 844943085
2128.4 844943085 844571152 845200806 845988464 846538620 846793137 846731110 846428680 845670471 845340805 844729080
2138 844729080 844828949 845570755 845964050 846466446 846310120 846188126 846379547 846383514 845941162 845294876
2147.7 845294876 845067596 845343475 845761337 845979233 846571274 847097778 847273483 847146835 846895828 846584091
2157.3 846584091 845760880 845241928 845396652 845971832 846752319 847765961 848015976 847573013 847560577 847124023
2167 847124023 846701050 846341858 846120605 846562881 847097015 847720032 848418884 848999634 848923187 848747787
2176.6 848747787 848467636 848103790 848171768 847961731 848007202 848431091 849041290 849841156 850541916 850929260
2186.3 850929260 850885239 850442123 849681396 849465485 849384384 849287186 849464417 850113297 851158371 851595688
2195.9 851595688 851834717 851693573 851222076 850727615 850462112 850793610 850894165 851023407 851384735 852068329
2205.5 852068329 852650223 852611847 852465286 852226257 851912842 851704865 851831131 851996002 852417450 852993546
2215.2 852993546 853364944 853772202 854102478 854261475 853866043 853438568 853085175 852780838 852735977 853151321
2224.8 853151321 853950424 854275894 854809341 854978943 854709167 854536133 854109955 853876801 853946228 854585953
2234.5 854585953 854594040 854814529 855508118 855372925 855366669 855125961 855234909 855213547 854568558 854248505
2244.1 854248505 854367447 855054321 855528412 855991058 856160049 856034164 855841293 855461807 855277100 854769745
2253.8 854769745 854429398 854473877 854850464 855426559 855862427 856267548 856740265 856652985 855864029 855654831
2263.4 855654831 855276489 855102844 855588989 855886612 856114731 856447067 857338104 857394180 856909714 856679840
2273 856679840 856361847 856058807 855456696 855444031 855780869 856450195 857227020 857490234 857444458 857458878
2282.7 857458878 857620926 857252197 856768188 856060562 856212234 856574097 856576233 857175217 857153397 857432861
2292.3 857432861 857098923 856661377 856506348 855539703 855289612 855100021 855576401 855870438 856145325 856444855
2302 856444855 855757370 855494919 855034103 855238647 854623337 853414001 853265610 853449402 853890610 853188248
2311.6 853188248 853168793 852847214 852506714 852905121 852408066 852250061 851331329 851118164 850882111 850044098
2321.3 850044098 850190659 849732742 849014969 848993378 849447861 847994537 847315903 847683258 847046661 846664429
2330.9 846664429 845985184 846758423 847431946 847843781 847036667 844870758 844912262 845562134 845547638 844809875
2340.6 844809875 844566498 844291306 844978180 845888062 845927658 846772232 846915665 848531418 850134659
2349.2 850134659 849037018 847151566 845580521 843646240 843612976 844474640 842628632 841170883 840538788
2357.9 840538788 839970169 839097214 837717514 838438416 839115906 840892334 841630325 840680847 841616898
2366.6 841616898 842737808 843947296 844669113 844453049 844662323 846111679 847277451 848142624 849401321
2375.3 849401321 850103226 850651703 851002350 851097412 851337051 852035446 852648163 853380356 854345322 854768066
2384.9 854768066 855551834 856190033 856208954 855794067 854939499 854461212 854277267 854232788 854217148 854783478
2394.6 854783478 855457230 855568771 855572586 855181503 854738770 854373932 853971939 853367615 853296967 854112778
2404.2 854112778 854528961 854280472 854082184 854651489 854829330 854307175 853702469 852951050 852511139 852160034
2413.8 852160034 852348022 852839661 853158264 853396683 853339844 853123322 852797623 852678604 852130890 851326141
2423.5 851326141 850998611 851058350 851475677 851567307 851304855 851225815 851304092 851001968 850517654 849891891
2433.1 849891891 849096375 848936005 849252243 849658661 849856110 849974899 850153656 850249710 849909058 848980179
2442.8 848980179 848124313 847476654 847581024 847980576 848063583 848142471 848103867 847887497 847091370 846435776
2452.4 846435776 846266479 846521072 846738968 846308823 846110840 846112289 846622009 847046967 846533203 846199875
2462.1 846199875 846109772 845512390 844613495 844298248 844349747 844331665 844287872 844554672 844966812 844880219
2471.7 844880219 844583435 843789902 843097839 843118134 843027344 842763519 842871704 843276901 843461685 843643951
2481.3 843643951 843551636 843117981 842680969 842276688 841943893 841530533 841396484 841569595 842031250 842357712
2491 842357712 842564240 842585526 841904449 841248932 840548172 840261536 840481033 840682068 840949326 841122971
2500.6 841122971 841532669 841603394 841409225 841037750 840567474 840572586 840275421 839889450 839978638 840306931
2510.3 840306931 840467453 840577698 840608063 840214081 839872131 839719543 839530334 839260101 839243851 839187393
2519.9 839187393 838999329 839018631 839234772 839544144 839310989 838991699 838646698 838149414 837754440 837480392
2529.6 837480392 837748871 837891541 837733383 837510605 837625275 837740479 837240906 837093658 836843567 836255493
2539.2 836255493 835993195 835948410 835852280 835909576 836158218 836063004 835993500 835661392 835002823 834690781
2548.9 834690781 834392395 833964615 833940353 834131775 834023056 834010315 833760147 833340378 833135834 833007736
2558.5 833007736 832717972 832205734 832409897 832467194 832205276 832339249 832333221 832188721 831813354 831579361
2568.1 831579361 831188889 830849380 830775528 830490265 830469360 830446014 830806732 831280060 830937729 830231094
2577.8 830231094 829615936 829284058 829306488 829472733 829297485 829034882 828742752 828676147 828882980 828742523
2587.4 828742523 828391647 827860947 827869339 827895966 827281876 827135010 827301788 827489777 827811127 828122177
2597.1 828122177 828199539 827714691 826852417 826587296 826675415 826358337 826402206 826351089 826004105 825933151
2606.7 825933151 825826035 825893097 825904236 825647964 825467300 825222168 824738007 824502487 824766693 825021133
2616.4 825021133 824776306 824156265 823673935 823244934 822910385 822573166 822049942 821803894 821643600 821305695
2626 821305695 821203079 821173782 820806732 820358963 819676590 819025803 818998718 819094696 818810577 818293762
2635.6 818293762 818044510 818070679 818324890 817999496 817090302 816760178 816074982 815143890 814834442 814710083
2645.3 814710083 814559326 814441452 814279480 813947449 813760223 813324051 812966537 812867508 812383575 811876526
2654.9 811876526 811477814 811224976 810741425 810312347 810304031 810330811 810135345 809490891 808894806 808588943
2664.6 808588943 808667831 808339233 807675705 807461700 807293549 807496643 807765808 807554245 806574478 805724335
2674.2 805724335 805362549 804953995 805191956 805103226 804770584 804532928 804120636 803933640 803597031 803483047
2683.9 803483047 803160934 802544174 802388687 802786636 802754135 802033844 801631088 801304474 801362305 801151733
2693.5 801151733 800750427 800772095 800343170 799970322 799453812 799080963 799076996 799041977 798857117 798194427
2703.1 798194427 797981186 797917786 797500534 796898880 796299438 796220322 796126328 795691757 795299835 795021744
2712.8 795021744 794573364 794102173 793704224 793336792 793105392 793020859 792907639 792682266 792619934 792143478
2722.4 792143478 791769943 792199707 792453156 791871490 790713654 790220490 790257034 790115356 789810944 789275589
2732.1 789275589 788871613 788492432 788191910 788063583 787827225 787415695 787155609 787183762 787056808 786728745
2741.7 786728745 786487656 786348419 786114502 786207657 786298904 785875244 785562286 785252686 784629517 784143677
2751.4 784143677 784277649 784270706 783971558 783771667 783327484 783165512 783157578 783060913 782961731 782582932 782160950
2762 782160950 782105255 782160187 781938705 781638260 780984421 780824280 781243973 781069336 780656815 780402069
2771.6 780402069 780702515 780816498 780173187 779268341 778707962 778744049 778499222 778478622 778560791 778089828
2781.3 778089828 777616959 777259521 777195740 777405243 777295609 776458817 775887299 775766602 775465546 775164261
2790.9 775164261 774627533 773992767 773560562 773451843 773245468 772634964 771955643 771236191 770465927 770030518
2800.5 770030518 770053177 769641647 769176254 768912582 768200760 767309494 766560135 766410980 766212692 765508804
2810.2 765508804 764811707 764263382 763635788 762830887 762073746 761137238 760698166 760479202 759703369 758967285
2819.8 758967285 758291855 757554550 756873322 756372299 755460739 754465790 753604050 752543106 752064514
2828.5 752064514 751187515 749870377 749297791 748780365 747856903 747153625 746057739 744294968 743785324
2837.2 743785324 743560104 742627182 741494904 739673157 738457794 737573776 736233597 735028458 733826828
2845.9 733826828 732962341 731908035 729899750 727908096 726909180 726225967 725437164 724834061 723798981
2854.6 723798981 722646332 722190552 721387939 719974289 718896179 717572021 715905991 714467316 713109360
2863.2 713109360 711830368 710543518 708873215 706809311 705223999 703815842 701897507 699843979
2870.9 699843979 697587814 695537415 693690643 691232529 688650742 686898575 685235672 683006668
2878.7 683006668 681035538 679356079 677666779 675929337 674202881 672935867 671960678 670646973
2886.4 670646973 669319229 668515625 667788925 667201233 666498413 665629425 665163574 664744873 664731369 664809265
2896 664809265 664204788 663523483 663294754 663098907 662710571 662352829 661651764 661047134 660688782 660419540
2905.7 660419540 660136337 659388351 658802948 658210907 657135162 655731277 654584045 653552551 652254715
2914.3 652254715 651264267 649896240 648503494 647452927 645639343 643443069 641884842 640715027
2922.1 640715027 639170990 637709427 636509094 635977173 635993919 635544472 635008011 634856300 634980888
2930.7 634980888 634941978 635167542 635534897 635993347 636820641 637385254 638550758 640349274 642230301
2939.4 642230301 644234009 646256256 648366165 650502243 652583160 654356613 656277084 658425522
2947.1 658425522 660867157 662800674 664500580 667443390 670045700 672298737 674786606 676912766
2954.8 676912766 678617935 680391998 682969742 685341415 687415771 689510498 691751556 693985519
2962.6 693985519 695979843 698121719 699525375 700589066 702238235 703905563 705112762 706559448
2970.3 706559448 708693619 710822525 712662201 714351044 715770798 716306686 716918411 718513718 720453568
2979 720453568 722115707 723310318 724788742 726481628 727641525 727945786 728683167 730177994 731154785
2987.6 731154785 732065582 732966232 734035339 734832993 735228882 736281662 737291412 737875824 738219452
2996.3 738219452 738622208 738986206 739147873 739199600 739233322 739727783 740269165 740859833 741401062 741398544
3006 741398544 740634003 739732971 739681473 739579010 739288254 739146805 738744507 738555222 738612747 738403778
3015.6 738403778 737777405 736601639 735803146 735943146 735533829 734783783 734323654 733864594 733359680
3024.3 733359680 732449570 731673965 730874023 730002594 729235306 728425064 727880554 727109756 726256409 725652618
3033.9 725652618 725134354 724115982 723028030 722492828 721399231 720058746 719003754 718064423 717110443
3042.6 717110443 716036072 715607147 715417328 714389343 713075409 712277679 711259842 709882431 708739548
3051.3 708739548 707644653 706511383 705587082 704863052 703759003 702731323 702112885 701226654 699924545
3060 699924545 698248978 696925507 696338654 695514450 694213409 693481216 692805862 691362381 689871521
3068.6 689871521 688858490 688117676 686730576 685361710 684597092 683535385 682593307 681878815 680831680
3077.3 680831680 679637527 678430023 676879425 675447388 674201431 672841034 671719513 670705185
3085 670705185 670129089 669261475 667754135 666654129 665721207 664558029 663182678 662007828 660809250
3093.7 660809250 659427719 658053360 657057571 656564865 655429764 653873672 652415466 651370926 650379868
3102.4 650379868 648832550 647876053 647272873 645951691 644301682 643288040 642475204 641590958 640622711
3111.1 640622711 639164085 638026924 636833115 635474129 634246635 633015327 631921654 630802422
3118.8 630802422 630107765 629449425 628531952 626937981 624962959 623707352 622913551 621991425 620331955
3127.5 620331955 619030380 618257294 617405891 616871948 616130257 614771690 613289223 612266502 610645599
3136.1 610645599 608896790 608039322 607399139 606681175 605376892 604196396 603164062 602039948 600773735
3144.8 600773735 599330635 598690071 597757072 596414528 595486755 594640656 593740387 592976685 592199249
3153.5 592199249 590695572 589372482 588390770 587166138 586221886 585498581 584137115 582487602 582192688
3162.2 582192688 582050095 580900154 579707031 578360329 576949234 575803719 574678879 573644867
3169.9 573644867 572840691 572340393 571902351 570702744 569604874 569057732 568042145 566872177 565510864
3178.6 565510864 564450340 563850517 562888680 561831589 560997391 560326691 559447670 558456383 557582054
3187.3 557582054 556917915 556270638 555066833 553602791 552848663 552465897 551635132 551181984 550351486
3195.9 550351486 549005241 548311119 547597046 546631966 545411568 544641533 544009972 543143463 542532921
3204.6 542532921 541965485 541481133 540174103 539044228 538377457 537486534 537146645 536742744 536336784
3213.3 536336784 535406151 534458771 534265175 533543816 532716484 531833725 530844383 530393524 529848061 529311829
3222.9 529311829 528757935 527758827 527413864 526783180 525526543 525400276 524922829 523662300 522875671
3231.6 522875671 522447166 521977844 521865196 521946068 521109352 520115929 519239998 518691483 518144379 517228241
3241.3 517228241 516718826 516159286 515871277 515279274 514640427 514357376 514091606 514287415 513586464 512374420
3250.9 512374420 511572342 511452942 511265945 510201950 509545021 509121132 508848801 508707314 508414421
3259.6 508414421 507677727 506994362 506438332 505640106 505817566 505747108 505231476 505098419 505060425 504793549
3269.2 504793549 503587303 502705956 502473259 502323990 501881828 501404495 501349068 501210785 500811157 500385475
3278.9 500385475 500644226 500312881 499682426 499526176 498892326 498332100 497484322 496839600 496725044 496616936
3288.5 496616936 496396637 496038208 495753593 495163078 494667397 493987198 493495522 493456230 493284492 493178558
3298.2 493178558 492915306 492528534 491882744 491596794 491366425 490748444 490381622 490153503 490223122 489951248
3307.8 489951248 489294624 488639450 487979507 487477074 487139854 486708145 486322136 486317406 485275116 484045067
3317.4 484045067 483754349 483647842 483500710 482991142 482777252 482354965 481820564 481407471 480365028
3326.1 480365028 479311333 478639603 478469925 478308067 478110008 477476082 476729431 476670380 476136017 475321960
3335.8 475321960 474942398 474905243 474376831 473085213 471973724 471754723 471961174 471701584 471665382 471112175
3345.4 471112175 469751282 468783073 467964783 467400589 467274361 467030106 466344986 466065254 465743637
3354.1 465743637 464807930 464142303 463525620 462760315 461983414 461468277 460928841 460140457 459632759 459225655
3363.7 459225655 458762169 458441315 457828712 456802483 456259956 455726089 455287666 454829674 454060822
3372.4 454060822 454091873 453485298 452442436 452013588 451418571 450806351 450114326 449581680 449183159 448750191
3382.1 448750191 448215485 447983360 447456703 446490479 446589966 446646385 446357689 446040154 445651360 445283928
3391.7 445283928 444468956 444174957 444209328 444158554 443951950 443332405 442884865 442708397 442372360 441972885
3401.3 441972885 441842117 441414948 440992699 440914154 440852165 440597229 440240402 440168800 439977913 439855347
3411 439855347 439694481 439422607 439272995 439014130 438886986 438897018 438600235 438049011 437926865 437275162
3420.6 437275162 436876030 437639465 437636261 437441254 437649727 437608185 437179375 436924400 436922302 437112045
3430.3 437112045 437498398 437323990 437636795 437714539 437347679 437720833 437488022 436914635 437252617 438079338
3439.9 438079338 438513985 438722534 438512306 438569412 439016609 438953438 438602409 437523613 438386383 440036354
3449.6 440036354 440034523 440052834 440109596 440062065 440335541 441234436 441669121 441896133 442575989 442487183 442887802
3460.2 442887802 443497353 443734932 443505669 443525352 444551544 444871559 445001869 445259285 445378952 445338097
3469.8 445338097 445351524 446153259 447220268 447769165 447512054 447733116 448482933 449162254 449571762 449926872
3479.5 449926872 450484772 450686913 450962029 450960960 451728516 452645798 452445717 452657623 453213463 453969917
3489.1 453969917 454635963 455193367 455464973 455767670 456539459 456874008 457196732 457536583 458053131 458332901
3498.7 458332901 458563042 459667168 460752335 461205826 460850105 461049576 461890831 462691460 463747826
3507.4 463747826 464542694 464068451 463888283 465289536 466161385 466879044 467457962 468037300 469004478
3516.1 469004478 469415703 470261765 470676689 470922813 472347832 473869514 473752823 472869453 473679886
3524.8 473679886 474622612 475466156 475973587 476320457 477048111 478052292 478934593 479313698 480471764
3533.5 480471764 481080704 482114716 483053818 482636871 483554764 484344444 485262604 486046867 486646194
3542.1 486646194 487590942 488509369 489626503 490269814 490810585 490079117 491239700 493151550 494696083
3550.8 494696083 496119423 495057640 496636925 498174324 499283485 500945396 501007614 502584496 504156189
3559.5 504156189 504671478 504517746 506091270 507351418 508349800 512432938 510706673 508828316 509850159
3568.2 509850159 511142159 515277748 516271820 517475853 519433327 520953445 522216034 523465767
3575.9 523465767 525468597 525882950 528001480 529434967 529762611 531786346 533719940 535062599 536306419
3584.6 536306419 540837784 542085571 539091606 540453682 540401955 543760567 547533073 550812836 551751442
3593.2 551751442 551952248 555055161 554009666 556510849 559739075 560285606 563108711 563227081 564351540
3601.9 564351540 567189941 568889122 570860023 574276924 576639061 575099106 578474007 577794342
3609.6 577794342 578425064 586077576 585535660 584685860 589384575 588515358 592862015 597026253 596226768
3618.3 596226768 597410240 596157875 598210983 602568283 604777298 607090302 610414581 611895523
3626 611895523 613501015 620468102 617928238 605390091 611560860 617673759 622903938 623377991 622695465
3634.7 622695465 625963593 628880501 630625839 630305367 631957703 635015144 637882690 638877106 638966827
3643.4 638966827 641832657 646039200 651724930 648472061 644433823 649059143 645076141 643865967
3651.1 643865967 646577606 653088837 657617950 661501846 664987717 655101624 657915878 664094391
3658.8 664094391 665663147 666701508 667400360 669858932 670669632 672132950 673900986 675217209 679728699
3667.5 679728699 680833206 678872604 677126465 671799774 677229385 686528244 693924637 687171783
3675.2 687171783 670503922 678017883 687248154 691489334 688616562 689186707 692335510 694557190
3682.9 694557190 696374054 696164551 695984955 700543213 706312332 694928284 693338547 701974869
3690.6 701974869 695020905 696668549 703211975 704103851 705580368 705947571 706799316 708388748 708593521
3699.3 708593521 711594543 713768692 707773132 706654892 711464386 712876663 713500900 714411697 717086334
3708 717086334 719688721 711621933 716831970 720269394 706619263 713140945 718487701 719328156 720814133
3716.7 720814133 723270493 723811035 719240189 720709152 726723022 722537613 719717178 725269775
3724.4 725269775 725841217 725568848 722303162 722603836 726364365 727559433 733704147 729688492 723211365
3733.1 723211365 732289963 730058212 720808182 722038956 725344620 727698135 730773621 733124084
3740.8 733124084 730079803 734395905 746485596 734019165 718160248 730552826 737018127 742116394
3748.5 742116394 734696655 724950256 737444687 729567261 725580978 733373718 738404083 741070023
3756.2 741070023 735359116 738042908 741715622 733282547 733933105 739435272 741303177 742130127 745695190
3764.9 745695190 741338577 737222824 741813812 746303635 744699554 735647736 738959808 743001175
3772.6 743001175 744065323 744899673 744286270 745162201 745705109 748488846 746467209 739174118 743441544
3781.3 743441544 746001587 747131577 748256531 744924240 744839935 746175003 747141724 748309631 748999023
3790 748999023 749871597 749765625 749408417 748913269 751280670 754573898 749116364 746144333 749442596
3798.7 749442596 753243713 757465973 747423172 739039688 745771027 749841843 754516373 757814026
3806.4 757814026 746246414 744774017 750530701 752714386 753798904 754672470 755131683 756640244
3814.1 756640244 761091309 756150436 743876648 751682434 757333221 760675125 759780273 741033859
3821.8 741033859 746268387 753552170 756082611 758577347 757412491 753164062 755353012 758338928
3829.5 758338928 761187744 761028519 752544632 756810760 762805862 755400238 756564255 764103775
3837.2 764103775 753757629 751342621 758697357 752058258 753752365 760717468 756566620 754136353
3844.9 754136353 758586121 760419693 760463486 761857910 760377655 763020630 768557510 760694504 760523987
3853.6 760523987 745148544 749400711 760286102 759051971 758336792 761120605 763740921 766148071
3861.3 766148071 760652466 760905533 766464691 758909531 754915543 760599976 766462250 770777817
3869.1 770777817 758786850 752858887 759656754 766208420 767878723 757665710 760665817 764659424
3876.8 764659424 764052277 766872559 769700851 760950317 756648865 764343414 765434036 767293625
3884.5 767293625 770611420 757219696 760651245 765490341 766715927 770607681 766885834 757782822
3892.2 757782822 761425476 765891495 764874115 766506577 768260269 770728531 770440979 760690079
3899.9 760690079 767070465 768303452 762791519 767290344 763983612 763452606 764490280 765405045 767460251
3908.6 767460251 767050781 767181702 767038574 767280121 768074570 768715820 770777664 772546310 767268143
3917.3 767268143 763928757 768789062 767456589 764647141 767997437 769106674 770095444 767436981
3925 767436981 764226532 766504822 768545914 769966583 768467331 768065872 770578308 768348083 766912003
3933.7 766912003 768413239 769098816 769519882 769580536 769216232 768689880 768495865 770080795 770348587
3942.3 770348587 766352005 766711807 769313507 771334076 771926956 768794556 769765930 769732361 767381058
3951 767381058 770043793 770903625 769845657 769944611 770897827 771185226 770404816 770816879 770283356 770542145
3960.7 770542145 770399551 769217148 770622711 771298981 771144257 771514816 772134781 772819672 772287521
3969.3 772287521 771561203 771451721 771294403 770978012 770978394 771745224 771635208 770152740 770173187 770549469
3979 770549469 770142975 770566101 771211624 771714020 771533356 771597214 772180023 772070312 771790466 771924591
3988.6 771924591 773023682 773060226 771909332 771543579 771941757 772717667 772183456 771839066 772553635
3997.3 772553635 772418060 772206879 772489319
4000.2 772489319
##END=$$ End of the data block
