##TITLE=$$ Begin of the data block
##JCAMP-DX=5.00 $$ ACD/SpecManager v 10.08
##SPECTROMETER/DATA SYSTEM=Varian
##DATE=15 Jan 2013 14:56:28
##DATA TYPE=INFRARED SPECTRUM
##DATA CLASS=XYDATA
##ORIGIN=
##OWNER=
##NPOINTS=3735
##FIRSTX=399.26403809
##LASTX=4000.35498047
##MAXX=4000.35498047
##MINX=399.26403809
##MAXY=85.90385437
##MINY=37.54007721
##XFACTOR=1.0000000000
##YFACTOR=0.000000100000000
##FIRSTY=66.59434509
##DELTAX=0.96440572
##XUNITS=1/CM
##YUNITS=TRANSMITTANCE
##XYDATA=(X++(Y..Y))
399.3F65943451K128143J2041626N750809j1240769j1599502k643585m755326m185333
$$ 665943451 668071594 680113220 685864029 674623260 663023758 660380173 655624847 651439514
407F51439514m012832N639801L434600k818145L517227N227203O581421l877106r206390
$$ 651439514 647426682 653066483 656501083 653682938 657200165 662427368 669008789 665131683 655925293
415.7F55925293k020874N460739m323959j6544571J7287597O458512k51160n299072
$$ 655925293 653904419 659365158 655041199 638496628 655784225 662242737 661991577 656692505
423.4F56692505K50778K873383m015274j553955n242386k09198P166824M839859n04913
$$ 656692505 656943283 659816666 655801392 654247437 649005051 648795853 655962677 660802536 660297623
432.1F60297623o336518l89099j383056n763398j071701j142730k824479P57218O845322
$$ 660297623 653961105 653572006 652188950 646425552 645353851 644211121 641386642 642143860 648989182
440.7F48989182N396423j18332m047241j247330M521408K200928M53262L736420M096222
$$ 648989182 654385605 654267273 650220032 648972702 653494110 655695038 656148300 659884720 663980942
449.4F63980942J480636K783966J767350M00924J801224l724136q607331r623260l857803
$$ 663980942 665461578 668245544 670012894 670413818 672215042 668490906 659883575 650260315 646402512
458.1F46402512R327850Q062668K673263l267517k633362J650773L494796j461563
$$ 646402512 655730362 663793030 666466293 663198776 660565414 662216187 665710983 664249420
465.8F64249420m305343n812684l431167K198028M32587k128372j997147K256546j654815
$$ 664249420 659944077 654131393 650700226 652898254 653330841 651202469 649205322 651461868 649807053
474.5F49807053m777146k122421n730209k828026M313011M021072K089081R78775k987366
$$ 649807053 645029907 642907486 637177277 634349251 638662262 642683334 644772415 645751190 642763824
483.2F42763824n905838J525689P87963k263793p61796M41590K861404J263085L112793
$$ 642763824 636857986 638383675 639171638 636907845 636146049 636587639 639449043 640712128 643824921
491.8F43824921J971817k282791k983780m325333m167099k843628N41763K149048L674584
$$ 643824921 645796738 643513947 640530167 636204834 632037735 629194107 629735870 631884918 635559502
500.5F35559502J199760n670051j03722L556290m52805k764435k208481k533531j428070
$$ 635559502 636759262 631089211 630985489 634541779 634088974 631324539 629116058 626582527 625154457
509.2F25154457M76189j075745j921806m99687L6811p51648k299613p974663o027031
$$ 625154457 625630646 624554901 622633095 622133408 622170219 621418571 619118958 611144295 605117264
517.9F05117264p76596k860680M44756K280349K368699M99877n52444j578598n307159
$$ 605117264 604340668 601479988 601924744 604205093 606573792 607073669 606521225 604942627 599635468
526.6E99635468r50394j118622Q79631J382866j264420L640709M320603K430725O42280
$$ 599635468 598685074 597566452 598446083 599828949 598564529 602205238 606525841 608956566 609598846
535.2F09598846O88286J46866q44765J378365L029251L694305J972085M050292M529725
$$ 609598846 610287132 610433998 609589233 610967598 613996849 617691154 619663239 623713531 628243256
543.9F28243256J546058k11677j787300j551552k351151j980438j596374R31129L475571
$$ 628243256 629789314 629577637 627790337 626238785 623887634 621907196 620310822 621241951 624717522
552.6F24717522J267128j114273l217431p71980q54645k604293k893944n348358k477799
$$ 624717522 625984650 624870377 621652946 620880966 620026321 617422028 614528084 609179726 606701927
561.3F06701927j347427l02620K49176j958771k922745m951400m928894m939614k379608
$$ 606701927 605354500 605051880 605301056 603342285 600419540 595468140 590539246 585599632 583220024
570E83220024j868629j876488p02744k072715p55844O19812J959342J30539L84217
$$ 583220024 581351395 579474907 578772163 576699448 575943604 576563416 578522758 578653297 579037514
578.6E79037514J475982P69272K237587L268700M322166L912239M875641M368897K626152
$$ 579037514 580513496 581282768 583520355 586789055 591111221 595023460 599899101 604267998 606894150
587.3F06894150J701965J97029J07155O64902J133270N28183J058273J830216K342033
$$ 606894150 608596115 608793144 608900299 609565201 610698471 611226654 612284927 614115143 616457176
596F16457176J807442q31108j471787p99751k24113k103730j701889J607819J306076
$$ 616457176 618264618 617433510 615961723 615161972 614937859 612834129 611132240 612740059 614046135
604.7F14046135J062469P43943L8910Q69903J221085j610337k141609J61095j9035
$$ 614046135 615108604 615852547 615891457 616761360 617982445 616372108 614230499 614391594 614372559
613.4F14372559J838722K231064J934776K575302J289368K075691K712555J422462
$$ 614372559 616211281 618442345 620377121 622952423 624241791 626317482 629030037 630452499
621.1F30452499J75858R26742O64635R34296M791488N239068K712020J129227J577606
$$ 630452499 630628357 631555099 632219734 633154030 637945518 643184586 645896606 647025833 648603439
629.8F48603439J483994p92923p48749M15039r20868J39771L643417L585892M76990
$$ 648603439 650087433 649294510 648545761 648960800 648039932 648179703 651823120 655409012 655886002
638.4F55886002o71616J943130N53895k256928j460419q64181P48138J570893J764526
$$ 655886002 655214386 657157516 657711411 655454483 653994064 653129883 653878021 655448914 657213440
647.1F57213440K178955J197815J033783j75400r98001p00149j340485m36936O73676
$$ 657213440 659392395 660590210 661623993 661448593 660450592 659750443 658409958 657973022 658646698
655.8F58646698O67496K318268L571090K320252J138153p25708j554947q43659n71746
$$ 658646698 659314194 661632462 665203552 667523804 668661957 667936249 666381302 665537643 664965897
664.5F64965897J99737J571884N52979p309952M093475N325318K475281M76150j435089
$$ 664965897 665165634 666737518 667290497 659980545 664074020 669399338 671874619 672350769 670915680
673.2F70915680j073380m57382j52664J453476K072449K348709J106720r0790P76367
$$ 670915680 669842300 669384918 669232254 670685730 672758179 675106888 676213608 676122818 676899185
681.8F76899185N73120n39474n62058o13708p50275P22122K007141J277161R67941
$$ 676899185 677472305 676932831 676370773 675757065 675006790 675728912 677736053 679013214 679981155
690.5F79981155J498032K08130r74197j658783k547226j861420j792832p26776J316224
$$ 679981155 681479187 681687317 680713120 679054337 676507111 674645691 672852859 672126083 673442307
699.2F73442307K98690o55822j421280k077637j458893k248077k639084j405182k64053
$$ 673442307 673740997 673085175 671663895 669586258 668127365 665879288 663240204 661835022 661570969
707.9F61570969P28225J318970J549225K133408J466751N44509J558152J141357K73819
$$ 661570969 662299194 663618164 665167389 667300797 668767548 669312057 670870209 672011566 672285385
716.6F72285385J502152J475525J303100K386322L067551M286651M182587K425232
$$ 672285385 673787537 675263062 676566162 678952484 682020035 686306686 690489273 692914505
724.3F92914505Q06122P92694K452316K246781J813888K070999K481079K525864K201920
$$ 692914505 693720627 694513321 696965637 699212418 701026306 703097305 705578384 708104248 710306168
733G10306168J918487P48596J106110J67694j136932O1416M91715J12991K61383J826019
$$ 710306168 712224655 712973251 714079361 714247055 713110123 713171539 713663254 713776245 714037628 715863647
742.6G15863647K051697k15606j595459k058335l181152l252564k658081k788543j956253
$$ 715863647 717915344 717699738 716104279 714045944 710864792 707612228 704954147 702165604 700209351
751.3G00209351k69547M18854j121140k290039k848205l502961k773895k924881k345199
$$ 700209351 699939804 700358658 699237518 696947479 694099274 690596313 687822418 684897537 682552338
760F82552338r39865o03257K18277O25916R80530R77935L07236J39923K01645R08432
$$ 682552338 681612473 681009216 681227493 681853409 682833939 683811874 684119110 684259033 684460678 685369110
769.6F85369110J723023J883621K494964N073853O086960M459991L227997K780151
$$ 685369110 687092133 688975754 691470718 696544571 702631531 707091522 710319519 713099670
777.3G13099670K597886J578140J890335J453781J863174L913041L718261L653565
$$ 713099670 715697556 717275696 719166031 720619812 722482986 726396027 730114288 733767853
785G33767853K710953K333526K101212O52694k80990k365J106262L79257J022110L258057
$$ 733767853 736478806 738812332 740913544 741566238 741285248 741282883 742389145 742768402 743790512 747048569
794.7G47048569L854294K880554J900177J721115J076584J61895j85470O74820R82208
$$ 747048569 750902863 753783417 755683594 757404709 758481293 758643188 758457718 759132538 760114746
803.4G60114746K150879K945251L261719L913117J576919K06299o12946j265563j032410
$$ 760114746 762265625 765210876 768472595 772385712 773962631 774168930 773555984 772290421 771258011
812G71258011o17371M1046L58506J839447K315902K036591O12793o5842K04697j992569
$$ 771258011 770640640 770681686 771040192 772879639 775195541 777232132 777844925 777779083 777983780 775991211
821.7G75991211k720871j660461m62647k23999j4267K31323m65240r67484j935730
$$ 775991211 773270340 771609879 771147232 770923233 770908966 771140289 770675049 769707565 767771835
830.4G67771835l264389m169159l372421l452911l010407p06024K6550q73031j793137
$$ 767771835 764507446 760338287 756965866 753512955 750502548 749796524 749823074 748950043 747156906
839G47156906j040954j707688l233490l511810l628464k658691j573410m14048L27836
$$ 747156906 746115952 744408264 741174774 737662964 734034500 731375809 729802399 729388351 729716187
847.7G29716187O91757Q68835k35977j365585k059632k672805l013535k055054j294098
$$ 729716187 730407944 731276779 731040802 729675217 727615585 724942780 721929245 719874191 718580093
856.4G18580093l13491J209030L31649o38885J25122O14090N11856Q70285J649857
$$ 718580093 718266602 719475632 719807281 719168396 719293518 719907608 720419464 721289749 722939606
865.1G22939606K673416L574066M145126N970230N960541M909287N289459L489914
$$ 722939606 725613022 729187088 733332214 739302444 745262985 750172272 755461731 758951645
872.8G58951645J544876J004181M85687J55487J995087L086929K729416K324143K65579
$$ 758951645 760496521 761500702 761986389 762141876 764136963 767223892 769953308 772277451 772543030
881.5G72543030j251374k799835l370285l065796l177032l620529k659378q56858j211242
$$ 772543030 771291656 768491821 765121536 762055740 758878708 755258179 752598801 751741943 750530701
890.2G50530701o42243q09479l071365m018402l552933l372955l114090j797104j066666
$$ 750530701 749888458 749078979 746007614 741989212 738436279 735063324 731949234 730152130 729085464
898.8G29085464m65927K60392J05896j625138k974090l431092m170456m032058m332047
$$ 729085464 728619537 728879929 728985825 727360687 724386597 720955505 716785049 712752991 708420944
907.5G08420944k764206j629486k610092j943436k092895l183670m344635m880142
$$ 708420944 705656738 704027252 701417160 699473724 697380829 694197159 689852524 684972382
915.2F84972382n100632o155777n121918k963333k749100k314300n07660j82800j406098
$$ 684972382 679871750 673715973 668594055 665630722 662881622 660567322 660059662 659876862 658470764
923.9F58470764j103973j295090k188568j319428j175537j51596J206818J161804K308045
$$ 658470764 657366791 656071701 653883133 652563705 651388168 651236572 652443390 653605194 655913239
932.6F55913239K742691J386108M30908N04685K33612Q01696K028885K520981L600769
$$ 655913239 658655930 660042038 660472946 660977631 661211243 662012939 664041824 666562805 670163574
941.3F70163574M038315L135834K484207J862945k00805j955948k872543l323975l058243
$$ 670163574 674201889 677337723 679821930 681684875 681484070 679528122 676655579 673331604 670273361
949.9F70273361l434372l175049k834701l969269n138626o562729p493248q097801
$$ 670273361 666838989 663663940 660829239 656859970 651721344 645158615 637665367 629567566
957.7F29567566p879639q100319q753013p563629p255288o523895o899872p305374
$$ 629567566 621687927 613587608 604834595 597270966 590015678 583491783 576591911 569286537
965.4E69286537q500557j0603332r620743r939194j0123405j0895005j0114707q815613
$$ 569286537 560785980 550182648 540561905 530622711 520499306 509604301 499489594 490673981
973.1D90673981q989525q343964r350967r170609j0134086r404793r006920q581657
$$ 490673981 481684456 473340492 463989525 454818916 444684830 435280037 426273117 417691460
980.8D17691460o717072o610947m668884m957123l910904l315315k730484k980232
$$ 417691460 410974388 404363441 399694557 394737434 390826530 387511215 384780731 381800499
988.5C81800499l095436j118469k185822K57187J06125M86984N71213j35346K331353
$$ 381800499 378705063 377586594 375400772 375657959 375764084 376251068 376822281 376686935 379018288
997.2C79018288J005058J218643n4855M28085Q70857L05519O89545l94325J328087
$$ 379018288 380023346 381241989 381187134 381615219 382486076 382791595 383481140 383086815 384414902
1005.9C84414902K44713O51474j40038j116676q94699j448365P9384j516075K32849
$$ 384414902 384659615 385311089 385171051 384054375 383159676 381711311 381790695 380274620 380507469
1014.6C80507469L42713M18624J404114Q98209J469955l25889J241226N80253Q29163
$$ 380507469 380850182 381268806 382672920 383571129 385041084 384715195 385956421 386536674 387365837
1023.2C87365837J367836J532173K895355J414795K518425K298775K891579J338806
$$ 387365837 388733673 390265846 393161201 394575996 397094421 399393196 402284775 403623581
1031D03623581J327591J973762L16773K039795J108551K316170J684227K117996K000732
$$ 403623581 404951172 406924934 407241707 409281502 410390053 412706223 414390450 416508446 418509178
1039.6D18509178l69835J079636j61400N93948k37960L95469J467705J804733K776146
$$ 418509178 418139343 419218979 419057579 419651527 419413567 419809036 421276741 423081474 425857620
1048.3D25857620R32732K040558R87777K220459K062836K287102L279343J197090L493576
$$ 425857620 426790352 428830910 429818687 432039146 434101982 436389084 439668427 440865517 444359093
1057D44359093L600502M836731M532242N274086O033973M562035N417900M522934N965271
$$ 444359093 447959595 452796326 457328568 462602654 468636627 473198662 478616562 483139496 489104767
1065.7D89104767M533348L898697K818298K02217j633262n448456n234223o965980
$$ 489104767 493638115 497536812 500355110 500557327 498924065 493475609 488241386 481275406
1073.4D81275406p225838p518768o730881l505096l536682q89206j302948R03701P68509
$$ 481275406 474049568 466530800 459799919 456294823 452758141 451868935 450565987 451469688 452238197
1082.1D52238197J13640K078781R44214J368675P79953L120881K202796K808648M112701
$$ 452238197 452351837 454430618 455374832 456743507 457523460 460644341 462847137 465655785 469768486
1090.7D69768486L124542M068985K623024L477631J956596K498398J987114P06062
$$ 469768486 472893028 476962013 479585037 483062668 485019264 487517662 489504776 490210838
1098.5D90210838J842308P29332K091103Q16345J844559P03773r39407O32629r1285
$$ 490210838 492053146 492782478 494873581 495689926 497534485 498238258 497298851 497931480 497840195
1107.1D97840195J441498N71517J576539K133331K611694K948342J755294K970696
$$ 497840195 499281693 499853210 501429749 503563080 506174774 509123116 510878410 513849106
1114.9E13849106J628342J250419N341N09376Q81539M15077K001419J649933K592735
$$ 513849106 515477448 516727867 516733208 517242584 518124123 518539200 520540619 522190552 524783287
1123.5E24783287J073608Q56934Q57582M87709J088562Q62580K384414J602936K620239
$$ 524783287 525856895 526713829 527571411 528059120 529147682 530010262 532394676 533997612 536617851
1132.2E36617851K617760K627525K039528j144028j815605k621956j550483l432579
$$ 536617851 539235611 541863136 543902664 542758636 540943031 538321075 536770592 533338013
1139.9E33338013m363594l138733l799210l396644m491234l581658m272079l998909
$$ 533338013 528974419 525835686 522036476 518639832 514148598 510566940 506294861 502295952
1147.6E02295952l957863m572945l350677l286019j508674k717552n76973J34964o34804
$$ 502295952 498338089 493765144 490414467 487128448 485619774 482902222 482325249 482460213 481825409
1156.3D81825409N92537o44760K74811l54462J119499O87409J248970K836761K358093
$$ 481825409 482417946 481773186 482047997 481693535 482813034 483500443 484749413 487586174 489944267
1165D89944267M630509M099044M910470M441375M574967M871750N053176O314660N169944
$$ 489944267 494574776 498673820 503584290 508025665 512600632 517472382 522525558 528840218 534010162
1173.7E34010162O958466O880150P121048P642593P138786O641350N606194N963058
$$ 534010162 540968628 547848778 554969826 562612419 569751205 576392555 581998749 587961807
1181.4E87961807M645157M989662N530281N945931O418228N617027N089493L777466
$$ 587961807 592606964 597596626 603126907 609072838 615491066 621108093 626197586 629975052
1189.1F29975052L143310K146759J615868J216889J322937K243919J862945K133408
$$ 629975052 633118362 635265121 636880989 638097878 639420815 641664734 643527679 645661087
1196.8F45661087J895371J650543J009903p4005m19846j50223M64478n37262L78189
$$ 645661087 647556458 649207001 650216904 650142899 649723053 649572830 650037308 649500046 649878235
1205.5F49878235K181549K642517K704620K028275J954117J684799J382599R79156
$$ 649878235 652059784 654702301 657406921 659435196 661389313 663074112 664456711 665435867
1213.2F65435867J044464J649323K069855K540893K480393K683487K370376J128540
$$ 665435867 666480331 668129654 670199509 672740402 675220795 677904282 680274658 681403198
1220.9F81403198K60391m5776n90286j050644o19354j50605M88434R14765L76358N7754
$$ 681403198 681663589 681617813 681027527 679976883 679357529 679206924 679695358 680610123 680986481 681044235
1230.6F81044235k07443r79385j497803j745758j670838q97522n61447j54419Q29087
$$ 681044235 680836792 679857407 678359604 676613846 674943008 674045486 673484039 673329620 674158707
1239.3F74158707J153793J049805L53546L5324n78766j158981o02799k65960M16565
$$ 674158707 675312500 676362305 676715851 676751175 676172409 675013428 674410629 674144669 674561234
1247.9F74561234J124343K059937K485580J888352J210403M38919N6916k51465l05558
$$ 674561234 675685577 677745514 680231094 682119446 683329849 683768768 683825684 683574219 683268661
1256.6F83268661K88086R90982J448288J359559J168518J348953J251831K80456n89675
$$ 683268661 683556747 684547729 685996017 687355576 688524094 689873047 691124878 691405334 690815659
1265.3F90815659l06778R8190M8828Q17719J595001J804123J933899J446228J084060
$$ 690815659 690508881 690607071 690655899 691473618 693068619 694872742 696806641 698252869 699336929
1274F99336929M26560o26908j427383j129074l40347j34812M31290R97085Q02689M13971
$$ 699336929 699763489 699136581 697709198 696580124 696239777 696104965 696536255 697533340 698336029 698750000
1283.6F98750000L3722m77142j202927k098084k007904r05532j94245J51901L75977
$$ 698750000 698783722 698306580 697103653 695005569 692997665 692092133 691897888 692049789 692425766
1292.3F92425766R8114m03290m79507n60074j447525k343979j990890q71888J44501
$$ 692425766 692523880 692120590 691641083 691081009 689633484 687289505 685298615 684426727 684571228
1301F84571228M39987K23313L82385M50287L53088n77545j712570j785050j519851
$$ 684571228 685011215 685234528 685616913 686067200 686420288 685842743 684130173 682345123 680825272
1309.7F80825272p70798j06735M10919O75049O01959L24402o95343j159439j427384
$$ 680825272 680054474 679947739 680358658 681033707 681635666 681960068 681264725 680105286 678677902
1318.3F78677902k255020j905289j005020o84204n05371m17404k86331o85730k082825
$$ 678677902 676422882 674517593 673512573 672828369 672322998 671905594 671619263 670933533 668850708
1327F68850708k737045l090363l117676k789383k592773j307526r78469o65665n06668
$$ 668850708 666113663 663023300 659905624 657116241 654523468 653215942 652237473 651571808 651065140
1335.7F51065140q73184q24357j155471k117462k173691j50986K95105L15857M63943
$$ 651065140 650191956 649367599 648212128 646094666 643920975 643769989 644065094 644380951 644844894
1344.4F44844894J038590J187210N12772K97088n63812q89435j329574j362687m35943
$$ 644844894 645883484 647070694 647583466 647880554 647316742 646427307 645097733 643735046 643299103
1353.1F43299103L2959M61349L75748P58514J80970n25055q20694k061463j997261
$$ 643299103 643332062 643793411 644169159 644927673 645108643 644583588 643762894 641701431 639704170
1361.7F39704170j549949j046067N09873O86378L65906R38110J65291n75905K52991
$$ 639704170 638154221 637108154 637618027 638304405 638670311 639608421 639773712 639197807 639450798
1370.4F39450798p17239p05490j013146l59955J383553J922416K203141J065521R91211
$$ 639450798 638733559 638028069 637014923 636654968 638038521 639960937 642164078 643229599 644220810
1379.1F44220810L37753M15802l6392q76694J63498O49033K170868K362594K468872
$$ 644220810 644558563 644974365 644937973 644061279 644224777 644873810 647044678 649407272 651876144
1387.8F51876144K844010K423019J281662N35202P53784k99224j608506q60977J629639
$$ 651876144 654720154 657143173 658424835 658960037 659713821 659414597 657806091 656945114 658574753
1396.4F58574753J503372M39301o90003R0637J020050p40356j026306j359711l160400
$$ 658574753 660078125 660517426 659827423 659918060 660938110 660197754 659171448 657811737 654651337
1405.1F54651337r42078N18189N48095J70975M3716K7008j27639j476975j574020r31015
$$ 654651337 653709259 654227448 654775543 654946518 654990234 655017242 654889603 653412628 651838608 650907593
1414.8F50907593j161118r08203l54462M47846k273102J991043L055344M22668k25754
$$ 650907593 649746475 648838272 648483810 648931656 646658554 648649597 651704941 652127609 651901855
1423.4F51901855k081756j97067O10809R8572J509323N78537p4158J289063K568359
$$ 651901855 649820099 649623032 650233841 650332413 651841736 652420273 652346115 653635178 656203537
1432.1F56203537N23148m26331R29565p58285l735352J042252L378448J670533J498794
$$ 656203537 656726685 656300354 657229919 656471634 652736282 653778534 657156982 658827515 660326309
1440.8F60326309J662216P89490R55429p10525l17002p00302j648025k139435R92889
$$ 660326309 661988525 662778015 663733444 663022919 662705917 662005615 660357590 658218155 659211044
1449.5F59211044K612686K51770R7352n16892j82800r13086j193009l913116n816269
$$ 659211044 661823730 662075500 662172852 661655960 661473160 660560074 659367065 655453949 649637680
1458.2F49637680K497406Q41141L046951J443176J566468K093658k896805J521759
$$ 649637680 652135086 652976227 656023178 657466354 659032822 661126480 658229675 659751434
1465.9F59751434J693650K661590J179276J907348L743058J778259L375091K165070
$$ 659751434 661445084 664106674 665285950 667193298 670936356 672714615 676089706 678254776
1473.6F78254776P091751L613281J616669L307495K905045K936783K003021L210068
$$ 678254776 685346527 688959808 690576477 693883972 696789017 699725800 701728821 704938889
1481.3G04938889K517471M359894L639755K776489L307343j00785J770630J430970
$$ 704938889 707456360 711816254 715456009 718232498 721539841 721439056 723209686 724640656
1489G24640656o87180m60663M692612N002136K917404L618088P68204p78580K753220
$$ 724640656 723953476 723492813 728185425 733187561 736104965 739723053 740491257 739712677 742465897
1497.7G42465897N05905j003113K326584K263412Q56171L227386L206940L249664o233596
$$ 742465897 742971802 741968689 744295273 746558685 747414856 750642242 753849182 757098846 750865250
1506.4G50865250p722855P717514K274857K159652J779633J052399K98843K807693
$$ 750865250 743142395 750859909 753134766 755294418 757074051 758126450 758425293 761232986
1514.1G61232986K022400O02646M86756k080460N365829K258454n257187m068070J528702
$$ 761232986 763255386 763858032 764344788 762264328 767630157 769888611 764631424 760563354 762092056
1522.8G62092056N815277K469178n188O71463K214965M43879J021347J449737j008758
$$ 762092056 767907333 770376511 770371323 771042786 773257751 773701630 774722977 776172714 775163956
1531.5G75163956P98111l005829k052765L935318K807617L363648K817993J42364j0538864
$$ 775163956 775962067 772956238 770903473 774838791 777646408 781010056 783828049 783970413 773431549
1540.1G73431549M189758j359024j447372M461822l13644M89426L153305K931900J851806
$$ 773431549 777621307 776262283 774814911 779276733 778963089 779452515 782605820 785537720 787389526
1548.8G87389526j608123l276902J539078K316437R6283m313278J093826N871048L284912
$$ 787389526 785781403 782504501 784043579 786360016 786456299 782143021 783236847 789107895 792392807
1557.5G92392807r074936q625107K464752Q523255L114166J301270n22919k228546
$$ 792392807 783317871 774692764 777157516 785680771 788794937 790096207 789573288 787344742
1565.2G87344742J591415K663269K493439m75845m651184K380600K201156k61230K2659
$$ 787344742 788936157 791599426 794092865 793617020 788965836 791346436 793547592 793286362 793309021
1573.9G93309021J679687j915588p477188M064560L641128R08356N42374J17645p97043
$$ 793309021 794988708 793073120 785595932 789660492 793301620 794209976 794752350 794869995 794072952
1582.6G94072952n01709n87539o20041r28498k07672L24326J40304J25122k04544n77850
$$ 794072952 793571243 792983704 792363663 791435165 791227493 791551819 791692123 791817245 791612701 791034851
1592.2G91034851p76825j259079k016907j160888q88672o24085j38473M6234p54700
$$ 791034851 790258026 788998947 786982040 785821152 784932480 784308395 784169922 784216156 783461456
1600.9G83461456j492157j463241k167511j068497j286697k309342k235718j128997
$$ 783461456 781969299 780506058 778338547 777270050 775983353 773674011 771438293 770309296
1608.6G70309296j433106j545334m1580j645279j901169k098312o71234k208100j2263946
$$ 770309296 768876190 767330856 767289276 765643997 763742828 761644516 760973282 758765182 746501236
1617.3G46501236J934357J105804n82886j187744k48413k036438o470337o714l42407
$$ 746501236 748435593 749541397 748958511 747770767 747522354 745485916 739015579 739008865 738666458
1626G38666458p14111m628067k234955J220550o48117l75061j027145M82254L97644
$$ 738666458 737952347 733324280 731089325 732309875 731661758 731286697 730259552 730741806 731139450
1634.6G31139450q500900j731339J216278P36237R19266J90124o34918R82132M65622
$$ 731139450 722638550 720907211 722123489 722859726 723778992 723969116 723334198 724316330 724781952
1643.3G24781952J536255Q43735m429169j048432l00827L117524L050003L466797L861007
$$ 724781952 726318207 727161942 722732773 721684341 721383514 724501038 727551041 731017838 734878845
1652G34878845q052902p352524Q451843N725327K925415J305237Q88443J012573J510925
$$ 734878845 726825943 719473419 727925262 733650589 736576004 737881241 738769684 739782257 741293182
1660.7G41293182J971131J04065k00882L948517L016662J379700J666031Q52813l035049
$$ 741293182 743264313 743368378 743167496 747116013 750132675 751512375 753178406 754031219 750996170
1669.4G50996170J529007K720795J310424M023209L958511r41543j184158M146423
$$ 750996170 752525177 755245972 756556396 760579605 764538116 763596573 762412415 766558838
1677.1G66558838L191605K122192j22299j214218L552398L790817j854171q930283
$$ 766558838 769750443 771872635 771750336 770536118 774088516 777879333 776025162 767094879
1684.8G67094879P390442O682053K701873N1575J308441O10657J015549J723709J520843
$$ 767094879 774485321 781167374 783869247 783920822 785229263 785839920 786855469 788579178 790100021
1693.5G90100021K536850o1721o570969M098129N019989N441818k932510r596329O718445
$$ 790100021 792636871 792575150 786004181 790102310 795122299 800564117 797631607 788035278 794753723
1702.1G94753723M321442J284408p13882P38525R4223K566223K873612K08588l91999
$$ 794753723 799075165 800359573 799645691 800384216 800478439 803044662 805918274 806126862 805734863
1710.8H05734863P08924R50241N32837j492768P2785L192749j053925n142364N226822
$$ 805734863 806443787 807394028 807926865 806434097 806506882 809699631 808645706 803503342 808730164
1719.5H08730164L845748K134324O11724p84225n26276Q77762J256561J106873J481628
$$ 808730164 812575912 814710236 815321960 814537735 814011459 814889221 816145782 817252655 818734283
1728.2H18734283J066742j452102J34277K624435L69263p161941m021759O742477L917160
$$ 818734283 819801025 818348923 818483200 821107635 821476898 814314957 810293198 817035675 820952835
1736.9H20952835J301956K398300j328506j385956L724289O46515l152237m24118K459641
$$ 820952835 822254791 824653091 823324585 821938629 825662918 826309433 823157196 822733078 825192719
1745.5H25192719P41577o2561R9640M57687L024826j350708q94013K514878P72552
$$ 825192719 825934296 825871735 825971375 826429062 829453888 828103180 827209167 829724045 830496597
1754.2H30496597R76105K74811k819596N96848K221680J601181J630859k638092q57391
$$ 830496597 831472702 831747513 828927917 829524765 831746445 833347626 834978485 832340393 831483002
1762.9H31483002K083435K79083M5853N07965n25666k292861K950363L300018j157455
$$ 831483002 833566437 833845520 833891373 834399338 833873672 831580811 834531174 837831192 836673737
1771.6H36673737l913880q58154L973923M18930j626664J463395M73175J063919l79563
$$ 836673737 832759857 831901703 835875626 836294556 834667892 836131287 836604462 837668381 837288818
1780.3H37288818p43789J710663J594314N64118j871415n66177P23648j78223L33634
$$ 837288818 836545029 838255692 839850006 840414124 838542709 837976532 838700180 838521957 838855591
1788.9H38855591R65118m6921l6697j930923L97033L034973m82635j315537J013413
$$ 838855591 839820709 839773788 839737091 837806168 838203201 841238174 840755539 839440002 840453415
1797.6H40453415Q07800j233749j109085K327881N32837N27801J120834J04523P16400
$$ 840453415 841261215 840027466 838918381 841246262 841779099 842306900 843427734 843532257 844248657
1806.3H44248657m12369j147003K14844J48697j391068P19758J692962J034546J048737
$$ 844248657 843836288 842689285 842904129 843052826 841661758 842381516 844074478 845109024 846157761
1815H46157761j27945n17884j181793l10974K67639P0343O74820j07345J382370P86209
$$ 846157761 846029816 845511932 844330139 844019165 844286804 844357147 845031967 844924622 846306992 847093201
1824.6H47093201k343750O40411J569138O20346j896439m209824J592637K428817N78003
$$ 847093201 844749451 845389862 846959000 847579346 845682907 841473083 843065720 845494537 846072540
1833.3H46072540R06143J045990O18439o50711j237335K78244o15234l7766K67639
$$ 846072540 846978683 848024673 848643112 847992401 846755066 847033310 846418076 846380310 846647949
1842H46647949R25141k7085m334030K991638K563935p59430q78830k3728R1858n54657
$$ 846647949 847573090 847546005 843211975 846203613 848767548 848008118 847129288 847105560 847197418 846642761
1851.6H46642761Q8883P0648N04150O26526L51563N18570j44730Q7204l20892p01905
$$ 846642761 846731644 846802292 847306442 847932968 848284531 848803101 848658371 848745575 848424683 847722778
1861.3H47722778o91757j63879L65677O48422O80847l967O91604j408233j934052Q09632
$$ 847722778 847031021 846867142 847232819 847881241 848562088 848558121 849249725 847841492 845907440 846717072
1870.9H46717072M59213k44980J59836R29718L11966O61163P13120L48281r842q14666
$$ 846717072 847176285 846931305 847091141 848020859 848332825 848993988 849707108 850055389 850045547 849230881
1880.6H49230881l23868o74286q9798j2436l8986R32846R16443J245117j021118k004700
$$ 849230881 848907013 848232727 848142929 848130493 848091507 849024353 849940796 851185913 850164795 848160095
1890.2H48160095J304245O32096j011811n41610q57316m46090J692199J120835N20630
$$ 848160095 849464340 850096436 849084625 848543015 847685699 847239609 848931808 850052643 850573273
1898.9H50573273L58963J11923j77002r57413l37143o21109j56555N70679J46561M14352
$$ 850573273 850932236 851044159 850867157 849909744 849572601 848951492 848794937 849365616 849512177 849926529
1908.5H49926529L88336O8512K43759M11072p43408o05011n10407Q4687J017456j905899
$$ 849926529 850314865 850383377 850627136 851038208 850294800 849689789 849179382 849264069 850281525 848375626
1918.2H48375626R918K108688J089859J69220k036133r17129P31964M4632j52664L33328
$$ 848375626 848385544 850494232 851584091 851753311 849717178 848800049 849532013 849576645 849423981 849757309
1927.8H49757309L01590J85242J73034L59955M78974n22233m39376m97208o83365j72653
$$ 849757309 850058899 850244141 850417175 850777130 851256104 850733871 850294495 849797287 849113922 848941269
1937.5H48941269n3177K07596O64978J438370m89350j395874J038666K93503o49872
$$ 848941269 848888092 849095688 849760666 851199036 850709686 849313812 850352478 850645981 849996109
1946.1H49996109p88879l93372L14560Q78830Q81576K69394J34278r7657m70733p69501
$$ 849996109 849207230 848813858 849128418 850007248 850888824 851158218 851292496 851194839 850724106 849954605
1955.8H49954605l35922k23465k94342L67737O09970N99060L92303M09317M10538K42310
$$ 849954605 849618683 849395218 849100876 849468613 850078583 850677643 851069946 851479263 851889801 852132111
1965.4H52132111o14014j409226n91354J18561L97415M35333P10755L35083J5640K83432
$$ 852132111 851518097 850108871 849517517 849636078 850033493 850468826 851179581 851514664 851530304 851813736
1975.1H51813736k79007m21906m98352m98199k75879J65711N28488Q02231J076354
$$ 851813736 851534729 851112823 850614471 850116272 849840393 850006104 850534592 851336823 852413177
1983.7H52413177Q9493l41034n79376o35223n24521n63736M51660o3629m17557P98721
$$ 852413177 852502670 852161636 851582260 850947037 850422516 849858780 850310440 850246811 849829254 850627975
1993.4H50627975N85022L19062L14407j94855n91125q36106r28421k53829n4017N26810
$$ 850627975 851212997 851532059 851846466 851651611 851060486 850224380 849295959 849042130 848988113 849514923
2003H49514923J281509N62287m0360k60162j38779k85415q86536q90045l01285K02561
$$ 849514923 850796432 851358719 851318359 851058197 850919418 850634003 849747467 848857422 848556137 848758698
2012.7H48758698M13131N86243N47714K70615p32346l93677O8589p75910o15997m25186
$$ 848758698 849171829 849758072 850305786 850576401 849844055 849450378 849518967 848743057 848127060 847701874
2022.3H47701874P6M24347L91464L13111p1946p629l53775o38580n98984o35147m35181
$$ 847701874 847701950 848126297 848517761 848830872 848758926 848751297 848397522 847758942 847159958 846524811 846089630
2032.9H46089630l0517M05120P27692O45371K7694p0266n89371r70459p94220o69327
$$ 846089630 846059113 846464233 847191925 847837296 847864990 847794724 847205353 846234894 845440674 844771347
2042.6H44771347j54190Q6670O62918M90875L25699N35736j28937m42276p07092n66635
$$ 844771347 844617157 844703827 845366745 845857620 846183319 846719055 846590118 846147842 845440750 844874115
2052.2H44874115o69327k73056N72052O41632P36771K69165J73645Q3923k36969q42743
$$ 844874115 844204788 843931732 844503784 845145416 845882187 846151352 846324997 846408920 846171951 845329208
2061.9H45329208j126098k24762k12555J14746Q33359Q35724O73370M59518P8659n63583
$$ 845329208 844203110 843978348 843765793 843880539 844713898 845549622 846222992 846682510 846761169 846197586
2071.5H46197586p66449n91125k05307j77994J74331N19562M97589O69403K94877n4627
$$ 846197586 845431137 844840012 844634705 844456711 844631042 845150604 845648193 846317596 846612473 846557846
2081.1H46557846o42013o47431k80685j22376O6452o9961M94232O67801M03671n1575
$$ 846557846 845915833 845268402 844987717 844865341 844931793 844861832 845356064 846023865 846427536 846375961
2090.8H46375961k5329J15661p07931n57251k19422p8506J77231N89447P50809N69610
$$ 846375961 846350632 846466293 845758362 845201111 844981689 844903183 845080414 845669861 846420670 846990280
2100.4H46990280M36859j44348j50375p42111p60422o11j05438J02082N51452J036301
$$ 846990280 847427139 847282791 847132416 846390305 845629883 845629272 845523834 845625916 846177368 847213669
2110.1H47213669N79223K13624k14234p13806n22156m90875k6245j78147L04642P04041
$$ 847213669 847792892 848006516 847792282 847078476 846556320 846065445 846039200 845861053 846165695 846869736
2119.7H46869736L91769M46320K15454K14462o27975q44040p71637l25012L75137j38626
$$ 846869736 847261505 847707825 847923279 848137741 847509766 846665726 845894089 845569077 845944214 845805588
2129.4H45805588N04532P53021O11496L27606l58353m75463o91681m71802m58450J43356
$$ 845805588 846310120 847063141 847674637 848002243 847643890 847168427 846476746 846004944 845546494 845689850
2139H45689850M93927L52859Q59452N66330j19324o12106o21033k60315o3629k18888
$$ 845689850 846183777 846536636 847396088 847962418 847843094 847230988 846609955 846349640 846286011 846067123
2148.6H46067123K71378N16357N34L95966N46036L75366j77765l97110m58450q36106
$$ 846067123 846338501 846854858 846855392 847251358 847797394 848172760 847994995 847597885 847139435 846303329
2158.3H46303329k9602K04010O3935O02112J194305N38712k50168k7085n09643l73612
$$ 846303329 846273727 846477737 846541672 847143784 848338089 848876801 848626633 848599548 848089905 847716293
2167.9H47716293l42941m12903L09067Q09174P52105J01319M08554M95987M4174k24686
$$ 847716293 847373352 846960449 847269516 848078690 848830795 848932114 849340668 849836655 849880829 849656143
2177.6H49656143l96881j75857j51368J73416M64325O37436O46592M26178J00555o5155
$$ 849656143 849259262 849083405 848932037 849105453 849569778 850207214 850853806 851279984 851380539 851315384
2187.2H51315384k54517o88781k32087P5074M37088M17328R2773Q00323Q19321Q1101
$$ 851315384 851060867 850372086 850139999 850215073 850652161 851069489 851162262 851962585 852781906 852863007
2196.9H52863007n69535l88107l15247j50070M19770J11770L9368J46866P13501Q16879
$$ 852863007 852293472 851905365 851590118 851440048 851859818 851971588 852010956 852157822 852871323 853688202
2206.5H53688202l1281l23639j37100j73568l67966K32773J76849L12500J041870N83801
$$ 853688202 853656921 853333282 853196182 853022614 852654648 852887421 853064270 853376770 854418640 855002441
2216.1H55002441J6251J21307J72120o63147n53818l6469J71280M45023N1651L46145
$$ 855002441 855018692 855139999 855312119 854648972 854095154 854058685 854229965 854674988 854726639 855072784
2225.8H55072784M33732K50930O7444p6370o5765p15256o71616k2125N98068N78766
$$ 855072784 855506516 855757446 855824890 855748520 855682755 854967499 854295883 854273758 854871826 855450592
2235.4H55450592M62570N68695K39716j02005l67050l07236n19333k15683J39465J96000
$$ 855450592 855913162 856481857 856721573 856619568 856252518 855945282 855425949 855210266 855349731 855545731
2245.1H55545731O36825N59464K86331j65177p5988P8659j28174m02908n17426l5706
$$ 855545731 856182556 856742020 857028351 856863174 856787186 856865845 856737671 856334763 855817337 855781631
2254.7H55781631R7428N03921M63028J76010J39161j7701P1183j83487l25089o56738
$$ 855781631 855879059 856382980 856846008 857022018 857161179 857143478 857214661 857031174 856706085 856049347
2264.4H56049347k65579L49579M12521M70200K84194L76435J05972r5978k06604o6223
$$ 856049347 855783768 856133347 856545868 857016068 857300262 857676697 857782669 857686691 857480087 857413864
2274H57413864m45785o73905K31781L10593O52923N38712N09109M82712J8540r0103
$$ 857413864 856968079 856294174 856525955 856836548 857489471 858028183 858537292 859020004 859038544 858948441
2283.7H58948441p79343m63486n27115j89819K18353K67105N52826L5324O66504l65143
$$ 858948441 858169098 857705612 857178497 856988678 857207031 857474136 858026962 858062286 858728790 858363647
2293.3H58363647q89587l09601n08270j21536m98658J33591L1586P45621Q03909o89468
$$ 858363647 857474060 857164459 856656189 856534653 856035995 856169586 856201172 856946793 857750702 857061234
2302.9H57061234m80042p70645j14823n82199o77871j96534k17056L50800l30200M81414
$$ 857061234 856581192 855810547 855695724 855113525 854435654 854239120 854022064 854372864 854042664 854524078
2312.6H54524078m70886n14603K54288k00195N32074q72269m20456p21512j306839
$$ 854524078 854053192 853538589 853792877 853592682 854124756 853252487 852832031 852110519 850803680
2321.3H50803680K89765Q6136m64936q02536j73645j038742n01556M01993n02320j077423
$$ 850803680 851093445 851179581 850714645 849912109 849738464 848699722 848198166 848600159 848097839 847020416
2330.9H47020416m70505J267472P02743P60880j338196j411209Q23441o70624p71561
$$ 847020416 846549911 847817383 848520126 849281006 847942810 846531601 847355042 846684418 845912857
2339.6H45912857m77829N71976m98581J18713J182175J50146J218033K14005J701355
$$ 845912857 845435028 846007004 845508423 845627136 846809311 846959457 848177490 848391495 850092850
2348.3H50092850J768570j232987k057419j348342r56727m77371n10330j438980j454086
$$ 850092850 851861420 850628433 848571014 847222672 846265945 845788574 845278244 843839264 842385178
2356.9H42385178j184540l86048m20074j030121K39029M9439J541595J464691R7504
$$ 842385178 841200638 840814590 840394516 839364395 839603424 839652863 841194458 842659149 842756653
2365.6H42756653O79397J202393P46689n31006K08435K78854R79920J518097R62066
$$ 842756653 843436050 844638443 845385132 844854126 845062561 845341415 846321335 847839432 848801498
2374.3H48801498J394730J226349O81229M8675J26267J79748N26123Q59070O23932
$$ 848801498 850196228 851422577 852103806 852152481 852278748 852458496 852984619 853843689 854467621
2383H54467621P13043N51682Q95614N30091r079j80665o32476l93143n60761k50701
$$ 854467621 855180664 855732346 856627960 857158051 857148972 856968307 856335831 855942688 855381927 855131226
2392.6H55131226Q8958K41318P00455M25644M8141n02014l26309p2251m77523n84565
$$ 855131226 855220184 855461502 856161957 856587601 856635742 856133728 855807419 855735168 855257645 854673080
2402.3H54673080l39431M72717O91605Q6670j1750J55030r4300l49731o51779n74494
$$ 854673080 854333649 854806366 855497971 855584641 855572891 855727921 855633621 855283890 854632111 854057617
2411.9H54057617l04870k46277J29547J97754M54788L39737j86081k38190m12597m34113
$$ 854057617 853752747 853506470 853636017 853833771 854288559 854628296 854442215 854204025 853791428 853357315
2421.6H53357315m39529l10059l98483p5531L44009j12915j29471M0970J13754n54046
$$ 853357315 852917786 852607727 852209244 852133713 852477722 852364807 852235336 852276306 852390060 851836014
2431.2H51836014q31070j01395l39050n81741J21231N86700Q4686K00882K87476l24097
$$ 851836014 851004944 850903549 850564499 849982758 850103989 850690689 850775375 850976257 851263733 850939636
2440.8H50939636k73132l52936n03616p67746m53491M35562M78286J90049q7967m55704
$$ 850939636 850666504 850313568 849809952 849042206 848588715 849024277 849502563 849692612 849604645 849148941
2450.5H49148941p95288n29938j38092N0049o0349l59649J6098L41034L45001p7438
$$ 849148941 848353653 847823715 847685623 847735672 847675323 847315674 847331772 847672806 848017807 847940369
2460.1H47940369l04947J907m29993r03472n71290l31115m883M99039J24206O5155
$$ 847940369 847635422 847637329 847207336 846303864 845732574 845401459 845396576 845895615 846019821 846084976
2469.8H46084976P7896l71933k77633n76249o21643L9521J95999l85437j19324N44281
$$ 846084976 846162872 845790939 845513306 844937057 844315414 844354935 844550934 844165497 844046173 844590454
2479.4H44590454J13907j29166q3770L128o36826p75375K1972j45187K7161K75268
$$ 844590454 844704361 844575195 844491425 844494553 843857727 843082352 843104324 842959137 842986298 843261566
2489.1H43261566L04413J38168M2572j18637p62863m44183l99170k29035J35651n0354
$$ 843261566 843565979 843704147 843746719 843628082 842865219 842421036 842021866 841792831 841928482 841878128
2498.7H41878128J49002M49448L97720j70288l662j92032n87845l57513n35736l35694
$$ 841878128 842027130 842476578 842874298 842704010 842700348 842508316 841920471 841562958 841027222 840691528
2508.3H40691528j24740L76053M93011K55508K65809l02201n10940l98255o2790j72424
$$ 840691528 840566788 840942841 841435852 841691360 841957169 841654968 841144028 840745773 840682983 840510559
2518H40510559j97906J37176k58789j5564L74222J12381j33515l02352m79508l68957
$$ 840510559 840312653 840449829 840191040 840175476 840549698 840662079 840528564 840226212 839746704 839377747
2527.6H39377747j37406j34277N4474n036j63726n3711R9029j57471o14700m35333
$$ 839377747 839240341 839106064 839160538 839155502 838991776 838938065 839037094 838879623 838264923 837829590
2537.3H37829590k66419k02102J0910R155K57797N99060k28424p22427j31683o14243
$$ 837829590 837563171 837361069 837371979 837381134 837638931 838237991 838009567 837287140 837155457 836541214
2546.9H36541214r32007j84173O8283j88828P4844K37580j9989J39770j15204k78930
$$ 836541214 835609207 835425034 835493317 835304489 835379333 835616913 835596924 835736694 835621490 835342560
2556.6H35342560l64380n84107l29666j76010j98593k63061K58560L47290J00860q1176
$$ 835342560 834978180 834394073 834064407 833888397 833689804 833426743 833685303 834032593 834133453 834052277
2566.2H34052277n49317m71420o16303k97088j33362j83563K29339p9727Q2855M16260
$$ 834052277 833502960 833031540 832415237 832118149 831984787 831801224 832030563 831950836 832033691 832449951
2575.9H32449951L0365p43027o92520j40838j81122l6087r4910K7390r8420l82080
$$ 832449951 832480316 831737289 831044769 830903931 830722809 830686722 830591812 830619202 830520782 830138702
2585.5H30138702K4186L47976j84021j064682m88662k8077m1656K28195j61133r2544
$$ 830138702 830162888 830510864 830326843 829262161 828773499 828745422 828703766 828931961 828770828 828678284
2595.1H28678284J71203j19247j41754O0043l14331m37469j66474L967K18964o6986
$$ 828678284 828849487 828730240 828588486 828648529 828334198 827896729 827730255 827734222 827953186 827886200
2604.8H27886200j26953j44272k28348j62735k8229p6m39377l12881n89981m94995
$$ 827886200 827759247 827614975 827386627 827223892 827195663 827195587 826756210 826443329 825853348 825358353
2614.4H25358353N11932L54309k97317o55976l57589J52282n9738p65991p06711k22702
$$ 825358353 825870285 826224594 825927277 825271301 824913712 825065994 825006256 824240265 823533554 823310852
2624.1H23310852m16717k25449q0414j86386k34985m21982m59213p12052l97720L92227
$$ 823310852 822894135 822668686 822588272 822401886 822166901 821744919 821285706 820573654 820175934 820568161
2633.7H20568161K9984o14548l66211j87912j99967l90243l09448k23236q33435n46723
$$ 820568161 820598145 819983597 819617386 819429474 819229507 818839264 818529816 818306580 817473145 816926422
2643.4H16926422q9188k66342n80215l86505O5231L0136J63574n20401n71365l64609
$$ 816926422 816837234 816570892 815990677 815604172 815669403 815699539 815863113 815342712 814771347 814406738
2653H14406738p32803j88141n01480n10330j18256l01819k46505n9357Q5297k30561
$$ 814406738 813673935 813485794 812984314 812473984 812355728 812053909 811807404 811748047 811833344 811602783
2662.6H11602783k54898m17862n14831o91758o78329j05743k91291n9814J96457L7155
$$ 811602783 811347885 810930023 810415192 809723434 809045105 808939362 808648071 808588257 808784714 808821869
2672.3H08821869m54331p31658k73514j23749M9820l16239m12597j94550k59018m00238
$$ 808821869 808367538 807635880 807362366 807238617 807288437 806972198 806559601 806365051 806106033 805705795
2681.9H05705795k91061K47116p68890j109925N0354M89731j09482p57980L5553J48010
$$ 805705795 805414734 805661850 804892960 803783035 803833389 804323120 804213638 803455658 803491211 803639221
2691.6H03639221m86450m90265j75171j36719l81012j93328l62320k66724k38342n08194
$$ 803639221 803152771 802662506 802487335 802350616 801969604 801776276 801413956 801147232 800908890 800400696
2701.2H00400696m31595m16184j01852J13449j59149r18121p47681J73798k5330o00967
$$ 800400696 799969101 799552917 799451065 799564514 799405365 798487244 797739563 797913361 797888031 797287064
2710.9G97287064m99344j20392j72882l82920q78982p69806q545r6283k92358n6687
$$ 797287064 796787720 796667328 796494446 796111526 795232544 794462738 794454193 794357910 794065552 794008865
2720.5G94008865M8218k36893M3793L45001j37710o50864j019592p78809j53045K16903
$$ 794008865 794057083 793820190 793863983 794208984 794071274 793420410 792400818 791622009 791468964 791685867
2730.2G91685867l09829m17481m7226n26428m68597j03684J18942j91269m17251m4861
$$ 791685867 791376038 790958557 790911331 790384903 789916306 789812622 789931564 789740295 789323044 789278183
2739.8G89278183k77634l31268k39182k27890l46145k23923m043l50190l26080j46103
$$ 789278183 789000549 788669281 788430099 788202209 787856064 787632141 787628098 787277908 786951828 786805725
2749.4G86805725j94778n12925j12991K05536l50647j64032j10626k61002l68576k28576
$$ 786805725 786610947 786098022 785985031 786190567 785839920 785675888 785565262 785304260 784935684 784707108
2759.1G84707108M0969m61197l62548R4909N9433j06964m01459n61981l86276k87323
$$ 784707108 784748077 784286880 783924332 784019241 784078674 783971710 783570251 783008270 782621994 782334671
2768.7G82334671l02734M8828M87060K37885o08292o07681k42996k31171l2959k23236
$$ 782334671 782031937 782080765 782567825 782805710 782197418 781589737 781346741 781115570 781082611 780859375
2778.4G80859375m53644k60467n112j77994m94156m03442j95618k54593m25796k62070
$$ 780859375 780405731 780145264 780140152 779962158 779468002 779064560 778868942 778614349 778188553 777926483
2788G77926483r8343l9520o98547j102448l75976j34507j76162k50779j46026k52228
$$ 777926483 777828140 777788620 777090073 775987625 775611649 775477142 775300980 775050201 774904175 774651947
2797.7G74651947q68759q59146l27683k23160n40847k25220o13174j041718o43158
$$ 774651947 773783188 772924042 772596359 772373199 771832352 771607132 770993958 769952240 769309082
2806.3G69309082p17926l29666l91541o98394n85328n01480o48651j028137n72128
$$ 769309082 768591156 768261490 767869949 767171555 766586227 766084747 765436096 764407959 763835831
2815G63835831o52314p00912l67126q73566r32694o18057n66406p00073o88935n23987
$$ 763835831 763183517 762482605 762115479 761241913 760309219 759691162 759124756 758424683 757735748 757211761
2824.7G57211761n03006r31701r74045p55920j424942j097184k28881l82309o58799
$$ 757211761 756708755 755777054 754803009 754047089 752622147 751524963 751296082 750913773 750254974
2833.3G50254974p14187j306687j700668n68314l25393j019058j257935j359940j024170
$$ 750254974 749540787 748234100 746533432 745965118 745639725 744620667 743362732 742002792 740978622
2842G40978622j235656j336441j044083p34558m36859j481934k341690j827087j376496
$$ 740978622 739742966 738406525 737362442 736627884 736191025 734709091 732367401 730540314 729163818
2850.7G29163818j133880r46579p57675o48117q70591r92508j380615j217575p47452
$$ 729163818 728029938 727083359 726325684 725677567 724806976 723814468 722433853 721216278 720468826
2859.4G20468826j335144j393890j180039j116561j104203j547241j892776k110367
$$ 720468826 719133682 717739792 716559753 715443192 714338989 712791748 710898972 708788605
2867.1G08788605j583939j423111j856842k123642k288589j789856j931000k596817
$$ 708788605 707204666 705781555 703924713 701801071 699512482 697722626 695791626 693194809
2874.8F93194809k494278j966171j976395k256012k061462j759110j612777j826706
$$ 693194809 690700531 688734360 686757965 684501953 682440491 680681381 679068604 677241898
2882.5F77241898j561051j110611j081695j324845j336136o22863p76749p52258m18930
$$ 677241898 675680847 674570236 673488541 672163696 670827560 670204697 669427948 668675690 668256760
2891.2F68256760n35355l06244n19409o9351J01166r17054j009979l51715k07825k60010
$$ 668256760 667721405 667415161 666895752 666826401 666927567 666010513 665000534 664648819 664440994 664180984
2900.8F64180984l36227o56967l24936n56717q11157k73361m27170l76358l98026r00573
$$ 664180984 663844757 663187790 662862854 662306137 661494980 661221619 660794449 660418091 660020065 659119492
2910.5F59119492j477356j473236j129532j264801j424713j729737j415710j026001
$$ 659119492 657642136 656168900 655039368 653774567 652349854 650620117 649204407 648178406
2918.2F48178406j332627j912612j968461j401214j329422j236534j138573m68101
$$ 648178406 646845779 644933167 642964706 641563492 640234070 638997536 637858963 637390862
2925.9F37390862O5536k98805l72429k43225j66779l82156J70669M99802O60744J101913
$$ 637390862 637456398 637157593 636785164 636541939 636375160 635993004 636163673 636663475 637324219 638426132
2935.6F38426132O35643J204643J958237J744385J629562K224732K495270J891403
$$ 638426132 639061775 640266418 642224655 643969040 645598602 647823334 650318604 652210007
2943.3F52210007J679458J563111J966095K107849K027359K171860K444839K904053
$$ 652210007 653889465 655452576 657418671 659526520 661553879 663725739 666170578 669074631
2951F69074631K567520TJ825104J520614K333298K153626K334594K343750K322159
$$ 669074631 671642151 674209671 676034775 677555389 679888687 682042313 684376907 686720657 689042816
2959.7F89042816K199860J783447K018204K087173J964264J858597J680679J429444
$$ 689042816 691242676 693026123 695044327 697131500 699095764 700954361 702635040 704064484
2967.4G04064484J368637J704559K096405J779404J580734J682968J529160J508484
$$ 704064484 705433121 707137680 709234085 711013489 712594223 714277191 715806351 717314835
2975.1G17314835R50088J074600J591873J613465J408233J116181J621475J563110
$$ 717314835 718264923 719339523 720931396 722544861 723953094 725069275 726690750 728253860
2982.8G28253860J286164J055832Q26111J003952N58166N15289J215287J283569L73459
$$ 728253860 729540024 730595856 731421967 732425919 732984085 733499374 734714661 735998230 736371689
2991.5G36371689N59158J381531J252289R20257L98865L86810L05481J57929J87835
$$ 736371689 736930847 738312378 739564667 740484924 740883789 741270599 741576080 741734009 741921844
3000.2G41921844P5226K43378J38779K87704P59583M88128o34918q59604k77786q3771
$$ 741921844 741997070 742240448 742379227 742666931 743426514 743914642 743279724 742420120 742142334 742058563
3009.8G42058563l2501q4610j02997l87192J61896J37863p52639r13697j117935l80859
$$ 742058563 742026062 741941452 741838455 741451263 741613159 741751022 740998383 740084686 738966751 738585892
3019.5G38585892k77558p46536o46362l80860q1787r78393j087952m11224o09131j173782
$$ 738585892 738308334 737561798 736915436 736534576 736452789 735474396 734386444 733975220 733366089 732192307
3029.1G32192307q03605m01992r91974p09839n91660m54254q83713j581497r15985
$$ 732192307 731388702 730986710 729994736 729284897 728693237 728238983 727355270 725773773 724857788
3037.8G24857788r02939p18536n72510j086121j037750o56509n10178p61108q54035
$$ 724857788 723954849 723236313 722663803 721577682 720539932 719883423 719373245 718612137 717758102
3046.5G17758102j087188j398239j417084r70535j029053j186676m51355n23987j086426
$$ 717758102 716670914 715272675 713855591 712885056 711856003 710669327 710217972 709693985 708607559
3055.1G08607559j195984j317367j509857r50242o60552j320038j339188j074829q77457
$$ 708607559 707411575 706094208 704584351 703634109 702973557 701653519 700314331 699239502 698362045
3063.8F98362045j033859p37762o63453j490020j360855r68399q38852j366196j298828
$$ 698362045 697328186 696590424 695926971 694436951 693076096 692107697 691268845 689902649 688603821
3072.5F88603821j017838j194687m42047n93872j069641j556778j775589j188736r85412
$$ 688603821 687585983 686391296 685949249 685355377 684285736 682728958 680953369 679764633 678779221
3081.2F78779221r78013j484527j314316p20367o99540j221237j442489j035996j021042
$$ 678779221 677801208 676316681 675002365 674281998 673582458 672361221 670918732 669882736 668861694
3089.9F68861694r37194j384964j190796j070481j573715r45358j115494j356659j006622
$$ 668861694 667924500 666539536 665348740 664278259 662704544 661759186 660643692 659287033 658280411
3098.5F58280411q17337j021576j460953j354065j347656j314469j323394j064682
$$ 658280411 657463074 656441498 654980545 653626480 652278824 650964355 649640961 648576279
3106.2F48576279j152344j063461k88010p75833j405640j498489j362839j323166j613655
$$ 648576279 647423935 646360474 646072464 645296631 643890991 642392502 641029663 639706497 638092842
3114.9F38092842j367264r99450q97751q18825o91223q06847j212730j957207j818237
$$ 638092842 636725578 635726128 634828377 634009552 633318329 632511482 631298752 629341545 627523308
3123.6F27523308q19893r01871j357994j289291o83975m99383j167259j124115r14612
$$ 627523308 626703415 625801544 624443550 623154259 622470284 621970901 620803642 619679527 618764915
3132.3F18764915j755561j641503p77282j297036j318893o49719l97568q77342j637268
$$ 618764915 617009354 615367851 614590569 613293533 611974640 611324921 610927353 610050011 608412743
3141F08412743j106720j206551j606293j141395r34105q86421j131363j210099r87701
$$ 608412743 607306023 606099472 604493179 603351784 602417679 601531258 600399895 599189796 598202095
3149.6E98202095q55179j040802r53445q10509j024399j197243j349372r47533q43277
$$ 598202095 597346916 596306114 595352669 594542160 593517761 592320518 590971146 590023613 589180336
3158.3E89180336q68568j088715j336784p87049q30497r17550j028938j502380j584091
$$ 589180336 588311768 587223053 585886269 585099220 584268723 583351173 582322235 580819855 579235764
3167E79235764r69620m54140o62727q72116j053963p88803j170311j443634r18579
$$ 579235764 578266144 577812004 577149277 576277161 575223198 574434395 573264084 571820450 570901871
3175.7E70901871q79174q41255j229553j068420q43087r02557o46934n99747o35224
$$ 570901871 570022697 569181442 567951889 566883469 566040382 565137825 564490891 563891144 563255920
3184.4E63255920j029472p76977r55353j279984r85145j250725j100884p82356q18176
$$ 563255920 562226448 561449471 560494118 559214134 558228989 556978264 555877380 555095024 554276848
3193E54276848q68416o72531q42476r05075j028214r70878j86959o52847r12742j036263
$$ 554276848 553408432 552735901 551893425 550988350 549960136 548989258 548802299 548149452 547236710 546200447
3202.7E46200447r52454n99403m67338k12250j487694j160240o42281j009483p74536
$$ 546200447 545247993 544648590 544181252 543969002 542481308 541321068 540678787 539669304 538894768
3211.4E38894768j047478j50375m61655o80809k76642p81059q70857j260643o27327
$$ 538894768 537847290 537696915 537235260 536554451 536277809 535496750 534625893 533365250 532737923
3220E32737923m67034q00628p15523o71501m44184p11021o33659r14269p15828k92396
$$ 532737923 532270889 531470261 530754738 530083237 529639053 528928032 528294373 527380104 526664276 526371880
3229.7E26371880p28608q86612o40258m32778q10432l39012j90049j101722j039810
$$ 526371880 525643272 524756660 524116402 523683624 522873192 522534180 522344131 521242409 520202599
3238.4E20202599o47469p33871o58722m4747J11771l60756r91592q73948l94172k89231
$$ 520202599 519555130 518821259 518162537 518117790 518229561 517868805 516877213 516003265 515609093 515319862
3248E15319862k04277n75294r02023o47545K50702j64910j177330o92825n82619n79223
$$ 515319862 515115585 514540291 513638268 512990723 513241425 513076515 511899185 511206360 510623741 510044518
3257.7E10044518k12479J716m83589o65016n52711o53725r6054l70751m74395o28662
$$ 510044518 509832039 509833755 509350166 508685150 508132439 507478714 507382660 507011909 506537514 505908852
3267.3E05908852n05753K97356k62642n71327n34935l05748m03557p02934m49677n01099
$$ 505908852 505403099 505700455 505437813 504866486 504331551 504025803 503622246 502919312 502469635 501968536
3276.9E01968536n6038J60256j59302p39860p29218l13110o07415p07054m46930k48909
$$ 501968536 501912498 502072754 501913452 501173592 500444374 500131264 499523849 498816795 498369865 498120956
3286.6D98120956l92074m4289R8381j87263l04299m16908k76070o39457m96178m05540
$$ 498120956 497728882 497684593 497782974 497595711 497291412 496874504 496598434 495958977 495462799 495057259
3296.2D95057259o10276q49533o52313L51105m80767r39979k27089k3232k83737p19909
$$ 495057259 494446983 493597450 492945137 493296242 492815475 491875496 491648407 491625175 491341438 490621529
3305.9D90621529k64511k69585k37198j94473n91011o26335r00460o67343R9945l8910
$$ 490621529 490357018 490087433 489850235 489655762 489064751 488438416 487537956 486870613 486970558 486931648
3315.5D86931648o20041n43098r25102p32308j94015l91197O2103M3335n99022j549263
$$ 486931648 486311607 485768509 484843407 484111099 483917084 483525887 483587990 483631325 483032303 481483040
3325.2D81483040j063805J41869k44751p35741j225204n32570N9242k82593k03094
$$ 481483040 480419235 480561104 480316353 479580612 478355408 477822838 477882080 477599487 477396393
3333.8D77396393n87311p44362m02946m76952r28116n50728l83453k87781j79100q05740
$$ 477396393 476809082 476064720 475661774 475184822 474256706 473705978 473322525 473034744 472855644 472049904
3343.5D72049904m39034n07583n83840n16357j044579r15260n03311k28844m98390
$$ 472049904 471610870 471103287 470519447 470003090 468958511 468043251 467539940 467311096 466812706
3352.2D66812706m73022q94700q35075n34592r70687j3810k22206j079178q44421m76875
$$ 466812706 466339684 465444984 464609909 464075317 463104630 463090820 462868614 461789436 460945015 460468140
3361.8D60468140l46299n73234m12521m20571l78380o08101p44171j026344r96742
$$ 460468140 460121841 459548607 459136086 458715515 458337135 457729034 456984863 455958519 454961777
3370.5D54961777p8163k49062m75578m61502l69988r68208j405487o10810m62722l8414
$$ 454961777 454883614 454634552 454158974 453697472 453327484 452359276 450953789 450342979 449880257 449841843
3380.1D49841843k92893o66961j21994k65122p91511o40831J02882j03226k09770l74146
$$ 449841843 449548950 448881989 448759995 448494873 447703362 447062531 447165413 447062187 446852417 446478271
3389.8D46478271n42907j90811o18248r91326o47964K63901l0175n51834k39944m19617
$$ 446478271 445935364 445744553 445126305 444134979 443487015 443750916 443720741 443168907 442928963 442509346
3399.4D42509346p8506n17769r71566k64358J77956L56254J04599n84946p11784q4801
$$ 442509346 442430840 441913071 440941505 440677147 440855103 441211357 441315956 440731010 440019226 439934425
3409.1D39934425k05841n55038r6359L15094j1979m78744k03018K08511j9073k11487
$$ 439934425 439728584 439173546 439077187 439392281 439380302 438901558 438698540 438907051 438887978 438676491
3418.7D38676491J52359m11911p17392r4986J37291K03399l26538R8076J16120r48677
$$ 438676491 438828850 438416939 437699547 437604561 437741852 437945251 437618713 437716789 437832909 436884232
3428.3D36884232m38118M1351J63269N52406K52037j17836P5836k2506m43955m06646
$$ 436884232 436446114 436487465 436650734 437203140 437455177 437337341 437413177 437390671 436946716 436540070
3438D36540070K67334N27191L73687M76265m41970j52169N60952J63803L66897l41530
$$ 436540070 436807404 437334595 437708282 438184547 437742577 437590408 438151360 438315163 438682060 438340530
3447.6D38340530M1237Q39310N97687J67732k19269N54085O91566K7543j25199M48952
$$ 438340530 438381767 439221077 439818764 439986496 439767227 440321312 441012878 441040421 440915222 441364174
3457.3D41364174O33850M08630M04511J16920K57759k87170k29378N77126Q90388O66199
$$ 441364174 441998024 442406654 442811165 442928085 443185844 442898674 442669296 443246422 444136810 444803009
3466.9D44803009j5755J46714J19285R99413J185760K12860K90795J45492J01776L43666
$$ 444803009 444787254 444933968 445053253 446052666 447238426 447451286 447742081 447887573 447989349 448333015
3476.6D48333015P16286j3695K05574J109543K97852M0703J22604J147347Q93859K07329
$$ 448333015 449049301 449035606 449241180 450350723 450648575 450689278 450811882 451959229 452853088 453060417
3486.2D53060417N43518k35901R1324O05736O64520K21749O85997J333770J85395J4877
$$ 453060417 453603935 453368034 453459358 454065094 454729614 454951363 455637360 456971130 457156525 457171402
3495.8D57171402N6000M05616Q89931O69060N17426Q40988P19337j62201L72124O43387
$$ 457171402 457227402 457633018 458522949 459192009 459709435 460550423 461269760 461107559 461479683 462123070
3505.5D62123070Q60710Q57963P43752J13564o28434Q65631Q35038N46684P86819J044693
$$ 462123070 462983780 463841743 464585495 464699059 464070625 464936256 465771294 466317978 467104797 468149490
3515.1D68149490J039276K88163P36198N01213M02336R11179R10339j0566j34049J315384
$$ 468149490 469188766 469476929 470213127 470714340 471116676 472027855 472938194 472927628 472793579 474108963
3524.8D74108963Q70895O04554K18849M24003J039124R53293N66864M54902J269913
$$ 474108963 474979858 475584412 475803261 476227264 477266388 478219681 478786545 479241447 480511360
3533.5D80511360O45065J671105Q80356q60214R85336M36058R05952J144371Q38814
$$ 480511360 481156425 482827530 483707886 482847672 483833008 484269066 485175018 486319389 487158203
3542.1D87158203J028328O58417N96618L70751J353950K21138J131936J483383J471405
$$ 487158203 488186531 488844948 489441566 489812317 491166267 491387405 492519341 494002724 495474129
3550.8D95474129K104492q63495N77698J160316J358948J632347K03896J429290J081200
$$ 495474129 497578621 496715126 497292824 498453140 499812088 501444435 501648331 503077621 504158821
3559.5E04158821O01997M47197K083397J140290N93490M376412m54483j767159J68343
$$ 504158821 504760818 505208015 507291412 508431702 509025192 513401604 512947121 511179962 511348305
3568.2E11348305N02472L395652J305504J979256K382355J491241R52873J560173J818200
$$ 511348305 511850777 515246429 516551933 518531189 520913544 522404785 523357658 524917831 526736031
3576.9E26736031j95275K093048J505432M64173K052193J911888J500625J551895M503708
$$ 526736031 526540756 528633804 530139236 530603409 532655602 534567490 536068115 537620010 542123718
3585.5E42123718N87807l131218J963348J61629L557320M012108L000259N08995J66283
$$ 542123718 542711525 539580307 541543655 541705284 545262604 549274712 552274971 552783966 552950249
3594.2E52950249L299980p23419K814750L532296K80227K214203J48888J682167K563667
$$ 552950249 556250229 555526810 558341560 561873856 562154083 564368286 564517174 566199341 568763008
3602.9E68763008J269417K361259L699799K526703j307449L531150k78740K15073P302513
$$ 568763008 570032425 572393684 576093483 578620186 577312737 580843887 580565147 580780220 588082733
3611.6E88082733j19743j420784L667488l07808M527359L739586K01111K223816j556893
$$ 588082733 587962990 586542206 590209694 589901886 594429245 598168831 598369942 600593758 599036865
3620.3E99036865J226082L676605K163697K648353L264771J406173J879425O754532
$$ 599036865 600262947 603939552 606103249 608751602 612016373 613422546 615301971 622056503
3628F22056503l654785j1820488O733437O265335O451492Q08907k674866L099976L360977
$$ 622056503 618401718 606581230 613314667 619580002 626031494 626840401 624165535 627265511 630626488
3636.6F30626488K503319P26318R74121K460709K973709J145553K84577K547378L196488
$$ 630626488 633129807 633856125 634830246 637290955 640264664 641410217 641694794 644242172 647438660
3645.3F47438660M514618l113709l383713N055695k059097k058487Q49533O872253
$$ 647438660 651953278 648839569 645455856 650511551 648452454 646393967 647243500 654115753
3653F54115753N481491L699875L006210q784866K830658N510712J419449J498565Q98819
$$ 654115753 659597244 663297119 666303329 657518463 660349121 665859833 667279282 668777847 669676666
3661.7F69676666K436600Q55331J323548J665497J305313M777832J494293j939926
$$ 669676666 672113266 672968597 674292145 675957642 677262955 682040787 683535080 681595154
3669.4F81595154j507874n758285M938965R223861P483216o870804j8158722P343597
$$ 681595154 680087280 674328995 679267960 688491821 695975037 689104233 670945511 678289108
3677.1F78289108R806214N241928k370835N97763L219529J916275J645584P0877Q7662
$$ 678289108 688095322 693337250 690966415 691564178 694783707 696699982 698345566 698416443 698504105
3685.8F98504105M095077N009003j1417999j657563Q933564o328736J610947O385269
$$ 698504105 702599182 707608185 696190186 694532623 703466187 697137451 698748398 705133667
3693.5G05133667J178131K046433j62430l5095K159957Q12149K118378J777573n911713
$$ 705133667 706311798 708358231 708195801 708160706 710320663 711132812 713251190 715028763 709117050
3702.2G09117050j546936N469589J742783Q83026J167450K441330L469009p421493
$$ 709117050 707570114 713039703 714782486 715665512 716832962 719274292 722743301 715321808
3709.9G15321808M328308J595077j4095382P393112N728607J321716J063462J830139
$$ 715321808 719650116 721245193 707149811 714542923 720271530 721593246 722656708 724486847
3717.7G24486847K39410l538971K379761N621948m518356l677521N240326K82364K56729
$$ 724486847 724726257 721187286 723567047 729188995 724670639 720993118 726233444 726515808 726772537
3726.3G26772537j767883m04434L494644J398392O315384l752137p060013J0145112
$$ 726772537 725004654 724600220 728094864 729493256 735808640 732056503 724996490 735141602
3734G35141602j623078j1509476Q68149L161469J912765L936920L621674k786179M554444
$$ 735141602 733518524 722009048 722877197 726038666 727951431 731888351 735510025 732723846 737278290
3742.7G37278290J1308746j5841522j4079819J3103180O623154M805755o987533q730927
$$ 737278290 748587036 732745514 718665695 731768875 738392029 743197784 736210251 727479324
3750.4G27479324J2849732p532044m964828P957764M910964K394181n234146K713775
$$ 727479324 740329056 732797012 727832184 735789948 740700912 743095093 737860947 740574722
3758.2G40574722L730622p787552Q06350M731293Q44650N75943L604432m039917l665390
$$ 740574722 744305344 736517792 737324142 742055435 742900085 743476028 747080460 743040543 739375153
3766.8G39375153M592285M505996j486663r302216L198853L951187J056747J614075
$$ 739375153 743967438 748473434 746986771 737684555 740883408 744834595 745891342 747505417
3774.5G47505417m45252L08152M52881K398910j899872p075577L917618K705612J237412
$$ 747505417 747060165 747368317 747821198 750220108 748320236 741244659 745162277 747867889 749105301
3783.2G49105301J281357l722229k13852J856079J118469R97009L89710J182785q9417
$$ 749105301 750386658 746664429 746450577 748306656 749425125 750422134 750811844 751994629 751905212
3791.9G51905212j12533L19061J970978K646408o034699k915267L813858M389114M664688
$$ 751905212 751792679 752111740 754082718 756729126 750694427 747779160 751593018 755982132 760646820
3800.6G60646820j2036056q334198P499771M387970N588836M006348j2707596k978668
$$ 760646820 748610764 740276566 747776337 752164307 757753143 761759491 749051895 746073227
3808.3G46073227O115112K929077J213227N15136j23977J504745M945755m946136j2675781
$$ 746073227 752188339 755117416 756330643 756845779 756721802 758226547 763172302 758226166 745550385
3817G45550385Q213424N314026K633057L44543j7075500M141311O147766K062149K462006
$$ 745550385 753763809 759077835 761710892 762055435 744979935 749121246 755269012 757331161 759793167
3825.7G59793167n45502l191223J497116K299042L245239N71289q575363L968964N838699
$$ 759793167 759247665 756056442 757553558 759852600 763097839 763669128 755093765 759062729 764901428
3834.3G64901428q464966P51267P646637j0235138j837998Q404160n703812J514283
$$ 764901428 756436462 757187729 764834366 754599228 752761230 761165390 755461578 756975861
3842.1G56975861P300949m664612l546906M220887J697769N29098K007294j108780
$$ 756975861 764276810 759612198 756065292 760286179 761983948 762513046 764520340 763411560
3849.8G63411560K649612M185181r245453M4632j5873108O176834J1778260j127930
$$ 763411560 766061172 770246353 761000900 761045532 745172424 751349258 763127518 761999588
3857.5G61999588m06723K636337K337876J886520o790848M23355N893250o989517k809449
$$ 761999588 761592865 764229202 766567078 768453598 761662750 762086105 767979355 760989838 758180389
3866.2G58180389N339280N077667L983536j1848221n821305O981278O889038J770325
$$ 758180389 763519669 768597336 772580872 760732651 754911346 761892624 768781662 770551987
3873.9G70551987j0609742K638550L847122n92880K724838L323517q386688n592956
$$ 770551987 759942245 762580795 766427917 765835037 768559875 771883392 763496704 757903748
3881.6G57903748P827148J558685J544113L067933j3021622L789902M698104J093445
$$ 757903748 765730896 767289581 768833694 771901627 758880005 762669907 767368011 768461456
3889.3G68461456M158173l012619q202438L400497M100189r33533J739884J382446
$$ 768461456 772619629 769607010 761404572 764805069 768905258 767971725 769711609 771094055
3897G71094055J618958n22538r373321O275024J438752m813462M160004m960404p52258
$$ 771094055 772713013 772190475 762817154 769092178 770530930 765717468 769877472 764917068 764164810
3905.7G64164810J866684J123123J886521N52444J426544n87082l92532M91257N9433
$$ 764164810 766031494 767154617 769041138 769593582 771020126 770433044 770040512 770531769 770591202
3914.4G70591202J897659J458893m932709k869339M964905n87387l352661K792740
$$ 770591202 772488861 773947754 769015045 766145706 771110611 770523224 767170563 769963303
3922.1G69963303J571045P49816k636871k151260J925659J011505J390381p10373O9427
$$ 769963303 771534348 772284164 769647293 767496033 769421692 770433197 771823578 771113205 771182632
3930.8G71182632J883316l207778j361771J950149P39975M62571O26602l69492r28879
$$ 771182632 773065948 769858170 768496399 770446548 771186523 771649094 772275696 771906204 770977325
3939.5G70977325k4795J796112j62125m191818J000748J913147J396637J027450l318786
$$ 770977325 770952530 772748642 772586517 768394699 769395447 771308594 772705231 773732681 770413895
3948.1G70413895P93762L01819j565323K320556L40958l61404m57383m7531M38996
$$ 770413895 771207657 771509476 769944153 772264709 772605667 772244263 771786880 771739349 772178345
3956.8G72178345o0730Q50219l14483O74133k10800j234741J315307L05939l07236
$$ 772178345 772117615 772967834 772653351 773327484 773116684 771881943 773197250 773503189 773195953
3965.5G73195953K53449M89960M38385n47791j29166P14035l96194r13239M90113Q56170
$$ 773195953 773449402 773939362 774377747 773829956 773700790 774414825 774018631 773105392 773595505 774451675
3975.1G74451675k64587j244888L07693O18668q94165k37961M72107R37271M05655
$$ 774451675 774187088 772942200 773249893 773868561 772974396 772736435 773208542 774145813 774551468
3983.8G74551468l03803j09329j96228J39465N90363N07431n79452l93525K09427k8000
$$ 774551468 774247665 774138336 773942108 774081573 774671936 775179367 774599915 774206390 774415817 774387817
3993.5G74387817J30921k90299k68325K35061L59726k23770L1433
$$ 774387817 774518738 774228439 773960114 774195175 774554901 774331131 774362564
4000.2G74362564
$$ 774362564
##END=$$ End of the data block
