##TITLE=$$ Begin of the data block
##JCAMP-DX=5.00 $$ ACD/SpecManager v 10.08
##SPECTROMETER/DATA SYSTEM=Varian
##DATE=15 Jan 2013 14:56:22
##DATA TYPE=INFRARED SPECTRUM
##DATA CLASS=XYDATA
##ORIGIN=
##OWNER=
##NPOINTS=3735
##FIRSTX=399.26403809
##LASTX=4000.35498047
##MAXX=4000.35498047
##MINX=399.26403809
##MAXY=86.04705048
##MINY=37.49903107
##XFACTOR=1.0000000000
##YFACTOR=0.000000100000000
##FIRSTY=68.47551727
##DELTAX=0.96440572
##XUNITS=1/CM
##YUNITS=TRANSMITTANCE
##XYDATA=(X++(Y..Y))
399.3 684755173 676418610 668278885 667751770 667824097 657691269 647272873 644544525 636977005 629823112
407.9 629823112 637240334 658162155 666223907 660733261 654967957 654052963 657342911 657068863 655136337
416.6 655136337 652723083 653864899 647672272 646002808 657421036 663758011 659203720 656085739
424.3 656085739 649690781 642695847 645702591 648870926 648679199 649777451 653470459 652590179 645913010
433 645913010 645598679 644043655 641350861 644852829 643633041 644089661 648290405 651063232 652288742
441.7 652288742 651592636 648660736 649285812 652544098 649960022 652465363 656481705 654625092 657708511
450.4 657708511 662312393 662514801 663174591 664981308 663127365 658443451 652332764 647212296 655520554
459.1 655520554 663492508 663726425 663107071 664908218 662567749 658999481 654085846 649906616 647753296
467.7 647753296 648401260 649894791 647411728 649556580 651144943 649298477 647076721 638680077 634662018
476.4 634662018 634572945 638250847 639716644 637613258 639747124 641800995 645087128 642322159 639790688
485.1 639790688 637369614 632825279 635337296 634066505 632376175 635281105 641770020 645100708
492.8 645100708 642698822 640866470 637527237 631794701 625355568 625202446 627969818 632568169 636991234
501.5 636991234 633661613 634378738 636183205 633650742 629259453 628085136 629236298 626121368 625105209
510.2 625105209 625140190 621849098 619257812 620200348 618381157 612207985 606444855 603585701 604202919
518.9 604202919 602905922 603509636 605298615 606475029 606198082 602596130 601196022 601742401 603084106
527.5 603084106 601213112 598629303 599447136 601093063 603302650 605346794 609768867 610853653 610019226
536.2 610019226 609594727 609134216 612199478 613717880 616042137 618662949 620681992 623772697 625805817
544.9 625805817 628275528 629702377 628381233 624881210 622337990 621123772 621749878 622974625 623446999
553.6 623446999 625551376 624644890 623440514 620684013 614955978 611098747 606730957 605309792 605298233
562.3 605298233 605215492 603821220 601346016 599405708 595264854 591330376 586810379 583659477 580588646
570.9 580588646 578241844 577614136 576792183 577887154 578201332 579304085 579572372 579729805 580169983
579.6 580169983 581189117 583829079 585499115 589350281 593743896 599341087 603457375 605107918
587.3 605107918 607861938 609595985 609573975 609937897 612293701 612089920 612765388 615447998 616908035
596 616908035 618107567 616823425 616273422 615918159 615685234 614844894 612478333 612956619 613069191 614130707
605.6 614130707 615356064 615774994 617905312 618687897 617537918 615382462 614636230 615670662 617825317
614.3 617825317 620244293 622413483 624995003 627945557 630193634 630163231 630912895 631317825 631225090
623 631225090 633868179 636455994 639885101 644136810 646604614 648111267 648699951 648380661 648690491
631.7 648690491 649235992 649137802 649618988 650755310 651712646 653154526 655325623 656876144 657480545
640.4 657480545 656747742 655287323 654631271 654135437 654402542 656197433 658454208 660437164 662672348
649 662672348 664111481 663244781 662759018 662190781 660079803 659114304 660100327 661487427 662984238
657.7 662984238 664864807 666359940 668082657 668179474 666959152 667024231 667219543 667526093 668383789
666.4 668383789 667693253 659075317 664719543 671591797 673679123 673843994 673158188 672044754 671667862
675.1 671667862 671396179 671869278 673725586 677070465 678754501 679299698 679832764 679034195 678241882
683.8 678241882 677679901 677491913 677106552 677200546 678653030 680617065 682835236 683750229 682508774
692.4 682508774 681178894 680479965 678348999 676348724 674869308 673356323 674171829 674606247 673981171
701.1 673981171 673356247 671735611 669687500 667132034 664980316 664241867 664434357 664005814 664249344
709.8 664249344 666478195 668788300 670421829 671883774 673606873 674027863 673992996 675261765 676467438
718.5 676467438 678256836 681127625 684712601 689132767 692555084 694627914 696635742 698213196
726.2 698213196 699778061 701404190 702569656 703929825 706432877 709657593 712280579 713845978
733.9 713845978 714753265 715662155 715051880 713439941 714462509 716942291 717231216 716825333 718304214
742.6 718304214 719478226 719056931 718283844 716781387 713805008 709480896 705603943 703458405 702370605
751.3 702370605 702476578 701630936 698947678 696618958 694445801 692116089 688732605 685184326 683260727
760 683260727 682258682 681781387 681700287 682702942 684239120 685210419 686129684 686671829 686677933 687676620
769.6 687676620 689304733 690352783 692363205 697277603 703877258 709253693 712898560 715463409
777.3 715463409 717707520 719223404 720378418 722082977 724044037 727550507 732132263 736168747
785 736168747 739472351 741220245 742171555 743380890 743665466 743198242 743155441 744034119 746079559 749176712
794.7 749176712 752262650 755019760 757446594 759163589 761005173 761377411 761181488 762273483 762723618
803.4 762723618 764425278 767266083 770207825 772616730 773637924 774895477 774916763 773705292 772331543
812 772331543 772009735 772340851 772796021 774820480 777466049 779968491 779828568 778233643 777691803
820.7 777691803 776637421 775243912 774007034 772589874 771332932 771881332 772616653 772445450 771471863
829.4 771471863 768454208 764428864 760752029 757826691 754616165 752429428 751485214 750587997 749235687
838.1 749235687 747171860 745511627 743196487 740413513 736933136 733643036 732316284 731017914
845.8 731017914 729825745 730136642 731322174 731712494 731327820 730472794 728475800 725504379 722725983
854.5 722725983 720981293 719432678 718861008 719493179 720677490 721023331 720360336 720624924 720907745
863.1 720907745 721397705 722550354 724918213 729289322 734232788 739659882 745572128 751377258 755629272
871.8 755629272 758748245 761348801 762359314 762794800 763230515 765543900 767665482 769468842 772179184
880.5 772179184 772938156 772057343 768515854 764119949 760861816 758108826 755053101 752650146 751648941
889.2 751648941 750291824 749776917 748391266 745231705 741295242 737336426 734820938 732370529 730267792
897.9 730267792 728850021 728360367 728171463 727405548 726478653 724387894 720726547 715655289 710721283
906.5 710721283 706897125 704748001 703068542 700763092 699196472 696997833 693601303 689058228
914.3 689058228 683425980 677921371 672591476 668544235 665162964 661637421 660258179 660068436 659273834
922.9 659273834 657767563 656433792 655237732 652896118 651311417 650649948 650470505 651135178 652760696
931.6 652760696 655719986 657919922 659057236 660185242 661265640 661687851 662381058 664399185 666910629
940.3 666910629 670309753 674264832 677404709 679518967 680881653 680768127 678997269 675723572 671868134
949 671868134 668767166 665373001 662108307 658951416 654760971 650128632 643916397 636706123 628543892
957.7 628543892 619831085 611803017 604228020 597480850 590102921 583304558 575678482 567351875
965.4 567351875 559175835 549160385 539159584 528739853 518835564 508882866 499406853 489901505
973.1 489901505 479828720 471357307 462342224 453354568 443179054 433744240 425177765 417363434
980.8 417363434 411115265 404468727 399392700 394268265 390818901 387394257 384632225 382446022
988.5 382446022 379501572 378335381 376144371 375777969 374990311 375266495 376793060 377368546 379359360
997.2 379359360 380054398 381836967 382267952 382057724 381535263 381113663 382635536 383172951 384503136
1005.9 384503136 384473724 385412598 385699043 384331856 383006668 381260223 381292572 379761887 380149803
1014.6 380149803 381260567 382153358 382999992 382844276 384244690 384869461 386127892 386044922 387062531
1023.2 387062531 388724480 390442619 393520088 394499550 396644974 398706398 401887665 404095497
1031 404095497 405888367 407929077 407614632 409112663 410701675 413786240 415491333 416781349 418435936
1039.6 418435936 418608665 419815407 418847122 418981934 419062424 420135269 421662331 422551842 425274925
1048.3 425274925 426848297 429294281 430212059 432306862 434919434 436615562 438802948 440602951
1056 440602951 444679489 447863388 452769012 457637291 463112335 469418831 473720894 479189949 484212570
1064.7 484212570 489750824 493419037 497226067 499619751 499008446 498080063 492646027 486320114 479383812
1073.4 479383812 472771721 466152420 459627190 456224976 453399582 452445831 451084099 451732407 452155838
1082.1 452155838 452849770 454558334 454660759 456564980 457249565 459278679 461606369 465828438 471219025
1090.7 471219025 474356270 477566147 479463539 483164711 485811157 487792282 489012871 489667931
1098.5 489667931 491924667 492817879 494372215 495178299 496460838 497340012 498333588 499261169 498890076
1107.1 498890076 499442635 498675346 500745850 503382301 506259079 509581184 511884079 514714355 514777679
1115.8 514777679 515326538 515846710 517825432 519747353 519797897 520747795 521155128 523467598 524497528
1124.5 524497528 525616455 527335052 528671379 529822197 529712181 532060280 534286842 537059517
1132.2 537059517 538831711 540375175 542350998 542038956 542255020 540441971 537762146 533580627 529099350
1140.9 529099350 525791550 521670113 518146477 513353577 510210571 506642227 502426872 498379860
1148.6 498379860 494096718 491266899 487522011 485321388 483240051 482651749 482080765 481274338 481719093
1157.3 481719093 481432419 482395706 481741753 482473068 483506584 485204964 488369598 491036644 495519600
1166 495519600 499042168 504139099 509015656 513712883 518474274 523093529 529534111 534882660 541386108
1174.6 541386108 547926712 555441666 562958412 569292336 576017189 581961250 588009109 592359314
1182.4 592359314 597086372 602490311 608083382 614485741 620310936 626154671 630197411 633111649
1190.1 633111649 635683937 637815475 639253540 639816170 641470795 643518906 645453491 646804810
1197.8 646804810 648199234 649569473 649910660 649985657 649622650 649504013 649269257 649779510 651785812
1206.5 651785812 654320755 657229080 659720840 661526947 662606964 664006958 665594711 666556854
1214.2 666556854 667562866 669563751 672477112 674874496 677608566 680206375 681083069 681292114 681415405
1222.9 681415405 681115417 679743347 678445129 678539276 679316330 680522232 681178131 680815811 680450516
1231.5 680450516 680032654 678698196 676857147 675219269 673935776 673634949 674103088 674776764 675715485
1240.2 675715485 676779938 676913757 676316071 675705338 674890289 674361496 674547653 675425415 676592407
1248.9 676592407 678257065 680404663 682237244 683309402 683840561 684110565 683936844 683577957 683523636
1257.6 683523636 684080124 685500793 687229233 688760910 690302277 691338272 691351547 690863953 690326691
1266.3 690326691 690016251 690150223 691250916 693320465 695400162 697149887 698416824 699307175 699593353
1274.9 699593353 698892593 697742996 696981125 696532440 696418533 696816101 697563019 698197556 698237534 697934952
1284.6 697934952 697653046 697096405 695621414 693827133 692625504 692086029 692298889 692950974 693301239
1293.3 693301239 693155365 692570343 691314697 689692917 687700119 685825577 684906006 684829407 685323944
1301.9 685323944 685573425 685821533 686258163 686391373 685651398 684191666 682895737 681251144 680273056
1310.6 680273056 680617599 681436844 682025146 681829758 681796265 681442108 680094757 678411331 676390610
1319.3 676390610 674866562 674069901 673482819 673167114 672811661 672081757 670891266 669021759 666488800
1328 666488800 663210831 660311890 657872009 655264206 653667526 652624969 652327271 651831741 650635376
1336.7 650635376 649646683 648439255 646625595 644451904 644326782 644968719 645251694 645667648 646592178
1345.3 646592178 647629852 648297653 648593369 647848511 646775818 645756760 644779129 644159775 643914871
1354 643914871 644102173 644527359 645355606 645468903 645125732 644119186 641942368 640225296 638374481
1362.7 638374481 636982002 637598648 638603401 639254875 639948997 639997940 639567680 639787598 639108696
1371.4 639108696 638492737 637626076 637273865 638553810 640549927 642910385 644260254 645358200 645397873
1380.1 645397873 645188141 644921188 644360123 644816513 645824280 647864609 649554214 651906204 654750977
1388.7 654750977 656790619 657928543 658779221 659624023 659195480 657734604 657112274 658851929 660362854
1397.4 660362854 661036453 660395050 660067444 661018524 660132370 659036713 657774963 654578323 653727798
1406.1 653727798 654410706 654935913 654972610 655211182 654909592 654149780 653343506 652364197 651141739 650062027
1415.7 650062027 649587784 649205933 650149918 648358994 649009781 651629944 652415085 652542191 649779892
1424.4 649779892 649480057 650595245 650726471 652264404 652948608 652990112 654322739 656598892 657044067
1433.1 657044067 656489639 657201767 656271896 651821213 653358688 657634735 659697418 660962524 662363281
1441.8 662363281 663069000 664261475 663600006 663126297 662712097 661429443 659700317 660752792 662996216
1450.5 662996216 662802048 662353592 661824493 662264633 661552963 659008331 654268723 649977036 652418671
1459.1 652418671 653204956 656569519 658055649 659236984 661259003 658926926 660669785 662425613
1466.8 662425613 664815903 665949478 668659744 672807388 673896790 676616669 679234543 686110077
1474.6 686110077 689618301 691233902 694482651 697437592 700411911 702530899 705743103 708318329
1482.3 708318329 712512131 715744324 718761902 722245712 722037201 723855133 725155869 724907990 724424057
1491 724424057 728946915 733872910 736430588 739966202 740373154 738846588 742021103 743147507 742337875
1499.6 742337875 744320068 746824799 748307114 751408463 754142609 757233734 751910019 744622116
1507.3 744622116 751640091 753596573 756027756 758232956 759315262 758891602 761569061 764142990
1515.1 764142990 765214539 765888824 763334808 768184814 769942017 764889526 761203003 762190475 768130722
1523.7 768130722 770893250 771541519 772365494 774459076 774184418 774648132 776628952 775992889 776458588
1532.4 776458588 773510056 771764450 775995712 779244690 782540970 783965607 779873886 769945984
1540.1 769945984 775533752 775760880 776046982 780646744 780300293 779975967 783118134 786296921 787584610
1548.8 787584610 785921936 784044952 785670319 787467346 787248383 783494568 784307632 789382019 792180634
1557.5 792180634 784842224 777625961 778539581 786739883 789795227 790963821 790200043 787874603 789619751
1566.2 789619751 792114563 794059067 793437805 790137711 792415924 794174805 793942795 793878708 795057526
1574.9 795057526 792998047 786361389 790731430 794492722 795296097 795670090 795584259 794898987 794486618
1583.5 794486618 793690414 793185349 792357941 792246323 792749710 793051147 792945328 792175140 791922607 791309052
1593.2 791309052 789376297 787119370 786216507 785538712 785286865 785626373 785376282 784296341 782906570
1601.9 782906570 781540985 779491730 778003540 776831055 774974213 772697830 771760025 770339508
1609.6 770339508 768654709 768336945 766388016 764625626 762590714 761556015 758362274 746621094
1617.3 746621094 749165649 750278091 749949341 748848724 748334045 745993500 740400925 740907135 740200272
1626 740200272 739286499 735057755 732648697 733578339 732845535 732489700 731488647 731980286 732548370
1634.6 732548370 723921432 722097321 723236084 723742371 724852066 725699768 725622635 726426544 726479950
1643.3 726479950 727851486 729096298 725726624 724102020 723202515 726403503 729574814 732907715
1651 732907715 737177811 733136673 721427155 729543304 735414734 738258820 739747086 740947037
1658.8 740947037 742134476 743653412 745412598 744694138 745017471 749458237 752133026 753802261 756105423
1667.4 756105423 756716309 752167664 753875809 757199326 758560562 762200165 765914841 765531464 764539948
1676.1 764539948 768532867 771553421 773501740 773738022 772757339 776345673 780809326 781039581 770761185
1684.8 770761185 776837692 783104095 785379944 785559921 786914673 787466202 788535538 790156860 791853943
1693.5 791853943 794884262 795185471 787870712 791874161 796496811 801213226 798458557 789739532
1701.2 789739532 796360321 800778122 801935196 800644684 801505203 801931381 804393387 807646103 807874374
1709.9 807874374 806791534 807533112 808671951 809248428 808049545 807981110 811269150 810479355 804526901
1718.5 804526901 810169983 813954239 815452576 815882797 815158844 814818268 816042023 817076874 817977600
1727.2 817977600 819975433 821414185 819620438 819392929 822322693 823146667 816025848 811803665 817889633
1735.9 817889633 821668549 823165054 825281525 823460007 822299728 826444244 827399292 824467621
1743.6 824467621 824097824 826439896 827131195 826674271 826177139 827049332 830911407 829816132 828231049
1752.3 828231049 830417709 831250229 832550201 832684097 829550247 830207825 832400818 834320755 835965271
1761 835965271 832695541 831836090 834123383 834662476 834785156 835320892 835046082 832480316 835016861
1769.7 835016861 838480377 837721405 833713913 832904739 837051544 837857056 836225662 837140579 837270279
1778.3 837270279 838247375 837969437 837406769 838956146 840544968 841283875 839243469 838508987 839250031
1787 839250031 839071350 839459534 840648651 840903549 840515594 837947845 838658676 842004623 841540146
1795.7 841540146 839998322 841038971 842253036 841292648 839865646 841956100 842626190 843658066 845021057
1804.4 845021057 844603500 844579239 844157181 843581924 843759537 843715057 842625275 843490372 845372009 846306686
1814 846306686 847026825 847089005 846604462 844810410 844281616 844587173 844540863 845478897 845729446 847238235
1823.7 847238235 847807922 845160141 846183090 847814713 848193436 846319962 842555389 844196396 846553116
1832.3 846553116 847010040 847720413 848894577 849429855 848877792 847926712 847967148 847544174 847712402 847777405
1842 847777405 848285904 847878647 843938599 846891022 849574051 848874435 847800751 847924652 848084030
1850.7 848084030 847664490 847768402 847723160 848267441 848888931 849102707 849356155 849396973 849822311 849312668
1860.3 849312668 848354874 847585144 847703857 848526459 849255524 849733124 849385986 849717789 848227310
1869 848227310 846525497 847467041 848183823 848236237 848211975 848920975 849193115 849775391 850546188 850708389
1878.6 850708389 850390244 849874268 850062561 849271545 848724976 848583298 848892059 850175934 850814285
1887.3 850814285 851864471 851064758 848976288 850277786 851176834 850520325 849998932 848919678 848533096
1896 848533096 850225220 851056519 851374969 851919479 851987228 851669617 851004562 850552063 849521255 849382629
1905.6 849382629 850041885 850292892 850860596 851138992 851110840 851356888 851815872 851215210 850605392 850223160
1915.3 850223160 850415955 851316986 849392853 849444351 851566391 852536926 852683487 850801239 849806442
1923.9 849806442 850316849 850364380 850385971 850478973 850617905 851141052 851673508 852089539 852420883 851969833
1933.6 851969833 851568604 850991516 850243988 849769135 849641495 850295105 851139603 852318726 851530685
1942.3 851530685 849857788 850864029 850983887 850137634 849607620 849755936 850703506 851654892 852154541
1951 852154541 852275238 852577133 852813339 852433701 851337509 850391846 850184250 850630417 851037827 851041183
1960.6 851041183 851550064 852261887 852871933 853280411 853141251 852430801 851175156 850410461 850507507 850724640
1970.2 850724640 851138916 852003250 852377396 852759171 853276215 853001175 852435684 851666641 851168823 851044159
1979.9 851044159 851133041 851400299 852000351 853196259 853748016 853419113 852728729 852131805 851422348 850971527
1989.5 850971527 851434860 851305847 850761719 851434479 852339172 852641296 852895889 852954407 852246704 851010056
1999.2 851010056 850029831 850074081 850193253 850702286 851718216 852207718 852388229 852296906 852209549 851478119
2008.8 851478119 850365982 849725876 849492874 849961853 850572128 851096573 851671753 851627579 850678635 850310898
2018.5 850310898 850155869 849420624 848935165 848687820 848879776 849398422 850012817 850210876 850125351 850179138
2028.1 850179138 849641342 849027252 848351212 847766037 847402496 847174988 847485504 848169861 848862076 849063110
2037.7 849063110 849158630 848503647 847294540 846413422 845840988 845815735 846021347 846734161 847296371 847622070
2047.4 847622070 847844009 847736588 847533722 846770020 846065826 845312576 845087738 845469055 846219940 847081146
2057 847081146 847175751 847751541 847812653 847186356 846398087 845567169 845528946 845293808 845606232 846337051
2066.7 846337051 847058258 847665329 847976303 848127289 847412262 846664047 846142578 845977402 845715637 845738602
2076.3 845738602 846526871 846928177 847533569 848054581 848040161 847464981 846740112 846132355 845743027 845955734
2086 845955734 846172104 846970444 847576065 847727966 848008499 848156204 848164673 847495270 846861343 846102676
2095.6 846102676 845764008 846444397 847254944 847884216 848189545 848428192 848236542 847992325 847431259 846756744
2105.2 846756744 846736832 846757278 847123489 847829437 848609848 848877487 849001312 848989105 848355560 847801666
2114.9 847801666 847292938 847213974 847148132 847389908 848058853 848595428 849203110 849478912 849744034 849205246
2124.5 849205246 848036804 847206955 846959152 847137909 847198105 847848358 848420792 848797760 849363251 849532700
2134.2 849532700 848841019 847883301 847792130 847513275 847387924 847840347 848292389 848877411 849325104 849422379
2143.8 849422379 848936462 848487091 848063278 847610703 847531357 847833252 848254623 848639374 849326630 849704590
2153.5 849704590 849679337 849396133 849199905 848656082 847537918 847414932 848025131 848804779 849348755 849986038
2163.1 849986038 850634689 850420303 850098267 849607849 849125137 848714142 848699417 849299240 849745255 850217590
2172.8 850217590 850793304 851345062 851349640 851401978 851574707 850957718 850316620 850114365 850250092 850688095
2182.4 850688095 851548996 852347870 852742920 852996140 853152466 852992630 852303162 851796341 851597366 851620941
2192 851620941 851930389 852790298 853764038 854070206 854218369 854135742 853936157 853425217 853098755 853206406
2201.7 853206406 853094559 853625870 854370270 855033493 855620880 855604172 855128403 854697342 854406967 853961411
2211.3 853961411 854064789 854326706 854793625 855725784 856406174 856562195 856602020 856970291 856418762 855605927
2221 855605927 855321808 855392685 855748978 855902786 856674576 857378616 857762833 857798386 857310257 856858521
2230.6 856858521 856229553 855990524 855964661 856397247 857035980 857317429 857767563 858125534 858354950 858220520
2240.3 858220520 857769623 857249756 856970596 857006607 857394409 857908630 858063660 858418350 858751984 858804474
2249.9 858804474 858312073 857862930 857855148 857560272 857539978 857539444 857610779 858269348 858935089 858890533 858908386
2260.5 858908386 858955307 858131180 857731018 857404556 857465210 858283157 858803024 859139557 859219589 859550858
2270.2 859550858 859684830 859487381 859057693 858698578 858704834 858220215 857942429 858369064 859445648 860209961
2279.8 860209961 860443344 860470505 860224533 860093384 859542999 859031448 858468933 858615875 859224014 859317398
2289.4 859317398 859658127 859998093 860435791 859717789 859038696 858800125 857805481 857725677 857760239 857739868
2299.1 857739868 857689819 858347855 859204559 858884735 858426514 857828903 857772293 857149506 856255875 855757904
2308.7 855757904 855839386 856749268 856566467 856584854 855872421 855343246 855679626 855110321 854942245 854046631
2318.4 854046631 853736649 853983994 853327026 852837219 852769699 852313385 851313095 851230164 850002975 848957062
2328 848957062 849302444 849548874 848894806 847550507 848925247 850981750 851010361 848292236 846020355
2336.7 846020355 847285233 848742752 848660965 847474747 847107849 846556015 847279663 848563690 848821793
2345.4 848821793 849797745 850004272 851516190 852917175 851741333 849573593 847970352 847293472 847117233
2354.1 847117233 846673813 845675354 843626556 840908737 840703125 842072906 841387329 840554962 841182632
2362.7 841182632 843065491 843982849 844033966 845009842 846333313 846278000 845570068 846232681 847321091
2371.4 847321091 848638916 849477921 850249405 851624069 852721558 853377380 853741379 854115677 854237823
2380.1 854237823 854942245 855794907 856378860 857097168 857528458 858541641 859237671 859027710 858613815
2388.8 858613815 858043060 857696533 857328262 857072754 857127686 857640305 858143616 858271713 858290024 858129425
2398.4 858129425 857864075 857177811 856568527 856331024 856352463 856679306 857120438 857490005 857600479 857716751
2408.1 857716751 857362289 856800766 856409378 855938721 855343170 854916840 855283508 855555725 855998688 856503677
2417.7 856503677 856138840 855898209 855830231 855416031 854772568 854288025 853926849 853710556 853704376 853973083
2427.3 853973083 854469681 854509735 854371567 853909454 853316803 852971954 852414627 852119141 852406082 852875748
2437 852875748 853112564 853307953 853104553 852731934 852643585 852109146 851388168 850801697 850672607 850864258
2446.6 850864258 850915375 851070480 851328354 851141357 850414810 850021439 849773865 849652252 849550552 849413071
2456.3 849413071 849696045 849695740 849716949 849661484 849404526 849561386 849367828 848597031 848099213 847956009
2465.9 847956009 847805176 847782440 847766342 848035202 848165054 847902145 847674103 846894760 846315613 846354752
2475.6 846354752 846589890 846587448 846448441 846652298 846509399 846351852 846264114 846027069 845689087 845524368
2485.2 845524368 845572128 845074310 844873047 845289764 845871506 846166153 846133881 845809860 844873199 844431992
2494.8 844431992 844295883 844049759 844085312 844285355 844456711 844407883 844619751 844976196 844980621 844478455
2504.5 844478455 844176865 844208298 843833618 843377533 843282242 843761749 844058304 843848495 843763809 843794785
2514.1 843794785 843597488 843049545 842680511 842609558 842516556 842320175 842422638 842720718 842908936 842840042
2523.8 842840042 842228165 841819534 841666489 841420288 841085587 840927582 841120682 841210480 841158371 841011658
2533.4 841011658 841279984 841409988 841023102 840478439 839639969 839367218 839585571 839819107 839935379 840153122
2543.1 840153122 840318527 839966812 839571381 838805084 838110123 837968216 837753983 837249146 837185516 837590561
2552.7 837590561 837676468 837872086 837700806 837284241 836978683 836735687 836856079 836347580 835651474 835542221
2562.4 835542221 835808411 836049881 836180649 836004562 835412140 835225372 834782562 834324493 834489822 834611969
2572 834611969 834554977 834644012 834957733 834790497 834448395 834017868 833513947 833357544 833431625 833450775 833098679
2582.6 833098679 833015442 832997208 832794876 832386398 832164841 832167969 831445389 831434937 831932449 831726532
2592.2 831726532 831403961 831196518 831289062 831359253 831370316 831487045 831419067 830859756 830421753 830300751
2601.9 830300751 830183563 830377121 830426407 830264053 830148926 830333557 830282745 829741364 829341812 829039536
2611.5 829039536 828985825 828464432 828047256 828447113 828838272 828701630 827826691 827439346 827516937 827304535
2621.2 827304535 826805801 826308746 825988922 825537262 825453796 825405045 825218887 824766922 824108963 823889694
2630.8 823889694 823472900 823159943 823265076 822914200 822262421 822185211 822117920 821724548 821476135 821172180
2640.5 821172180 820800171 819979935 819322433 819321594 819216309 818833313 818511353 818425674 818194351 817989120
2650.1 817989120 817624969 817250824 816892700 816352005 816215439 815736618 815033340 814547348 814347534 814640656
2659.8 814640656 814904251 814865417 814386673 814022064 813662643 812981644 812265549 811858063 811871719 811839371
2669.4 811839371 811712265 811681290 811779022 810952835 810002670 810137711 810205460 810058746 809866409 809813766
2679 809813766 809484482 809089890 808892670 808435440 808451767 808226013 807466736 806865921 806914902 807002640
2688.7 807002640 806278687 805862732 805840225 805954208 805871964 805507965 805072021 804651337 804729462 804582062
2698.3 804582062 804222870 803933258 803514709 802843094 802420349 802588501 802424545 802111053 801578674 800974274
2708 800974274 800911255 800833282 800200272 799665146 799871979 799898834 799341507 798367767 797929306 797900925 797492294
2718.6 797492294 797553864 797647095 797563477 797226257 796994858 797334671 797169418 796432037 795514374 795023117
2728.2 795023117 794901047 794756927 794411087 793983231 793889847 793475037 793056946 792971344 793029861 792911224
2737.9 792911224 792369614 792123795 792108841 791931610 791583786 791315613 790989685 790904922 791198273 790889664
2747.5 790889664 790360718 790241852 790055847 789337082 788986969 789303436 789137421 788449173 787921066 788046036
2757.2 788046036 788368607 788514404 788156967 787493896 787403336 787334061 787332001 787308044 786803665 786321106
2766.8 786321106 785984192 785940704 785910645 785723267 785883026 786206894 786172638 785574570 784645691 784169006
2776.4 784169006 784040222 783738327 783481216 783278885 783392563 783428955 782654724 781888123 781826630 781838913
2786.1 781838913 781689987 781674347 781426086 781050797 780511627 779772415 779346542 779199448 779187012 778917542
2795.7 778917542 778311996 777684250 777254486 776535950 775801773 775610046 775027847 774524612 774093857 773521805
2805.4 773521805 773131790 772408905 771987457 771519547 770565643 769778900 769266434 768529510 767795944 767629395
2815 767629395 767153015 766581573 766035614 765161209 764406052 763619080 762760162 762054520 761552353 760681305
2824.7 760681305 759678955 758826523 757955475 757257080 756484604 755947876 755471649 754644547 753568649
2833.3 753568649 752714539 751900177 750728149 750031357 749332809 748356781 747107468 745482101 744230881
2842 744230881 743195877 742042084 740585937 739333115 738307190 737185059 735873260 734245605 733142014
2850.7 733142014 732141266 730944366 730026245 729333038 728722610 728045731 727092361 725451813 723989944
2859.4 723989944 722733231 721387863 720308228 718850174 717456589 716243973 714431763 712404327
2867.1 712404327 710666199 708811188 706848145 705101471 702984695 700813293 698883591 696646271
2874.8 696646271 694425735 692082901 689457321 687328720 685678482 684040527 682128754 680189743
2882.5 680189743 678749619 677566528 676524887 675105972 673632431 673164597 672998810 672632980 671774139
2891.2 671774139 670778580 670139313 669561996 669643250 669637146 668529587 667621155 667862778 667777863 666916351
2900.8 666916351 666177216 665709152 665715179 665095749 664261627 663785019 663096542 662978668 662590637 661419449
2910.5 661419449 659786377 658285751 657242737 656107788 655267105 654065475 652384262 651113358
2918.2 651113358 649859390 647744751 645568542 644079971 642853470 642261429 641362915 640316238 639747314
2926.9 639747314 639297295 639453583 639510155 639173279 638718910 638611946 638814545 639504433 640951004 642144012
2936.5 642144012 643499985 645000916 646251450 647590637 649580917 652230682 654431305 656137161
2944.2 656137161 657844162 659840164 661831512 664028015 666440430 668835754 671362305 673681183
2952 673681183 676098709 677979431 680025864 682740326 684945984 687252502 689781113 692206802 694296570
2960.6 694296570 696397324 698668060 700683060 702600861 704306793 705531235 706729050 708866043
2968.3 708866043 710960922 712480774 713974457 715671997 717714844 719235458 720183563 720978851 722461929
2977 722461929 724374619 726042633 727638321 728635406 729780960 731519470 733240662 734102631 734807281
2985.7 734807281 736248169 737548599 738549957 739115295 740094681 741273651 742066879 743143311 744044800
2994.4 744044800 744559937 744638290 745213699 745834351 745741196 745761719 745705185 746106186 746658096 746893539
3004 746893539 747213593 747537079 747567291 746943512 746896210 747453537 747152328 746589432 746439438 746335449
3013.7 746335449 746294708 746163101 745619965 744585266 743636017 743280182 742874680 742368927 741906281 741722794
3023.3 741722794 741399384 740493698 739814072 738904953 738155289 737507324 736353683 735425262 734591751
3032 734591751 734226456 733966141 733530273 732826538 731437073 730281067 729229431 728368073 727925110
3040.7 727925110 726998825 725570755 724575043 724107819 723436432 722674484 721787567 720690689 719397125
3049.4 719397125 717979660 716805420 715781631 715340347 715052719 713834076 712369003 711131516 710072784
3058 710072784 709481506 708410568 706683197 705465240 704836426 704359512 703608017 702845535 701821594
3066.7 701821594 699955978 698376389 697447815 696549225 695414581 694331665 693545990 692626038 691431198
3075.4 691431198 690274811 689356689 688232346 686844101 685716705 684276276 682464676 681274338
3083.1 681274338 680396805 679745255 679085159 677784119 676909561 676124039 674824142 673446350 672111893
3091.8 672111893 670994492 669346237 667844925 666820679 665583038 664793243 664367599 663533096 661939697
3100.5 661939697 660589371 659472122 657912903 656528320 655434952 654334717 652769089 651525421
3108.2 651525421 651056290 650215073 648916702 647801514 646597061 645156708 644104614 642861099 641453857
3116.9 641453857 640599518 639813080 638796577 637943916 637211113 635533981 633550262 632200089 631133423
3125.5 631133423 630126305 629067841 628275566 627317810 626038475 624762306 623674774 622467766 621100464
3134.2 621100464 620012817 618458023 617025452 616398888 615907249 614875145 613614578 612761230 611559982
3142.9 611559982 610266190 608888359 607225723 605990944 605236969 604412804 603296928 602310104 600987968
3151.6 600987968 599860916 598897209 597758675 597067490 595775681 594309540 593610344 593011093 591752892
3160.3 591752892 590524635 589824066 589061470 588322563 586977959 585423012 584039078 582859421 581944962
3168.9 581944962 580997658 580470924 579770432 579048080 577790451 576337280 575611229 574672089 573811340
3177.6 573811340 572438164 571107330 570290222 569634972 569406319 568562508 567689667 566953545 565570412
3186.3 565570412 563758469 562685051 562563248 561602898 559953995 558750992 558151398 557665787 556983757
3195 556983757 556137657 555454216 554886665 553901253 552665062 551243286 550365601 549780693 549166298 548754196
3204.6 548754196 547989006 547081985 546035805 545202446 544194984 543323555 543039360 542306824 541698494
3213.3 541698494 540829010 539900208 539539032 539018822 538208046 536768532 535603600 535138969 534320488
3222 534320488 533554878 533230057 532847862 532681313 532266350 531337509 530565262 529539871 528693733 528282242
3231.6 528282242 527611694 526329613 525342712 525285416 524947701 524335518 523853111 523183556 522158852
3240.3 522158852 521781998 521705818 520876846 520344543 519633675 519331245 519491348 518966408 518146324 517110138
3249.9 517110138 516333656 515517159 515024757 514578743 513946877 513731575 513539162 513552475 512818832 512108574
3259.6 512108574 511545715 510514641 510082245 509789772 509547043 509064789 508686485 508651543 508566475 508462067
3269.2 508462067 508025475 507319717 506677132 506342049 505313530 504838638 505143433 504746971 504678955 504590683
3278.9 504590683 504287338 503789139 503386230 502963409 501946373 501398735 500941734 500373688 500177689
3287.5 500177689 500042992 499640274 499901161 500044365 498836594 498095169 497664833 497099724 496425171
3296.2 496425171 496005554 495955200 495288773 494945335 494932404 494821854 494169197 493432426 493189354 492588348
3305.9 492588348 492054672 491780815 491806030 491443825 490680428 490378418 490443459 490011406 488876801 488411407
3315.5 488411407 487889214 487263603 486741676 486107903 485963058 485592918 485277596 484916534 484593315 483956909
3325.2 483956909 483082123 482847328 482178726 481292419 480390434 480150299 480275764 479729614 479137573 478384132
3334.8 478384132 478157883 477750893 476668930 476105118 475845490 475427437 474808273 474108124 473073463
3343.5 473073463 472574615 472630081 472096634 471217537 470479813 470086937 469728165 469258041 468516312 467789612
3353.1 467789612 467432289 466729584 465476151 464590111 464703369 464604454 463577232 462536278 462002640
3361.8 462002640 461759987 461072350 459971046 459589653 459780388 459630775 458887558 457812386 457264099
3370.5 457264099 456334267 455216064 454817047 454257774 454201965 453708191 452733269 452586784 452221298 451610413
3380.1 451610413 451011543 450793877 450479622 449623413 448832054 448333664 448201408 447734413 447421761 447134323
3389.8 447134323 446427536 445948334 445552330 445650597 446113663 445998230 445159073 444417000 444126854 443973312
3399.4 443973312 443711395 443100357 442332916 441755180 441573219 441528282 441682816 441930542 441800652 441241188
3409.1 441241188 440738373 440609665 440189934 439403648 438980713 439552727 439733047 439551315 439886856 439348717
3418.7 439348717 439091835 439209290 439178352 439166908 438643379 438699532 438716736 438567123 438463135 438162117
3428.3 438162117 437733040 437314606 437729721 438281555 438367348 437833710 437626762 437890663 437668533 437776642
3438 437776642 438329544 438757553 439192886 439735641 439276848 438806725 439048424 439761009 440811043 439994354
3447.6 439994354 439701881 440397835 440717049 441112061 441120529 441283607 441359787 441740379 441902313 442352753
3457.3 442352753 443117714 442992172 443690262 444187317 444268799 444435921 444598427 445071182 445216446 445124702
3466.9 445124702 444807510 445567284 446165428 446432953 447642365 448377228 448673820 448848610 449343834
3475.6 449343834 449753036 449783478 449416313 449809723 451559029 452286720 452057610 451795921 452814827
3484.3 452814827 453649254 453503304 454217300 454173164 454273682 455145302 455839729 456296005 456902733 458147507
3493.9 458147507 458579788 458450317 458334923 458720245 459784508 460659256 461266861 461725006 461816940 461747131
3503.6 461747131 462310753 462910118 463919182 464938736 465379181 465168571 464728508 465804176 466868172
3512.2 466868172 467730560 468442612 468964310 470040283 470735359 471423683 471481209 471472359 472622147 474362259
3521.9 474362259 475087318 474032288 474286308 475779533 477280655 478166504 478768616 478904381 479011497
3530.6 479011497 479839745 480539856 481679344 482468224 483981590 484990768 484286842 485405121 486338768
3539.2 486338768 486754646 487512665 488610420 489578133 490336304 491266479 491755333 492788467 492922020
3547.9 492922020 494548340 495939255 496635818 497992592 496550179 497895279 499947281 501147385
3555.6 501147385 503134766 503668594 504990883 506280899 507025299 507809181 509951668 511030502 511494064
3564.3 511494064 515244408 514641762 513021698 512721672 513630142 517537155 519215279 521350098 523008690
3573 523008690 523752594 524472847 525999260 528007660 528314018 530708733 531456299 531955223 534739723
3581.7 534739723 536777077 538711357 540142746 544358749 545300102 542647972 544699364 544360809 547820435
3590.4 547820435 551363945 554182968 555728226 556357231 559019165 557716331 560855980 564631767
3598.1 564631767 564948463 567313423 567250061 568742905 571488037 573114357 575586433 578950424 581384735
3606.8 581384735 580698128 584139900 582762260 582896233 590919189 590913544 588695335 592397308 592295799
3615.4 592295799 597286911 601655121 601566734 603572998 601987724 603305588 607398643 609828339 612259521
3624.1 612259521 614813461 616214294 618580704 625340805 622632599 611161766 617294998 623085899
3631.8 623085899 628652954 629063797 627032318 630384254 633998070 636703987 637205887 638126221 640379791
3640.5 640379791 642733078 643519440 643838730 646915970 651298828 656403656 652465591 648610382 654025803
3649.2 654025803 651753464 648793411 650630264 658230667 663181915 666106262 668550873 659741516
3656.9 659741516 663397369 669582520 671521988 673244476 673423767 675196457 676262894 677966995
3664.6 677966995 679865494 680708466 684957428 686456299 684252548 682466812 677289886 682454834
3672.3 682454834 691267471 698843613 692117386 672056274 681519623 691839066 696110687 694061661
3680 694061661 694993820 698042908 700006714 701425476 701426010 701424255 705693741 711633987 700140381 697469406
3689.7 697469406 705564041 699625702 702382278 708939896 710090714 711661835 711291275 711284256 712860947
3698.4 712860947 713394089 715975647 718406296 712928848 711864395 717007904 718085175 718858185 719766006
3707 719766006 722184906 725662689 718341064 722633133 724102020 711044540 718517075 724129639
3714.8 724129639 724795456 725568237 727945480 728202744 724547272 727061157 732806168 727905502 723348999
3723.4 723348999 729059372 731085968 731694412 728268356 727801361 732191772 733333435 738661652 734424286
3732.1 734424286 727951736 738440781 735442886 723466110 726362000 730125046 731615295 734875946
3739.8 734875946 738357925 735009995 739107285 751631088 737277222 722102737 734504471 741587372
3747.5 741587372 748944168 742654114 730821838 742721024 735890274 731330643 738576736 743170700
3755.3 743170700 745601578 740643234 743406601 747438354 739511566 739777298 744935913 745833130 746274261
3763.9 746274261 750822678 747071457 741749496 746235580 751477127 749908524 740623856 744120178
3771.7 744120178 748209686 749010315 750128708 749799728 750609283 751073914 753069611 751268082 744227524
3780.3 744227524 748141556 751397858 752645035 753293304 749352951 749505997 752186356 753600540 753469772
3789 753469772 752897568 753994141 754486923 755001221 755121918 757041626 760288010 755410995 752116394
3797.7 752116394 755079880 759024887 762777100 752063828 744431992 750777359 755054550 760800476
3805.4 760800476 765431442 753011551 749912643 755789948 757607651 758440094 760251770 760635834
3813.1 760635834 761147003 765868835 761395493 748624268 756855850 762486725 765209427 764035721
3820.8 764035721 746015930 751030579 758182297 761027832 763489609 761748581 757614746 760146408
3828.6 760146408 763056259 766463547 766523132 757186661 761462326 767291794 759836502 761243057 769852600
3837.2 769852600 760797729 756574478 763803864 757667084 759276199 766366425 762485352 760493927
3844.9 760493927 764716110 766231461 766258392 767649765 766505051 769089966 773743134 765479584 764212189
3853.6 764212189 748102722 754463654 765825806 764640656 763789520 766490250 769257660 771374359
3861.3 771374359 765719223 766449509 772730255 765546341 761245728 766585312 771798096 776583328
3869.1 776583328 765349197 757144012 763933334 772132339 774690170 762393570 764724808 769497910
3876.8 769497910 769731445 772615967 775741501 767649918 762179871 769689789 770939713 772744217
3884.5 772744217 776499710 762938232 765841293 770524673 771750488 775624847 772985001 764340668
3892.2 764340668 766608963 770740128 769858093 771423950 772973175 775077362 775299759 766600037 772869339
3900.9 772869339 773884125 768847198 773456955 768872910 767945938 769671097 770675964 772617645
3908.6 772617645 772682571 773433762 773233643 772644348 772858810 773456345 775332947 777033539 772072449
3917.3 772072449 769031372 774254150 772904587 769097977 772306366 774382019 775708008 772850418
3925 772850418 769986115 772467499 774253845 775451584 774214249 773634033 775628586 773252182 771961441
3933.7 771961441 773593750 774469223 775246277 774753036 773569336 773427353 774094696 776343002 776223831
3942.3 776223831 771639252 772249451 774489059 776163101 777204437 774831390 775576630 775043945 772649155
3951 772649155 774582596 775242844 775386429 775927505 775938797 776005707 776079407 776680450 776171188 776774673
3960.7 776774673 776981277 775441513 776199417 776839142 776322250 776316910 776630554 776842041 776410522 776027985
3970.3 776027985 776622925 777239304 777087097 777189636 778130341 777847977 776108932 776145325 776703339 776334305
3980 776334305 776335144 776705170 777211685 777664948 778168793 777648849 777466354 777992554 777811661 777973099
3989.6 777973099 777241058 777158585 777911224 777622833 777574234 777268829 777590179 778328476 778404694 778444061
3999.2 778444061 778400116
4000.2 778400116
##END=$$ End of the data block
