##TITLE=Amanda - Epoxido $$ Begin of the data block
##JCAMP-DX=5.00 $$ ACD/SpecManager v 10.08
##SPECTROMETER/DATA SYSTEM=Alpha
##DATE=22 Apr 2015 15:24:34
##DATA TYPE=INFRARED SPECTRUM
##DATA CLASS=XYDATA
##ORIGIN=
##OWNER=
##NPOINTS=1765
##FIRSTX=399.76428223
##LASTX=3997.64306641
##MAXX=3997.64306641
##MINX=399.76428223
##MAXY=1.00334930
##MINY=0.19670966
##XFACTOR=1.0000000000
##YFACTOR=0.000000010000000
##FIRSTY=1.00000000
##DELTAX=2.03961372
##XUNITS=1/CM
##YUNITS=ARBITRARY UNITS
##XYDATA=(X++(Y..Y))
399.8 100000000 99483234 99936712 100267363 99783319 99486679 99901122 100000000 99459803 99200332 99711829
420.2 99711829 99655712 98968750 98818028 99133837 98755515 97813219 97487849 97759753 97754049 97708267 98343527
442.6 98343527 99072373 98942035 98555702 98804438 99118626 98732460 98249602 98396981 98459333 97872275
463 97872275 97353339 97388059 97261351 96425557 95511591 94974536 94023120 92137998 89795637 87071246
483.4 87071246 83209068 78077668 73489308 72805774 77544129 84831840 91004753 94795704 96394259
501.7 96394259 96577984 96524185 96509719 95992792 95129704 94777912 95067555 95277375 95192701 95336843
522.1 95336843 95720065 95826626 95738304 95970345 96345443 96280473 95908731 95789075 95785099 95374811 94698721
544.6 94698721 94213110 93707627 92624992 90978450 88973218 86160338 81880724 76491028 71987712
562.9 71987712 70791870 73562074 79186457 86046064 92091548 95741725 97265327 97894442 98141712
581.3 98141712 97950518 97619200 97513789 97395265 96800363 95945644 95509195 95623380 95886213 96085435
601.7 96085435 96275872 96314925 96005911 95490187 94916660 94006771 92807746 92311674 93183428 94415265
622.1 94415265 94774222 94501305 94291949 94132072 93736351 93213421 92820412 92458326 91895610 91237247
642.5 91237247 90700620 90096730 89082628 87637335 85833752 83261567 79365277 75100273 73528862
660.8 73528862 75130922 76168483 74474823 71764177 70335978 68683439 66344541 64375085 62779504
679.2 62779504 59714186 53104544 43198529 34102869 31761026 38645148 51120067 63293022
695.5 63293022 71913278 77167803 80845171 84188920 87400407 90360087 92790830 94276518 94651788
713.9 94651788 94236296 93573064 92819697 91725582 90241385 88598067 86780179 84465390 81490654
732.2 81490654 77849764 73188639 66665328 57196635 44491032 31273177 22681443 21259721
748.5 21259721 25117037 31550938 39950225 50584072 62128496 72348064 80055523 85265338
764.9 85265338 88647068 91015434 92760235 93920225 94674945 95170790 95064008 93902367 91911882
783.2 91911882 90190822 89872962 90999788 93087465 95798612 98191053 99386990 99728274 99920100
801.6 99920100 100000000 99784553 99511492 99499166 99589390 99530411 99503607 99710202 99880594 99728435 99480468
824 99480468 99420851 99322933 98904198 98418206 98186642 97972518 97426027 96714771 96134055 95485377 94437158
846.4 94437158 93094432 91942257 91588444 91994160 92034960 90694451 88028592 85756934 86559552
864.8 86559552 90387762 94116074 95838594 96217531 96337807 96376550 96096885 95631790 95221704 94605923
885.2 94605923 93472344 92479217 92727900 93967122 94917119 95219803 95378578 95527852 95467967 95318902
905.6 95318902 95351660 95416600 95182407 94756198 94469315 94205987 93567193 92559242 91611475 91018033
926 91018033 90687793 90620673 90971267 91461039 91773701 92030591 92322057 92439979 92162657 91659784
946.4 91659784 91271979 90933633 90349495 89585650 88912964 88219082 87156731 85676366 83825964
964.7 83825964 81174880 77315044 73155653 70063323 67294711 63563001 60544765 60159463 60509396
983.1 60509396 58754414 55760801 54864681 56571424 57927775 57708877 57882810 61190367 68501025
1001.4 68501025 75927705 78353566 75361252 69184464 61286211 53900033 51502305 58021235
1017.8 58021235 71283329 83320755 88499618 87708896 84498411 80364209 75524330 72526991
1034.1 72526991 74500984 80929011 88306093 93730503 96642721 98006076 98697054 98843682 98475730
1052.4 98475730 97996277 97648090 97167760 96390331 95604205 94948506 94080198 92755616 91186595
1070.8 91186595 89662766 88459283 88178164 89136481 90515321 91311848 91525656 91757309 92212993
1089.2 92212993 92462742 92195892 91697413 91294706 90905380 90487975 90371424 90730786 91222739 91521883
1109.6 91521883 91770202 92148870 92458230 92498857 92460042 92528665 92519933 92268497 92002881 91940153 91892070
1132 91892070 91644222 91351873 91201818 91026032 90632027 90168154 89772367 89163494 87944120 86224806
1152.4 86224806 84814298 84489578 85120219 85987055 86535513 86428511 85547489 84034425 81855059
1170.7 81855059 78728181 75207460 72863317 72336096 72980112 74505937 76902229 79338789 80553854
1189.1 80553854 80134374 78644204 76636010 74085081 70741308 66674423 62399119 58738470 56093770
1207.5 56093770 53594851 50065726 45827931 42664894 42585126 46889460 55301577 65570736 74857658
1225.8 74857658 81745791 86334175 89141268 90743560 91705197 92311877 92561263 92458957 92183715
1244.2 92183715 91839534 91356152 90819246 90471154 90289342 90000880 89517611 88971597 88381130 87605453
1264.6 87605453 86641729 85630327 84547991 83209044 81548327 79581869 77139896 73902696 69801885
1282.9 69801885 65560126 63214844 65213525 70984983 76424736 78642499 78070581 75891644 72586328
1301.3 72586328 68468696 64103693 60541004 59230953 61196780 66407537 73263133 78805614
1317.6 78805614 80910742 79750288 76561475 72263706 67353457 61921465 55945480 50064611
1333.9 50064611 45599276 43760893 45500964 51393378 60862029 71937704 82101130 89840227
1350.2 89840227 94884026 97755826 99197757 99818170 100000000 99853402 99445564 98989999 98594558
1368.6 98594558 98220921 97761834 97215074 96716183 96232694 95673054 95145857 94766313 94389230 93809605
1389 93809605 93109179 92392498 91766971 91408849 91315222 91406602 91549796 91607314 91573793 91528457 91453874
1411.4 91453874 91322303 91173607 91045469 90925151 90774536 90550119 90249318 89865410 89262533 88476932
1431.8 88476932 87531066 85821927 82959771 79497451 74317276 65695179 54397678 47473228
1448.1 47473228 54391390 70397872 83442706 89827061 92012060 92603141 92743492 92561352 92173433
1466.5 92173433 91795850 91335094 90538257 89517331 88464546 87331468 86139125 85109496 84507811
1484.9 84507811 84081697 83011419 80569762 77492309 75324148 76802069 82234728 86977679 89105344
1503.2 89105344 89540821 89133084 88789093 88729161 88697320 88603932 88458490 88244236 87854385 87416571
1523.6 87416571 87042326 86622691 86182958 85663664 85008109 84453416 83948886 83131790 82279581 81667089
1544 81667089 81045693 80354190 79556382 78708249 77783507 76729923 74882650 72250700 70229328
1562.4 70229328 67859405 64625496 60214138 54058570 47809958 43384564 44496721 52111399
1578.7 52111399 60443747 65134335 64480817 60101640 53873938 47369152 42365932 39209315 36591274
1597 36591274 33162105 28340214 23000723 19670966 20549002 26200780 35277453 45096001 54609364
1615.4 54609364 63648874 70259625 75463420 80799967 85021150 87289727 87955487 87538677 86393595
1633.7 86393595 84305882 82063341 80422068 79130030 78057694 76637280 74569702 72401154
1650.1 72401154 68288404 60057384 51979512 43390706 33994833 28204840 30050766 38115442
1666.4 38115442 51536345 67532104 78156835 83733493 87201869 89386547 90785778 91591161
1682.7 91591161 91951925 92113453 92270631 92658758 93460631 94836557 96434098 97658658 98636436
1701.1 98636436 99249500 99577671 99838638 100000000 100024688 99901098 99712384 99554414 99460524 99428433
1721.5 99428433 99459511 99586016 99730569 99839282 99919116 99966538 99976420 99947715 99889576 99832249 99753153
1743.9 99753153 99616843 99473935 99325353 99156451 98978853 98800564 98639643 98443115 98127204 97787899
1764.3 97787899 97470486 97118598 96781766 96504498 96349794 96293962 96316487 96494621 96822250 97151107
1784.7 97151107 97378433 97524387 97611463 97614557 97555637 97505963 97470051 97397012 97266752 97125196 96977526
1807.1 96977526 96744734 96357507 95870250 95395887 95039231 94905913 95011127 95273608 95547724 95708323
1827.5 95708323 95777750 95846808 95913583 95953560 96032548 96182895 96317786 96371669 96429175 96574587 96764195
1850 96764195 96926725 97047907 97144198 97186381 97156531 97121769 97141886 97162986 97105342 97013664 96959025 96889526
1874.4 96889526 96757472 96601325 96462303 96309203 96104133 95881659 95661539 95393646 95011908 94546705
1894.8 94546705 94222009 94178772 94238561 94206226 94106007 94051600 94132251 94379514 94707608 94976795 95129430
1917.3 95129430 95228004 95357031 95536226 95754570 96004146 96270216 96492946 96604276 96614218 96586996
1937.7 96586996 96526611 96382481 96182382 96012115 95867395 95688403 95466006 95239264 95008361 94728440
1958.1 94728440 94397354 94049740 93670398 93240947 92902058 92889011 93245757 93771386 94236165 94572139
1978.5 94572139 94806617 94957674 95064062 95187795 95345658 95492774 95610851 95743072 95899189 96032518
1998.8 96032518 96115661 96162820 96179730 96146303 96080142 96052480 96091861 96148711 96185088 96202648 96177423 96067667
2023.3 96067667 95922279 95874548 95950806 96055776 96144229 96239853 96331960 96362221 96317154 96256936 96225584
2045.8 96225584 96206009 96189308 96202111 96247238 96279162 96271455 96262848 96283901 96298182 96273410 96244127 96242017
2070.2 96242017 96241844 96220213 96205550 96224564 96247631 96241742 96229124 96238494 96245760 96223217 96197003 96199667 96212471
2096.8 96212471 96206266 96197987 96214670 96236533 96235245 96233666 96263832 96304023 96313459 96296865 96287364 96282828 96258789
2123.3 96258789 96233648 96241331 96267134 96279252 96289968 96323365 96357006 96360630 96352065 96364373 96388286 96389616
2147.7 96389616 96367550 96353221 96349579 96329379 96297640 96289504 96307009 96316886 96307421 96297389 96296555 96289217 96270078
2174.3 96270078 96263516 96273124 96270347 96252793 96241927 96234226 96209848 96178311 96176332 96205097 96224618 96218383 96207881
2200.8 96207881 96202087 96182621 96150690 96136230 96147966 96156871 96143401 96121091 96099436 96067536 96027625 96007150
2225.2 96007150 96015942 96023947 96012825 96008980 96030742 96053702 96057284 96057355 96068454 96070188 96040189 95997155 95973855
2251.8 95973855 95966101 95953578 95944500 95951390 95955354 95937997 95917201 95917511 95930254 95933723 95933980 95945269 95952702 95939279
2280.3 95939279 95920736 95922178 95938796 95952231 95968670 96001172 96036988 96058053 96070552 96083599 96089482 96076101
2304.8 96076101 96044838 96009606 95963949 95886976 95801973 95764053 95784819 95833313 95894033 95967120 96019638 96006030
2329.3 96006030 95920587 95799530 95702577 95675349 95722932 95817626 95904040 95932162 95940435 96001577 96127850
2351.7 96127850 96278137 96404934 96505225 96587610 96632743 96615744 96550858 96480125 96415889 96347922 96283948
2374.1 96283948 96233493 96179295 96108866 96052295 96039754 96057361 96080530 96105409 96127874 96133441 96120793 96107680
2398.6 96107680 96103817 96098369 96086019 96079749 96085721 96089292 96082592 96078110 96083295 96092743 96105790 96131235 96171832
2425.1 96171832 96210843 96232265 96246165 96265632 96282375 96283585 96275854 96275109 96280062 96279067 96268606 96251327 96228087
2451.6 96228087 96197885 96165961 96142650 96124816 96103239 96086842 96088296 96101516 96109927 96110255 96112627 96114516 96097052
2478.1 96097052 96057469 96017587 95988721 95962554 95939344 95927113 95922518 95918489 95914972 95915306 95922017 95932156 95940584
2504.7 95940584 95956510 95986068 96010643 96014071 96003264 95988923 95970488 95956826 95969862 96008307 96044707 96065176
2529.1 96065176 96077901 96091914 96101087 96100384 96104652 96117538 96120429 96102202 96079224 96073109 96078569 96082884 96089685
2555.6 96089685 96104258 96114439 96100938 96065110 96025336 95981759 95931047 95901930 95918840 95954084 95960945 95928520
2580.1 95928520 95866483 95780766 95685023 95609462 95580292 95589405 95603567 95605814 95600778 95582312 95547402 95515537
2604.6 95515537 95502394 95500785 95489353 95456642 95408911 95355958 95311534 95312983 95403838 95567554 95727342 95835024
2629.1 95835024 95902652 95949680 95982742 96017241 96067053 96123075 96168625 96200532 96227509 96256328 96282858 96302164
2653.5 96302164 96322984 96346676 96353984 96342570 96335882 96346056 96359086 96361828 96359485 96365488 96385515 96414751 96454239
2680.1 96454239 96497750 96518993 96507275 96483558 96462774 96437365 96403933 96370345 96337587 96300745 96270049 96263164
2704.5 96263164 96284074 96316409 96338129 96351326 96370298 96389663 96402246 96418607 96442980 96455306 96429688 96382821
2729 96382821 96353257 96339333 96328938 96328056 96337724 96345347 96333605 96306986 96281946 96250123 96205890 96178067 96186990
2755.5 96186990 96205056 96198863 96169186 96132499 96094692 96054518 96027464 96029097 96038914 96013939 95954078 95901936
2780 95901936 95872343 95856524 95858288 95873135 95864040 95812374 95747840 95694923 95646530 95593596 95551020 95538640
2804.5 95538640 95553732 95577389 95594221 95603645 95613694 95622569 95628548 95647264 95693213 95758057 95824981 95891994
2828.9 95891994 95962787 96030396 96087343 96137750 96162951 96134615 96080941 96043164 96006775 95940721 95859170 95799661
2853.4 95799661 95776999 95781970 95787853 95775139 95749271 95713347 95667338 95633209 95620120 95587105 95507294 95424461
2877.9 95424461 95382136 95369864 95365953 95364660 95368540 95372921 95365781 95344746 95316553 95274460 95206100 95125443 95059150
2904.4 95059150 95016134 94991559 94981766 94967973 94914532 94805306 94657403 94505829 94381618 94295925 94255006
2926.8 94255006 94249743 94239801 94228458 94266093 94360083 94484019 94635659 94809675 94960767 95047611 95077986
2949.3 95077986 95094484 95100349 95075536 95043707 95026588 95016044 94992673 94942480 94869745 94791681 94735861 94711518
2973.8 94711518 94692582 94669676 94650286 94608402 94530058 94443715 94356698 94246596 94079268 93801641 93387032
2996.2 93387032 92882735 92428648 92193580 92229080 92436182 92637527 92664236 92422336 91901052 91142452
3016.6 91142452 90215576 89290893 88642794 88422126 88553590 88802308 88913637 88903391 89036810 89413983
3037 89413983 89837241 90077120 90048105 89712107 89038438 88145977 87277800 86552101 85904521 85307860
3057.4 85307860 84914064 84983987 85750598 87166518 88751745 90000981 90809923 91266352 91375768
3075.7 91375768 91132420 90645075 90236241 90366364 91200519 92350912 93292558 93845940 94127381 94270062
3096.1 94270062 94304752 94246554 94200265 94314581 94622904 95001054 95310873 95535213 95725256 95880228
3116.5 95880228 95975214 96011579 96005642 95985889 95982099 96000040 96013778 96004260 95988661 95990735 95998943 95981318 95930779
3143 95930779 95863402 95782197 95693612 95642352 95666158 95743382 95818150 95853382 95847970 95815068 95761383 95695430
3167.5 95695430 95635450 95593661 95568550 95557821 95561987 95571363 95566136 95536917 95489979 95431066 95369130 95319396
3192 95319396 95290953 95287079 95304745 95333201 95362389 95391303 95420009 95441145 95449603 95444310 95421726 95377678 95315307
3218.5 95315307 95242268 95152795 95036077 94897401 94746125 94596052 94466704 94360548 94286740 94268799
3238.9 94268799 94292098 94320107 94328141 94272280 94132721 93979377 93892026 93859351 93818992 93758947 93717408
3261.3 93717408 93718970 93772322 93888259 94038987 94142890 94160056 94133574 94103360 94077617 94057512 94038063
3283.8 94038063 94016451 93992573 93969506 93937004 93872005 93778765 93673730 93564230 93460590 93353194 93202752
3306.2 93202752 92982846 92706203 92408872 92126727 91897792 91774887 91800529 91965479 92183656 92348325
3326.6 92348325 92418212 92401952 92319602 92194891 92053235 91902679 91734838 91546971 91348922 91181576
3347 91181576 91059011 90918911 90721178 90504897 90312016 90136486 89944774 89743179 89582783 89459127
3367.4 89459127 89296615 89056635 88802099 88600254 88429916 88253546 88070816 87901753 87766755 87668210
3387.8 87668210 87596893 87510252 87362212 87202096 87117887 87082916 86982107 86801773 86648691 86562592 86497384
3410.2 86497384 86420780 86312091 86194736 86122245 86079091 86021143 85961264 85948306 85984987 86009592 86014569
3432.7 86014569 86041403 86050588 85997379 85938191 85930407 85967147 86016816 86050749 86084563 86149174 86228114 86311167
3457.1 86311167 86407560 86490500 86572188 86715585 86898482 87010026 87016350 87011486 87065762 87175018 87295747
3479.6 87295747 87377274 87454146 87573999 87690377 87776065 87868899 87982243 88107616 88219917 88312370 88430530
3502 88430530 88544816 88599557 88654286 88777071 88955402 89119256 89237064 89347559 89480895 89634824
3522.4 89634824 89765710 89852995 89956897 90099519 90253484 90418619 90568191 90674263 90784895 90945172
3542.8 90945172 91127652 91258866 91333336 91434819 91578352 91708714 91831762 91976988 92103243 92155164
3563.2 92155164 92203498 92387819 92634201 92784399 92886299 93026900 93205136 93393975 93570095 93711233
3583.6 93711233 93828440 93980086 94160467 94309473 94459742 94659388 94886500 95098406 95274669 95398307
3604 95398307 95479006 95583630 95728832 95885080 96054316 96189344 96340215 96575469 96757108 96813649
3624.4 96813649 96814251 96931005 97174293 97323650 97397685 97448999 97473222 97486550 97480255 97408563 97302264
3646.8 97302264 97363317 97627324 97815925 97959661 98201621 98420227 98505348 98512465 98486996 98433441 98424500
3669.2 98424500 98467761 98442453 98469150 98601115 98691458 98759055 98804814 98810250 98849642 98955637 99030948
3691.7 99030948 99060595 99062419 99036449 99028295 99087125 99148268 99125439 99056202 99031067 99112600 99200493 99206787
3716.2 99206787 99182552 99187875 99228108 99288636 99371070 99415338 99388081 99357623 99408382 99541903 99610275 99502343
3740.6 99502343 99334449 99340802 99409413 99379772 99430895 99556708 99591053 99569666 99589670 99638987 99642622 99633008
3765.1 99633008 99638385 99676722 99749076 99778032 99766380 99782008 99833578 99831814 99777913 99762630 99787784 99822247
3789.6 99822247 99839073 99810958 99779487 99752140 99726158 99776089 99786675 99750680 99805140 99849498 99806565 99751168
3814.1 99751168 99768692 99763465 99734151 99814957 99864906 99846375 99828798 99813300 99811757 99793029 99749607 99756056
3838.5 99756056 99810755 99860668 99896914 99885261 99778336 99592543 99555373 99802095 99951649 99945188 99892694
3861 99892694 99868113 99894583 99853885 99789006 99818522 99869251 99907374 99909556 99921185 99971336 99964994 99974573 99986839
3887.5 99986839 99943250 99974585 100047612 100023091 99931413 99855489 99843949 99908608 100001848 100053847 100072777 100083518
3912 100083518 100064850 100031245 100025356 100031340 100029612 100042641 100058734 100049913 100055051 100097930 100128460 100113666 100063300
3938.5 100063300 100010240 99995333 100000000 99996841 100007260 100021362 100013626 99994099 99996471 100039399 100104892 100171649
3962.9 100171649 100225365 100253105 100262332 100275409 100294685 100312352 100328636 100334930 100327516 100324178 100319993 100300348
3987.4 100300348 100284708 100288928 100298142 100297725 100295508
3997.6 100295508
##END=$$ End of the data block
