##TITLE=Alopurinol - Carolina $$ Begin of the data block
##JCAMP-DX=5.00 $$ ACD/SpecManager v 10.08
##SPECTROMETER/DATA SYSTEM=Alpha
##DATE=05 Nov 2014 08:38:28
##DATA TYPE=INFRARED SPECTRUM
##DATA CLASS=XYDATA
##ORIGIN=
##OWNER=
##NPOINTS=1765
##FIRSTX=399.76428223
##LASTX=3997.64306641
##MAXX=3997.64306641
##MINX=399.76428223
##MAXY=1.00000000
##MINY=0.30645242
##XFACTOR=1.0000000000
##YFACTOR=0.000000010000000
##FIRSTY=1.00000000
##DELTAX=2.03961372
##XUNITS=1/CM
##YUNITS=ARBITRARY UNITS
##XYDATA=(X++(Y..Y))
399.8A00000000k12598k26098k08789j51092q5342l7348k3967l4482n3912p9364j04135
422.2I8782873j22905j31839j32263j30719j23387r7859p2974o2722o0916o7657o9142
444.6I7710490o0403n9962p0334q0877q2994p7671p0244o3819o0951o0243o0469o1637
469.1I6900886n9920n0921m1252l8224l7182l5548l4273l0881k2959j5486j5837k2334
493.6I6496069l1209m0203m8178o0225p0697p0292o4140r9826k33770l86124m10396
516I4981009m12846o52462j008403j112515j065362j288640j681852j702846j218473
534.4H4837610o12581j64467K40135P80123J361442J689994J679880J628905J658911
552.7I3099952J409602P47287J73289O9827J63954Q3894j05530j74958j37055j10948
$$ plain form
399.8 100000000 99787402 99561304 99352515 99201423 99116081 99078733 99054766 99020284 98966372 98887008 98782873
422.2 98782873 98659968 98528129 98395866 98265147 98141760 98043901 97970927 97908205 97847289 97779632 97710490
444.6 97710490 97650087 97590125 97519791 97438914 97355920 97278249 97208005 97144186 97083235 97022992 96962523 96900886
469.1 96900886 96840966 96790045 96748793 96710569 96673387 96637839 96603566 96572685 96549726 96534240 96518403 96496069
493.6 96496069 96464860 96424657 96376479 96316254 96245557 96175265 96111125 96011299 95777529 95391405 94981009
516 94981009 94568163 93915701 92907298 91794783 90729421 89440781 87758929 86056083 84837610
534.4 84837610 84225029 84060562 84300697 85080820 86442262 88132256 89812136 91441041 93099952
552.7 93099952 94509554 95256841 95430130 95499957 95663911 95747805 95642275 95467317 95330262 95219314
573.1I5219314j10274j14823j14804r6369l9119R7293K38907j86854j778037l911298
593.5H9203936n226964n221885m305578k963936j449531J22565J677137L146184M432034
611.9G9413962N345369N487883M357767K210683L71235k82931j78296R156Q1426Q9889
632.3I6906143P9757O3694M9466M2718M2809M2700L6109K4241J4150J532j4061j7917
656.8I7271341j7810k1201k3919k4456k6262l0315l7146m8673o5398q2570r5916j00458
681.2I6697217j08874j96373l64059m41116n21386j058006k053953k806800k793765
699.6H6352885k158112j263451l16334O04051J442850K119142K558684K796990K832329
717.9I4969034K375674J274646Q7577m77231m31436k38633j37103j04731r5695r9522
$$ plain form
573.1 95219314 95109040 94994217 94879413 94783044 94743925 94841218 95080125 94893271 93115234 89203936
593.5 89203936 83976972 78755087 74449509 71485573 70036042 70158607 71835744 74981928 79413962
611.9 79413962 84759331 90247214 94604981 96815664 97186899 96903968 96725672 96734828 96816254 96906143
632.3 96906143 96985900 97049594 97099060 97141778 97184587 97227287 97263396 97287637 97301787 97303319 97289258 97271341
656.8 97271341 97253531 97232330 97208411 97183955 97157693 97127378 97090232 97041559 96976161 96893591 96797675 96697217
681.2 96697217 96588343 96391970 96027911 95586795 95065409 94007403 91953450 89146650 86352885
699.6 86352885 84194773 82931322 82614988 83219039 84661889 86781031 89339715 92136705 94969034
717.9 94969034 97344708 98619354 98706931 98229700 97798264 97559631 97422528 97317797 97222102 97122580
738.3I7122580j11658j25151j38152j54448j74021j91701k02888k05064j94430j77175
758.7I5447892j61141j19204j09511m72021j475847k709454l445679l452927k939922
777.1H0562186k135414j196867k28786P07703J557118K247524K665872K574777J720471
795.4H8474584L23748q67790j409316j513934j468039j331663j101815p86060m00967
813.8G9918748K4146M51684Q42321J158947J368427J452792J420641J302248J134401
832.2H9074355R47822P63946N95039M42589L01188J64133K7848j06669k34854l52413
852.6I1622984m57769n52237o41316p35820q51625j008940j236134j555145j941693
870.9H2642305k305061k538573k587027k447474k135986j676506j104623m70018J63305
$$ plain form
738.3 97122580 97010922 96885771 96747619 96593171 96419150 96227449 96024561 95819497 95625067 95447892
758.7 95447892 95286751 95167547 95058036 94586015 93110168 90400714 86955035 83502108 80562186
777.1 80562186 78426772 77229905 77001119 77708822 79265940 81513464 84179336 86754113 88474584
795.4 88474584 88798332 87930542 86521226 85007292 83539253 82207590 81105775 80319715 79918748
813.8 79918748 79942894 80394578 81236899 82395846 83764273 85217065 86637706 87939954 89074355
832.2 89074355 90022177 90786123 91381162 91823751 92124939 92289072 92316920 92210251 91975397 91622984
852.6 91622984 91165215 90612978 89971662 89235842 88384217 87375277 86139143 84583998 82642305
870.9 82642305 80337244 77798671 75211644 72764170 70628184 68951678 67847055 67377037 67540342
889.3F7540342P29203J166177J383024J207537M62532p85119k066433k758300k572203
907.6F4306760j683659m30434R27746K239579L425622M422754N123311N337829M850876
926H8520384L632629K046776P23874P7748J3167J34331r3448j110500k549273l434300
946.4H7961388l361941k647716j659828n89222M70239J469338K374208L130794L624385
964.7I0771645L618437K810252J325071K0820m35561l26085j77384j36727j58167j95849
985.1I7116452k23422k33703k30557k19345k02698j78349j45381j09363q0949p0357
1005.5I5422328p8851r7251j15931j31780j45394j55407j56325j45346j27602j12319
1025.9I4156122j04165j00696r7412r4294r5696j05202j22440j44469j70386k04677
$$ plain form
889.3 67540342 68269545 69435722 70818746 72026283 72488815 71703696 69637263 66878963 64306760
907.6 64306760 62623101 62192667 63120413 65359992 68785614 73208368 78331679 83669508 88520384
926 88520384 92153013 94199789 94923663 95001411 95014578 95148909 95055461 93944961 91395688 87961388
946.4 87961388 84599447 81951731 80291903 79702681 80172920 81642258 84016466 87147260 90771645
964.7 90771645 94390082 97200334 98525405 98546225 98110664 97784579 97607195 97470468 97312301 97116452
985.1 97116452 96893030 96659327 96428770 96209425 96006727 95828378 95682997 95573634 95492685 95422328
1005.5 95422328 95343477 95246226 95130295 94998515 94853121 94697714 94541389 94396043 94268441 94156122
1025.9 94156122 94051957 93951261 93853849 93759555 93663859 93558657 93436217 93291748 93121362 92916685
1046.3I2916685k90805n12993q66944j206094j409006j484620j488537j446599j356381
1064.7H2854706j197571r73916p95263p95406q90839q45367n81538j57291L95864J025105
1085.1G8038484J633167K140695K499115K678138K663446K421194J900238J182169
1101.4I5156646N55044K31409J16617K8193o9684j31595j48225j47510j50787j60110
1121.8I5279998j71835j85489k01178k16275k32381k62403l12567l61455l78084l71289
1142.2I2587042m36813o74981r72557j064354q59016m76223m9234L49337O78718R18639
1162.6I0000558J077270J172501J186109J046794O82629J63352k48921l74305l17645
1180.9I4388342k52640k28185k25574k38674k82449l59607m41372m96394n19788n28854
$$ plain form
1046.3 92916685 92625880 92112887 91245943 90039849 88630843 87146223 85657686 84211087 82854706
1064.7 82854706 81657135 80683219 79887956 79092550 78201711 77356344 76774806 76617515 77013379 78038484
1085.1 78038484 79671651 81812346 84311461 86989599 89653045 92074239 93974477 95156646
1101.4 95156646 95711690 95943099 96059716 96087909 96018225 95886630 95738405 95590895 95440108 95279998
1121.8 95279998 95108163 94922674 94721496 94505221 94272840 94010437 93697870 93336415 92958331 92587042
1142.2 92587042 92150229 91475248 90502691 89438337 88579321 88103098 88053864 88403201 89081919 90000558
1162.6 90000558 91077828 92250329 93436438 94483232 95165861 95329213 95080292 94705987 94388342
1180.9 94388342 94135702 93907517 93681943 93443269 93160820 92801213 92359841 91863447 91343659 90814805
1201.3I0814805n41496n62275n92071o75237r63419j619935k551276l382629l795457
1219.7G6131010l788406l584039l372329l147430k742141j995915q75247M89158J809758
1238.1E8924419K763003L251338L528678L895861M323799M505765M210269L483570
1254.4H8886702K579677J766819J181889Q31365O45083N22507L96710K63506J51730
1272.7I7225988P9846M2355K3765Q034j8376n6106r3185j20396j40494j64032j96969
1295.2I6590430k34205k65098k81846k83831k74152k55305k29752j98489j62977j29086
1315.6I4275689j06192j02722j20133j51080j83004k09415k35057k64305k93130l19004
1336I2291647l45015l75825m18014m65268m74876l92091l87412r57937k311342l700865
$$ plain form
1201.3 90814805 90273309 89711034 89118963 88443726 87480307 85860372 83309096 79926467 76131010
1219.7 76131010 72342604 68758565 65386236 62238806 59496665 57500750 56625503 57114661 58924419
1238.1 58924419 61687422 64938760 68467438 72363299 76687098 81192863 85403132 88886702
1254.4 88886702 91466379 93233198 94415087 95246452 95891535 96414042 96810752 97074258 97225988
1272.7 97225988 97305834 97348189 97371954 97379988 97361612 97305506 97212321 97091925 96951431 96787399 96590430
1295.2 96590430 96356225 96091127 95809281 95525450 95251298 94995993 94766241 94567752 94404775 94275689
1315.6 94275689 94169497 94066775 93946642 93795562 93612558 93403143 93168086 92903781 92610651 92291647
1336 92291647 91946632 91570807 91152793 90687525 90212649 89820558 89433146 88475209 86163867 82463002
1356.4H2463002m065650l298337j998979o43885O16139J719642K582067L079689K984112
1374.7H3437800K192235P50298j136554k698099l036672k007276m35996R51237K021998
1393.1H0038971K828341L308988L350687K857000J830619O25807k79671o82836o58632
1411.4I3219274n21397m27544l72041l42172l31724l26705l09527k91097k78473k69401
1431.8H9749193k52527k23481k06817k11614k34616k51686k52700k78449l28553l74007
1452.2H7134743m36241n35208o38455p88587j054663j423585j841134k197975k383208
1470.6G5835687k343315k076399j529730o68198L18981J258093K101540K755863L062183
1488.9G8714705K968776K571171K006746J364684P05695Q6826l95155o41125p01505
$$ plain form
1356.4 82463002 78397352 75099015 73100036 72456151 73072290 74791932 77373999 80453688 83437800
1374.7 83437800 85630035 86380333 85243779 82545680 79509008 77501732 77065736 78016973 80038971
1393.1 80038971 82867312 86176300 89526987 92383987 94214606 94840413 94560742 93877906 93219274
1411.4 93219274 92697877 92270333 91898292 91556120 91224396 90897691 90588164 90297067 90018594 89749193
1431.8 89749193 89496666 89273185 89066368 88854754 88620138 88368452 88115752 87837303 87508750 87134743
1452.2 87134743 86698502 86163294 85524839 84736252 83681589 82258004 80416870 78218895 75835687
1470.6 75835687 73492372 71415973 69886243 69218045 69537026 70795119 72896659 75652522 78714705
1488.9 78714705 81683481 84254652 86261398 87626082 88331777 88418603 88023448 87382323 86680818
1507.3H6680818p21550p19315o77532o45322o54238o67769o09052m92251l98332l13383
1527.7H0782074k43306k14017k29430k79003l64972n11574p28858r67216j206774j489967
1548.1G4546957j709163j859135j944309j948541j960636j978290j942414j926464
1564.4E9278005j975375k071792k222872k384191k518443k586472k461856k205626
1580.7D0851378j897588j571178j248488q53268l39987K27794Q59636J569137K281350
1599.1C9878786K902156L406980L852985M137563M152972L957462L599370L116363
1615.4F9004637K590913K083921J636302J313431J103121R03028O35683L46846J07842
1633.7G9725724j72686m52191o07705p32255q88491j054394j226526j394117j552820
$$ plain form
1507.3 86680818 85959268 85239953 84562421 83917099 83262861 82595092 81986040 81493789 81095457 80782074
1527.7 80782074 80538768 80324751 80095321 79816318 79451346 78939772 78210914 77243698 76036924 74546957
1548.1 74546957 72837794 70978659 69034350 67085809 65125173 63146883 61204469 59278005
1564.4 59278005 57302630 55230838 53007966 50623775 48105332 45518860 43057004 40851378
1580.7 40851378 38953790 37382612 36134124 35280856 34940869 35168663 36028299 37597436 39878786
1599.1 39878786 42780942 46187922 50040907 54178470 58331442 62288904 65888274 69004637
1615.4 69004637 71595550 73679471 75315773 76629204 77732325 78635353 79271036 79617882 79725724
1633.7 79725724 79553038 79100847 78493142 77760887 76872396 75818002 74591476 73197359 71644539
1652.1G1644539j709640j870788k045375k193677k291572k322364k225083j987028
1668.4E4999012j691091j471746j338536j267141j311389j448231j634247j920577
1684.7D2916054k266324k484393k495694k242598j682636r33767j65400M39382Q61260
1703.1C1945884J183313J450190J652336J827085K038846K349669K796283L272983
1719.4D8516589L830648M434645M791057M832822M595137M097354L467644K793157
1735.7H1359053K117455J575488J177197Q56579N91832L52663K05672Q6998r9498k37482
1756.1H7985957k94733k80762j97959q3512O8009K49672M25607N90759P28870P88670
1776.5H9980578P72351P33775O85287O24663N61052N25737M89938M21196L48461L00914
$$ plain form
1652.1 71644539 69934899 68064111 66018736 63825059 61533487 59211123 56986040 54999012
1668.4 54999012 53307921 51836175 50497639 49230498 47919109 46470878 44836631 42916054
1684.7 42916054 40649730 38165337 35669643 33427045 31744409 30810642 30645242 31084624 31945884
1703.1 31945884 33129197 34579387 36231723 38058808 40097654 42447323 45243606 48516589
1719.4 48516589 52347237 56781882 61572939 66405761 71000898 75098252 78565896 81359053
1735.7 81359053 83476508 85051996 86229193 87085772 87677604 88030267 88235939 88322937 88223439 87985957
1756.1 87985957 87691224 87410462 87212503 87128991 87197000 87446672 87872279 88463038 89191908 89980578
1776.5 89980578 90752929 91486704 92171991 92796654 93357706 93883443 94373381 94794577 95143038 95443952
1796.9I5443952K81006K80261K81030K70814K74563K97570K98250K74205K41417K16096
1817.3I8159164J96111J57464J05268N8049R668n8341j10752j08540p8237l8862J2809
1839.8I8303801P4738J31035J86938K36410K55728K43252J99765J38343Q1944N1647
1860.2I9903601L7605J5175n543j8352k4909k6178k6298k2274j1921r126r846M303
1884.6I9806237K0558J9228J0729M065m023j2517j8722k6488m0078m0657k3389j1885
1909.1I9683058l445O056R465J0538J2100J1438P898J770j1486k8920l7044k8861j5133
1935.6I9617434j0241j0877j6916k9326m2772n6648p4965j04082j44767j90926k30682
1958.1I8705232k58577k78532k87211k79081k52008k06006j45304p7796j3733L9619
$$ plain form
1796.9 95443952 95724958 96005219 96286249 96557063 96831626 97129196 97427446 97701651 97943068 98159164
1817.3 98159164 98355275 98512739 98618007 98676056 98685724 98627383 98516631 98408091 98329854 98290992 98303801
1839.8 98303801 98378539 98509574 98696512 98932922 99188650 99431902 99631667 99770010 99851954 99903601
1860.2 99903601 99941206 99956381 99950838 99932486 99907577 99881399 99855101 99832827 99820906 99811780 99801934 99806237
1884.6 99806237 99826795 99846023 99856752 99860817 99856794 99844277 99825555 99799067 99758989 99718332 99694943 99683058
1909.1 99683058 99679613 99685669 99695134 99705672 99717772 99729210 99737108 99738878 99727392 99698472 99661428 99632567 99617434
1935.6 99617434 99607193 99596316 99579400 99550074 99507302 99450654 99375689 99271607 99126840 98935914 98705232
1958.1 98705232 98446655 98168123 97880912 97601831 97349823 97143817 96998513 96920717 96906984 96946603
1978.5I6946603Q3786J18649J41031J52403J57762J59943J59263J57088J54573J50812
1998.8I8381913J41722J24406J01030P7063N6458L7276J9718O556l010j0341j5229
2021.3I8917562j7727j9145k0951k3758k6846k8855l1745l6872m2605m8917n6231o2353
2045.8I8501557o5535o5929o3300n7119m8679l9405l0982k3979j8001j3339j0193r096
2070.2I8056000j0287j3054j5890j7774j7792j6654j6892j9413k3013k6119k8366l0631
2094.7I7820115l3682l7683m2152m6170m9823n4658o2072p2783q6171r9903j11276
2117.1I7123742j18768j22291j21367j14596j02335q6695o8295m7398k5385m637J1587
2139.6I6323562K1845K7436L0035K9516K5570J9425J3280Q631O175O533Q994J0866
$$ plain form
1978.5 96946603 97030389 97149038 97290069 97442472 97600234 97760177 97919440 98076528 98231101 98381913
1998.8 98381913 98523635 98648041 98749071 98826134 98882592 98919868 98939586 98946142 98943132 98932791 98917562
2021.3 98917562 98899835 98880690 98859739 98835981 98809135 98780280 98748535 98711663 98669058 98620141 98563910 98501557
2045.8 98501557 98436022 98370093 98306793 98249674 98200995 98161590 98130608 98106629 98088628 98075289 98065096 98056000
2070.2 98056000 98045713 98032659 98016769 97998995 97981203 97964549 97947657 97928244 97905231 97879112 97850746 97820115
2094.7 97820115 97786433 97748750 97706598 97660428 97610605 97555947 97493875 97421092 97334921 97235018 97123742
2117.1 97123742 97004974 96882683 96761316 96646720 96544385 96457690 96389395 96341997 96316612 96311975 96323562
2139.6 96323562 96345407 96372843 96402878 96432394 96457964 96477389 96490669 96499300 96505475 96512008 96521002 96531868
2164.1I6531868J0580Q011K855n579j7292l0267m1789n0205n4979n5987n3846m9574
2188.5I6193796m4232l9304l5810l3772l3516l5697l9291m2784m6218n0449n4914n8121
2213I5679688n9306n9104n8591n8222n7715n6243n4169n2333n0873m9430m7594m5490
2237.5I5030618m3679m2253m1229m0954m1789m3881m6891n0926n6619o3675p0685p7844
2262I4410193q6331r6125j06686j18655j33163j49721j65540j76620j79094j71668
2282.3I3026590j56378j36280j13988r1738p0923n2447l8129k8658k0676j1754l297
2304.8I2302322M614J4519K8098M1467M6974M3899L8249L1286K0903P928m822j6761
2329.3I2558676k3448j1021Q213N806k2900n9194r0957j12712j21450j23287j23828
$$ plain form
2164.1 96531868 96542448 96550459 96553314 96547735 96530443 96500176 96458387 96408182 96353203 96297216 96243370 96193796
2188.5 96193796 96149564 96110260 96074450 96040678 96007162 95971465 95932174 95889390 95843172 95792723 95737809 95679688
2213 95679688 95620382 95561278 95502687 95444465 95386750 95330507 95276338 95224005 95173132 95123702 95076108 95030618
2237.5 95030618 94986939 94944686 94903457 94862503 94820714 94776833 94729942 94679016 94622397 94558722 94488037 94410193
2262 94410193 94323862 94227737 94121051 94002396 93869233 93719512 93553972 93377352 93198258 93026590
2282.3 93026590 92870212 92733932 92619944 92528206 92457283 92404836 92366707 92338049 92317373 92305619 92302322
2304.8 92302322 92306936 92321455 92349553 92391020 92437994 92481893 92520142 92551428 92572331 92580259 92575437 92558676
2329.3 92558676 92535228 92524207 92532420 92538226 92515326 92456132 92365175 92252463 92131013 92007726 91883898
2351.7I1883898j21594j12670r4140o1804j9848P98j4817m6426p1532r0843j10603
2374.1I1140419j30427j49226j65355j76024j79977j77926j70695j57339j37365j13064
2394.5H9583021q8334o5666m6361l2019k3425k1088k5284l4803m7619o1887p6324r0110
2419H8970101j02031j10293j13696j11901j06043r7662q7309p5907o5064n6684n2822
2441.4H7990689n4550o1452p1633q2964r4032j03390j09583j11473j09547j06204j03402
2463.9H6982459j01590r9880r7281r4676r3078r2542r2584r2495r2178r2846r5922
2486.3H5937387j02645j12945j24830j37037j49703j62196j73939j84536j93470k01518
2506.7H4394568k10404k22105k36428k49266k56205k55316k47145k33096k13379j87635
$$ plain form
2351.7 91883898 91762304 91649634 91555494 91493690 91473842 91474640 91459823 91413397 91341865 91251022 91140419
2374.1 91140419 91009992 90860766 90695411 90519387 90339410 90161484 89990789 89833450 89696085 89583021
2394.5 89583021 89494687 89429021 89382660 89350641 89327216 89306128 89280844 89246041 89198422 89136535 89060211 88970101
2419 88970101 88868070 88757777 88644081 88532180 88426137 88328475 88241166 88165259 88100195 88043511 87990689
2441.4 87990689 87936139 87874687 87803054 87720090 87626058 87522668 87413085 87301612 87192065 87085861 86982459
2463.9 86982459 86880869 86780989 86683708 86589032 86495954 86403412 86310828 86218333 86126155 86033309 85937387
2486.3 85937387 85834742 85721797 85596967 85459930 85310227 85148031 84974092 84789556 84596086 84394568
2506.7 84394568 84184164 83962059 83725631 83476365 83220160 82964844 82717699 82484603 82271224 82083589
2527.1H2083589j58614j32489j14775j06424j03933j02240r6935q5890p0387n4812
2547.5H1057090m4150m0298m2105m9150o2811q4860j13904j43599j67698j84250j94794
2569.9G9929471k03168k13552k29013k50178k73979k96879l17186l32886l41338l40092
2590.3G7131200l27182l03018k70468k32661j92934j55133j23698j02794r5892j04201
2610.7G5223219j26081j57982j96004k35707k71130k95740l05110k99430k83009k60520
2631.1G2792506k34866k08771j86032j70654j66500j76167j99265k32356k70325l07680
2651.5G0639890l40575l68446l90958m04686m06134l95966l77625l54570l30222l07459
2671.9F6963249k87842k72787k64376k65318k77347k94566k96986k58345j65015k5862
$$ plain form
2527.1 82083589 81924975 81792486 81677711 81571287 81467354 81365114 81268179 81182289 81111902 81057090
2547.5 81057090 81012940 80972642 80930537 80881387 80818576 80733716 80619812 80476213 80308515 80124265 79929471
2569.9 79929471 79726303 79512751 79283738 79033560 78759581 78462702 78145516 77812630 77471292 77131200
2590.3 77131200 76804018 76501000 76230532 75997871 75804937 75649804 75526106 75423312 75327420 75223219
2610.7 75223219 75097138 74939156 74743152 74507445 74236315 73940575 73635465 73336035 73053026 72792506
2631.1 72792506 72557640 72348869 72162837 71992183 71825683 71649516 71450251 71217895 70947570 70639890
2651.5 70639890 70299315 69930869 69539911 69135225 68729091 68333125 67955500 67600930 67270708 66963249
2671.9 66963249 66675407 66402620 66138244 65872926 65595579 65301013 65004027 64745682 64580667 64554805
2692.3F4554805J32495K76577L77864M24749M23252L82084L00890J76167J4854j55741
2712.7F6907996k94393l70050l80409l49295l10111k88296k91526l10629l30103l42375
2733.1F3640809l50946l60918l71373l75128l63964l35729k97731k62075k38014k28280
2753.5F0456651k30461k40177k52741k65110k76536k86269k91908k90531k79992k60175
2773.9E7782751k33066k01010j65540j27256q6069m3816n394K3711L9524L9649K2476
2796.3E7045960j2892o5488j31684k06775k83599l50082l90827l93760l57539k91979
2816.7E4561335k11764j31845o5887k4080j4299l9864r4056j64235k38037l04240l52883
2839.1E2920145l78597l83669l74895l58534l39657l21699l05229k90650k75675k52550
$$ plain form
2692.3 64554805 64687300 64963877 65341741 65766490 66189742 66571826 66872716 67048883 67063737 66907996
2712.7 66907996 66613603 66243553 65863144 65513849 65203738 64915442 64623916 64313287 63983184 63640809
2733.1 63640809 63289863 62928945 62557572 62182444 61818480 61482751 61185020 60922945 60684931 60456651
2753.5 60456651 60226190 59986013 59733272 59468162 59191626 58905357 58613449 58322918 58042926 57782751
2773.9 57782751 57549685 57348675 57183135 57055879 56969810 56925994 56920600 56944311 56983835 57023484 57045960
2796.3 57045960 57033068 56967580 56835896 56629121 56345522 55995440 55604613 55210853 54853314 54561335
2816.7 54561335 54349571 54217726 54151839 54127759 54113460 54073596 53979540 53815305 53577268 53273028 52920145
2839.1 52920145 52541548 52157879 51782984 51424450 51084793 50763094 50457865 50167215 49891540 49638990
2859.5D9638990k18836j82184j49447j20211r2035o4353l6138m080L6860R2220J64780
2882D9065566K51415L45946M44439N44864O44052P38197Q22384Q89682R33433R50432
2902.4E5630410R42862R17053Q80462Q37970P89457P31159O58851N66733M48281L03769
2922.8F2707007J45328o688j33574k26462k85071l12382l10999k80315k17574j21951
2943.2F0957319N48J34873K62434L68082M43399M84276M85170M38708L41374J95741
2963.6F4111924J2618j85608l71623n21666o20526o65582o64264o27619n65755m84455
2984E9417444l86124k72829j47038j3853J17988K38365L37595M07898M43214M38428
3004.4F0581088L92008L05658J83481L5996j22285k75785m06307m99207n52356n73105
$$ plain form
2859.5 49638990 49420154 49237970 49088523 48968312 48876277 48811924 48775786 48771706 48808566 48900786 49065566
2882 49065566 49316981 49662927 50107366 50652230 51296282 52034479 52856863 53746545 54679978 55630410
2902.4 55630410 56573272 57490325 58370787 59208757 59998214 60729373 61388224 61954957 62403238 62707007
2922.8 62707007 62852335 62845647 62712073 62485611 62200540 61888158 61577159 61296844 61079270 60957319
2943.2 60957319 60957867 61092740 61355174 61723256 62166655 62650931 63136101 63574809 63916183 64111924
2963.6 64111924 64124542 63938934 63567311 63045645 62425119 61759537 61095273 60467654 59901899 59417444
2984 59417444 59031320 58758491 58611453 58597600 58715588 58953953 59291548 59699446 60142660 60581088
3004.4 60581088 60973096 61278754 61462235 61498231 61375946 61100161 60693854 60194647 59642291 59069186
3024.7E9069186n69635n48476n15217m70787m08179l17573j95348m7052J14023K67876
3045.1E6378818L91405M62246M60863L77435K17611m12k50035m97437p06523q48777
3065.5E5985194r13381r05150q36617p26301n92291m45288k94030j50353k9504N5188
3085.9E1147467J10328J71054K77835M43619O45107Q43007J006239J120502J185030
3104.3E6950188J203036J174366J096660R70668Q11809O57416N52141N17732N37527
3122.6F4471543N75459O06060O22505O28030O25843O16032N96809N63717N10573M34453
3143G0251024L34662K13289P7218o4385j98293l07619l78001l99584l67259k82038
3163.4F8879014j51133J1575J87987L60245N09983O19382O77412O81973O37358N53817
$$ plain form
3024.7 59069186 58499551 57951075 57435858 56965071 56556892 56239319 56043971 55996919 56110942 56378818
3045.1 56378818 56770223 57232469 57693332 58070767 58288378 58287966 58037931 57540494 56833971 55985194
3065.5 55985194 55071813 54166663 53330046 52603745 52011454 51566166 51272136 51121783 51092279 51147467
3085.9 51147467 51257795 51428849 51706684 52150303 52795410 53638417 54644656 55765158 56950188
3104.3 56950188 58153224 59327590 60424250 61394918 62206727 62864143 63416284 63934016 64471543
3122.6 64471543 65047002 65653062 66275567 66903597 67529440 68145472 68742281 69305998 69816571 70251024
3143 70251024 70585686 70798975 70876193 70811808 70613515 70305896 69927895 69528311 69161052 68879014
3163.4 68879014 68727881 68739456 68927443 69287688 69797671 70417053 71094465 71776438 72413796 72967613
3183.8G2967613M45544L28130K17652J27924O8754M5514N7447R9331J63215K38216
3204.2G4759340L14939L87651M51201N02289N40858N68611N87028N96332N97024N90146
3224.6G9895419N76186N54794N28509N01084M74650M50253M27735M07141L89833L75914
3245H4581518L63559L51065L36760L19827L00872K79802K57069K35147K14576J94025
3265.4H7434220J73474J53523J33962J14631R5505P6354N8323M2861K9809J9103J1533
3287.8H8343298P678O210M101R24k688p463j4275k4116l6287m9025o3300q0049r6709
3314.4H7988299j11300j25140j39463j54286j68866j82724j95706k08682k22301k35993
3334.8H6243838k50620k67708k85965l02440l16411l29554l40587l47793l52532l56305
$$ plain form
3183.8 72967613 73413157 73741287 73958939 74086863 74155617 74201131 74258578 74357909 74521124 74759340
3204.2 74759340 75074279 75461930 75913131 76415420 76956278 77524889 78111917 78708249 79305273 79895419
3224.6 79895419 80471605 81026399 81554908 82055992 82530642 82980895 83408630 83815771 84205604 84581518
3245 84581518 84945077 85296142 85632902 85952729 86253601 86533403 86790472 87025619 87240195 87434220
3265.4 87434220 87607694 87761217 87895179 88009810 88105315 88181669 88239992 88282853 88312662 88331765 88343298
3287.8 88343298 88350976 88357186 88361287 88362211 88359523 88352060 88337785 88313669 88277382 88228357 88165057 88085008 87988299
3314.4 87988299 87876999 87751859 87612396 87458110 87289244 87106520 86910814 86702132 86479831 86243838
3334.8 86243838 85993218 85725510 85439545 85137105 84820694 84491140 84150553 83802760 83450228 83093923
3355.2H3093923l57878l55416l48616l40140l32719l25882l18426l09742k99710k89607
3375.5G9815787k80857k73198k65813k58118k49523k41541k35248k28739k21020k13265
3395.9G7348465k05583j97166j88196j81621j78599j72514j59705j45745j35714j29294
3416.3G5654328j20932j07944r4581q2862p1412n8782m5521l4695k1649k169J6379
3438.8G5030160K9439M0203N0986O0874O9064P6687Q5038R4080J03200J10161J16158
3461.2G5866050J27559J38545J41579J45024J51647J55305J57679J62851J67841J69772
3481.6G7383852J73277J77627J75232J73521J81812J86032J81461J82950J89811J93560
3502G9199135J96141J97614J93107J88404J91051J93852J95378K05404K16478K15351
$$ plain form
3355.2 83093923 82736045 82380629 82032013 81691873 81359154 81033272 80714846 80405104 80105394 79815787
3375.5 79815787 79534930 79261732 78995919 78737801 78488278 78246737 78011489 77782750 77561730 77348465
3395.9 77348465 77142882 76945716 76757520 76575899 76397300 76224786 76065081 75919336 75783622 75654328
3416.3 75654328 75533396 75425452 75330871 75248009 75176597 75117815 75072294 75037599 75015950 75013781 75030160
3438.8 75030160 75059599 75099802 75150788 75211662 75280726 75357413 75442451 75536531 75639731 75749892 75866050
3461.2 75866050 75993609 76132154 76273733 76418757 76570404 76725709 76883388 77046239 77214080 77383852
3481.6 77383852 77557129 77734756 77909988 78083509 78265321 78451353 78632814 78815764 79005575 79199135
3502 79199135 79395276 79592890 79785997 79974401 80165452 80359304 80554682 80760086 80976564 81191915
3522.4H1191915K15370K25985K31629K23685K17539K26271K33656K33352K41059K53511
3542.8H3493972K61539K66624K67905K53510K28143K35152K68215K85280K92927L05384
3563.2H6158651L09360L12191L26074L17698K79725K79915L11661L06249K93129L33476
3583.6H9228129L75128L79843L83776L82066L55303L35849L28964L11368L07638L23200
3604I2711264L26419L38232L68345L68255K88052K39509K84970K99162K73955K68119
3624.4I5766282K69699K67708K57630J93280J03920J12766J89269J79613R9623J29342
3644.8I7569132K23583K36767K23714K00516J29557P7033N5343m4489j07342O926J39719
3667.2I8710459J57828J29842R9445M3273L5196P4333P2599K7680P910j0956m1932
$$ plain form
3522.4 81191915 81407285 81633270 81864899 82088584 82306123 82532394 82766050 82999402 83240461 83493972
3542.8 83493972 83755511 84022135 84290040 84543550 84771693 85006845 85275060 85560340 85853267 86158651
3563.2 86158651 86468011 86780202 87106276 87423974 87703699 87983614 88295275 88601524 88894653 89228129
3583.6 89228129 89603257 89983100 90366876 90748942 91104245 91440094 91769058 92080426 92388064 92711264
3604 92711264 93037683 93375915 93744260 94112515 94400567 94640076 94925046 95224208 95498163 95766282
3624.4 95766282 96035981 96303689 96561319 96754599 96858519 96971285 97160554 97340167 97439790 97569132
3644.8 97569132 97792715 98029482 98253196 98453712 98583269 98660302 98715645 98671156 98563814 98570740 98710459
3667.2 98710459 98868287 98998129 99097574 99140847 99176043 99250376 99322975 99350655 99358565 99347609 99305677
3689.6I9305677K0570R6035O0767o950j9211j6635r954M0299P3635N9712L5340K7179
3714.1I9666464K4546J1670l3069q4847p3898P713P6753M0090J9509K6047k1326k1232
3738.6I9638420N9420J10644P2003O199j0246J9556O1393m6486M2587r3114l7879l7431
3763.1I9785066j06150o7473J6159J3769j1856L392K2739M494l0130m4364m1091m6510
3787.5I9498045k7954k1887l7360J7392Q4049P5096K4819J0383l498l5686j5497J4091
3812I9581993L731j3727J2994K1654l070j633J0985p361k5701J3494M2117L2341k7370
3838.5I9640447r6738k5541N9211O3795J5211l8665m0424j1617K873L6073P5656P6669
3863I9756950j3888j39004j07401K1356O0457M1556j4537k3687J9920O938l1448k9957
$$ plain form
3689.6 99305677 99326247 99422282 99483049 99476099 99456888 99440253 99430299 99470598 99544233 99603945 99639285 99666464
3714.1 99666464 99691010 99702680 99669611 99584764 99510866 99518579 99595332 99635422 99654931 99680978 99659652 99638420
3738.6 99638420 99697840 99808484 99880487 99886686 99876440 99895996 99957389 99910903 99953490 99860376 99822497 99785066
3763.1 99785066 99678916 99611443 99627602 99641371 99629515 99632907 99655646 99660140 99630010 99585646 99544555 99498045
3787.5 99498045 99470091 99448204 99410844 99428236 99512285 99587381 99612200 99622583 99619085 99583399 99567902 99581993
3812 99581993 99585724 99571997 99584991 99606645 99603575 99601942 99612927 99605566 99579865 99593359 99635476 99667817 99640447
3838.5 99640447 99543709 99518168 99577379 99641174 99656385 99617720 99577296 99565679 99568552 99604625 99680281 99756950
3863 99756950 99743062 99604058 99496657 99518013 99578470 99620026 99605489 99581802 99601722 99608660 99577212 99547255
3887.5I9547255k0421o5J6111K5410L8599K8879K2608P069j5247J0044K8669q064m8477
3914I9632370o7037o4403j9043L7986N3101L6091P618j6290j7810n108M023P033J4216
3940.5I9602747J9103O926j114J6200L5423L3450J7327K778M35k509j1224q088J603
3967I9713057N549Q435J2391J5098K0355K8104L0982K9242K5922K1226J7660J7029
3991.5I9945050J7560J8281J9109
3997.6A00000000
$$ plain form
3887.5 99547255 99526834 99526769 99542880 99568290 99606889 99635768 99658376 99665445 99650198 99660242 99688911 99680847 99632370
3914 99632370 99565333 99500930 99481887 99519873 99572974 99609065 99616683 99600393 99582583 99577475 99581498 99588531 99602747
3940.5 99602747 99621850 99628776 99627662 99643862 99679285 99712735 99730062 99732840 99733275 99730766 99719542 99711454 99713057
3967 99713057 99718606 99727041 99739432 99754530 99774885 99802989 99833971 99863213 99889135 99910361 99928021 99945050
3991.5 99945050 99962610 99980891 100000000
3997.6 100000000
##END=$$ End of the data block
