##TITLE=Acucar - LPD-53c $$ Begin of the data block
##JCAMP-DX=5.00 $$ ACD/SpecManager v 10.08
##SPECTROMETER/DATA SYSTEM=Alpha
##DATE=01 Dec 2014 08:11:42
##DATA TYPE=INFRARED SPECTRUM
##DATA CLASS=XYDATA
##ORIGIN=
##OWNER=
##NPOINTS=1765
##FIRSTX=399.76428223
##LASTX=3997.64306641
##MAXX=3997.64306641
##MINX=399.76428223
##MAXY=1.00218523
##MINY=0.65464514
##XFACTOR=1.0000000000
##YFACTOR=0.000000010000000
##FIRSTY=1.00000000
##DELTAX=2.03961372
##XUNITS=1/CM
##YUNITS=ARBITRARY UNITS
##XYDATA=(X++(Y..Y))
399.8A00000000q4382j29009j50483o5661q911m4834o5887k5493J4919j9986q1694
$$ 100000000 99915618 99786609 99636126 99570465 99561554 99516720 99450833 99425340 99440259 99420273 99338579
422.2I9338579n8675k4163q2517j24592m5907L4672K1011k2287j490N5558L9112n1832
$$ 99338579 99279904 99255741 99173224 99048632 99002725 99037397 99058408 99036121 99034631 99090189 99129301 99077469
446.7I9077469q5193m0376m5663r3925r3907n8770o9923j46407j64562q1080m8489
$$ 99077469 98992276 98951900 98906237 98812312 98718405 98659635 98589712 98443305 98278743 98197663 98149174
469.1I8149174j36393j86252q7089l6293j33932j72931n8996j872j11848j77336p3981
$$ 98149174 98012781 97826529 97739440 97703147 97569215 97396284 97337288 97335416 97223568 97046232 96972251
491.5I6972251J812r4831j73497r8849n0658j45095j97518r1422j5986j23018k22194
$$ 96972251 96974063 96879232 96705735 96606886 96556228 96411133 96213615 96122193 96106207 95983189 95760995
514I5760995j48463o4510j37133k11107j32376k6113p4411j70755j05995P618n3394
$$ 95760995 95612532 95548022 95410889 95199782 95067406 95041293 94966882 94796127 94690132 94697750 94644356
536.4I4644356j68044j22225l9965j17409k48432k28888j24848j40154k18672j48618
$$ 94644356 94476312 94354087 94314122 94196713 93948281 93719393 93594545 93454391 93235719 93087101
556.8I3087101L7432J20145P1871P1782J59019J64271M3505p707P6944J12551J6624
$$ 93087101 93124533 93244678 93316549 93388331 93547350 93711621 93755126 93747419 93824363 93936914 93953538
579.3I3953538l4934N9014J44202Q9943P904N1731J12819K0916p8840j0961Q7440M8804
$$ 93953538 93918604 93977618 94121820 94211763 94219667 94271398 94384217 94405133 94326293 94315332 94402772 94451576
603.7I4451576j5324P0119K10238J82288M9150N1088J63841J50329K5713K6113J29306
$$ 94451576 94436252 94506371 94716609 94898897 94948047 94999135 95162976 95313305 95339018 95365131 95494437
626.2I5494437P3302j17898j50317j7190k092j17618q8018P3719N6380j49018j95628
$$ 95494437 95567739 95449841 95299524 95282334 95280242 95162624 95074606 95148325 95204705 95055687 94860059
648.6I4860059j0908N3299j17564k17331j03193j4556p4494j17641J3572L71748L88479
$$ 94860059 94849151 94902450 94784886 94567555 94464362 94449806 94375312 94257671 94271243 94642991 95031470
671I5031470J95849K23601K97624J91468J07425K31326L34137J86712l0160p2086j04719
$$ 95031470 95227319 95450920 95748544 95940012 96047437 96278763 96612900 96799612 96769452 96697366 96592647
693.5I6592647l77828o76310o07175k52843J4145J36178K99621M58002M14103K42561
$$ 96592647 96214819 95538509 94931334 94678491 94692636 94828814 95128435 95586437 96000540 96243101
713.9I6243101K06572L10022L18748K07036J88446K89387K88147J34712O1250J48284
$$ 96243101 96449673 96759695 97078443 97285479 97473925 97763312 98051459 98186171 98247421 98395705
734.3I8395705J70362K4855p2711l46M0430q8483k00814j52612q9753j49846k01672
$$ 98395705 98566067 98590922 98518211 98517865 98558295 98469812 98268998 98116386 98026633 97876787 97675115
756.7I7675115j00517K7561J9550m6968k0671L4439m8083k17914k73246k06548j94198
$$ 97675115 97574598 97602159 97621709 97574741 97554070 97588509 97540426 97322512 97049266 96842718 96648520
779.1I6648520k46376j94794k7638Q2695P9096R1743J61177J09333j71662n06341o55514
$$ 96648520 96402144 96207350 96179712 96262407 96341503 96433246 96594423 96703756 96532094 96025753 95370239
801.6I5370239n89734m25643k31320l6591P0113M9502L9547J84369M08221N15550M86606
$$ 95370239 94780505 94354862 94123542 94086951 94157064 94206566 94246113 94430482 94838703 95354253 95840859
824I5840859M64660M53920L27879J10447k9397n0467q4263j71119j60492J7494K03389
$$ 95840859 96305519 96759439 97087318 97197765 97168368 97117901 97033638 96862519 96702027 96719521 96922910
846.4I6922910K78169L46196M84919N61047M74608L53205L29989L08872J58608j1957
$$ 96922910 97201079 97547275 98032194 98593241 99067849 99421054 99751043 100059915 100218523 100206566
866.8A00206566m2081j2803o9344j33610n8591O7126M2737p1120j08898n7661r5094
$$ 100206566 100164485 100151682 100082338 99948728 99890137 99957263 100000000 99928880 99819982 99762321 99667227
889.3I9667227k07752k06810q2850l2539j11931j53232r4360q3393j65736j73361m4435
$$ 99667227 99459475 99252665 99169815 99137276 99025345 98872113 98777753 98694360 98528624 98355263 98310828
911.7I8310828L4720l6454r0099j2654N0420j0014n6278K6720J05441M0680n0539j7130
$$ 98310828 98345548 98309094 98218995 98206341 98256761 98246747 98190469 98217189 98322630 98363310 98312771 98295641
936.2I8295641M3821j0925q9145l9637N9843M8107k3490p981M2498l7045k21103l24845
$$ 98295641 98339462 98328537 98239392 98199755 98259598 98307705 98284215 98276234 98318732 98281687 98060584 97735739
960.7I7735739l30228l98713n53835o65605p24655q43203r92137r87369p73615n08886
$$ 97735739 97405511 97006798 96452963 95787358 95062703 94219500 93227363 92239994 91466379 90957493
981.1I0957493l18635j59162M828P8511P457j01424j48564j90532l08848m42147m93086
$$ 90957493 90638858 90479696 90484524 90563035 90570492 90469068 90320504 90129972 89821124 89378977 88885891
1003.5H8885891n11753o03145p31427p91228p95448q04871p38132m98420k25973j40309
$$ 88885891 88374138 87770993 87039566 86248338 85452890 84648019 83909887 83411467 83185494 83045185
1023.9H3045185k13051k47556j78570r7334n5343J2028J42604K41941K19393J25426
$$ 83045185 82832134 82584578 82406008 82308674 82253331 82265359 82407963 82649904 82869297 82994723
1044.3H2994723L5465o9392k04402k78723k04408n0563N1355R7645J58483J98710J36214
$$ 82994723 83030188 82960796 82756394 82477671 82273263 82222700 82274055 82371700 82530183 82728893 82865107
1066.7H2865107K1273j8144L2109R2382J59061K93403M74769N99331O35713O43599
$$ 82865107 82886380 82868236 82900345 82992727 83151788 83445191 83919960 84519291 85155004 85798603
1087.1H5798603O21826M95964K88343J37318R7537P7825K0475j8329j6057l8153r9373
$$ 85798603 86420429 86916393 87204736 87342054 87439591 87517416 87537891 87519562 87503505 87465352 87365979
1109.6H7365979j13255m0906L7807O5106R0188J58065K10077J87540J55157J91861
$$ 87365979 87252724 87211818 87249625 87314731 87404919 87562984 87773061 87960601 88115758 88307619
1129.9H8307619K30694J78927Q6963L5131on9789r9015m5449R7311K74765M75717P09802
$$ 88307619 88538313 88717240 88804203 88839334 88839328 88779539 88680524 88635075 88732386 89007151 89482868 90192670
1154.4I0192670R20027J023287J010728R32955Q11398O38277M45324K80088J32167
$$ 90192670 91112697 92135984 93146712 94079667 94891065 95529342 95974666 96254754 96386921
1172.8I6386921m4304k45034l99042m53907m22001l42488k57295k05589k08300k51192
$$ 96386921 96342617 96097583 95698541 95244634 94822633 94480145 94222850 94017261 93808961 93557769
1193.2I3557769k94447l19648l35788l38662l07751k26062j00565L2049J24240J40256
$$ 93557769 93263322 92943674 92607886 92269224 91961473 91735411 91634846 91666895 91791135 91931391
1213.6I1931391P7992l0398j35785k06292k44355k58225k57510k54971k52688k50626
$$ 91931391 92009383 91978985 91843200 91636908 91392553 91134328 90876818 90621847 90369159 90118533
1234I0118533k50691k46388k30902k06989j81085j57362j33288j04153o7789k7799
$$ 90118533 89867842 89621454 89390552 89183563 89002478 88845116 88711828 88607675 88539886 88512087
1254.4H8512087J1170M9400Q1653R7990J01923J09762J23334J31578J35988J43355
$$ 88512087 88523257 88572657 88654310 88752300 88854223 88963985 89087319 89218897 89354885 89498240
1274.8H9498240J46007J35732J22285J15973J07985Q5861N5253K9523J0317n543r984
$$ 89498240 89644247 89779979 89902264 90018237 90126222 90212083 90267336 90296859 90307176 90301633 90291649
1297.2I0291649O372L4356N6452P8892J11264J35219J29956J00327O4611K4510k5237
$$ 90291649 90298021 90332377 90388829 90467721 90578985 90714204 90844160 90944487 91009098 91033608 91008371
1319.6I1008371p3314j09106j44374j97858k63846l14855l47442l73089l74687l08305
$$ 91008371 90935057 90825951 90681577 90483719 90219873 89905018 89557576 89184487 88809800 88501495
1340H8501495j67346l6752M6188J15543J79261K15799K21216K07782J70088R7877J5729
$$ 88501495 88334149 88297397 88343585 88459128 88638389 88854188 89075404 89283186 89453274 89551151 89566880
1362.5H9566880M18M7147Q7374J14894J37765J48153J24955O0564k4366o1691o592
$$ 89566880 89567298 89614445 89701819 89816713 89954478 90102631 90227586 90288150 90263784 90202093 90195501
1384.9I0195501Q4680J53160K00212K19143J93649J24806L4142o2871j81335l17920
$$ 90195501 90280181 90433341 90633553 90852696 91046345 91171151 91205293 91142422 90961087 90643167
1405.3I0643167l87811m38208n30517n74278n55283o17165o89363m09824r358K81251
$$ 90643167 90255356 89817148 89286631 88712353 88157070 87539905 86850542 86440718 86431360 86712611
1425.7H6712611M07833L59469K07234M5740j41805k53588j71912j20467j35338j47760
$$ 86712611 87120444 87479913 87687147 87732887 87591082 87337494 87165582 87045115 86909777 86762017
1446.1H6762017j31983m6050P4249J99539L70866N24318M78745M40925N16409N96165
$$ 86762017 86630034 86583984 86658233 86857772 87228638 87752956 88231701 88672626 89189035 89785200
1466.5H9785200N80132N88382P05915P57254O80577N93543N23466M60518L51822K18725
$$ 89785200 90365332 90953714 91659629 92416883 93097460 93691003 94214469 94674987 95026809 95245534
1486.9I5245534O4802m5001l934R2423J32841O3014m8685j62047n01496j209575j088285
$$ 95245534 95310336 95265335 95261401 95353824 95486665 95549679 95500994 95338947 94837451 93627876 92539591
1509.3I2539591m26728K14589R74720J487661J363945J070529P26283M14973K60651
$$ 92539591 92112863 92327452 93302172 94789833 96153778 97224307 97950590 98365563 98626214
1527.7I8626214J58400R8806M4310J0670k6501j27422j85138j45948j22887q8919p1591
$$ 98626214 98784614 98883420 98927730 98938400 98911899 98784477 98599339 98453391 98330504 98241585 98169994
1550.1I8169994o1953m3869k5123p9662j44362o8140q1897j38426k28655l28642k83683
$$ 98169994 98108041 98064172 98039049 97959387 97815025 97746885 97664988 97526562 97297907 96969265 96685582
1572.6I6685582k64686l30752k37173j39987j66393k21687k85822l53146m20129m90320
$$ 96685582 96420896 96090144 95852971 95712984 95546591 95324904 95039082 94685936 94265807 93775487
1593I3775487n87112o84190p57426q09502q13705p77584p64799p75880o82706m99272
$$ 93775487 93188375 92504185 91746759 90937257 90123552 89345968 88581169 87805289 87122583 86623311
1613.4H6623311m41712n28884m56798m52590o16354o25276n54800m95476l53700k89976
$$ 86623311 86181599 85652715 85195917 84743327 84126973 83501697 82946897 82451421 82097721 81807745
1633.7H1807745l77429l08675j75756j52933j64020k59930l03573j56891j90377l01600
$$ 81807745 81430316 81121641 80945885 80792952 80628932 80369002 80065429 79908538 79718161 79416561
1654.1G9416561l7515J24353K02257L12036M18669M71759O00958Q07958Q54308R75168
$$ 79416561 79379046 79503399 79705656 80017692 80436361 80908120 81509078 82317036 83171344 84146512
1674.5H4146512J153391J137769J109422J223498J491285J226168Q81470P70378O04480
$$ 84146512 85299903 86437672 87547094 88770592 90261877 91488045 92369515 93139893 93744373
1692.9I3744373N24831M79931L79431L60215L33577L05617K83563K12669J67245J39421
$$ 93744373 94269204 94749135 95128566 95488781 95822358 96127975 96411538 96624207 96791452 96930873
1713.3I6930873R6822N8019O9476J02370J03713J02460J15555J44989J47122J34116
$$ 96930873 97027695 97085714 97155190 97257560 97361273 97463733 97579288 97724277 97871399 98005515
1733.7I8005515J40810J47862J54239J39433J22678J24145J24239R7651P3480P2271
$$ 98005515 98146325 98294187 98448426 98587859 98710537 98834682 98958921 99056572 99130052 99202323
1754.1I9202323P2533N2714K7770L1161M9907M0919J2064Q505K4206K8700J4036R680
$$ 99202323 99274856 99327570 99355340 99386501 99436408 99477327 99489391 99497896 99522102 99550802 99564838 99574518
1778.6I9574518J9777J2147j8501k4235J883k92l3164l0195Q434K5141J1700R722M0430
$$ 99574518 99594295 99606442 99587941 99563706 99565589 99565297 99532133 99501938 99510372 99535513 99547213 99556935 99597365
1805.1I9597365O3240M7708K8437M4340O2645M0262J2541K2048M1896K7228m697m173
$$ 99597365 99660605 99708313 99736750 99781090 99843735 99883997 99896538 99918586 99960482 99987710 99983013 99978840
1829.6I9978840K2042J7619j4817j7679Q440N555j4806j8662J9842K2769r143j5849
$$ 99978840 100000882 100018501 100003684 99986005 99994445 100000000 99985194 99966532 99986374 100009143 100000000 99984151
1854I9984151L898Q023j4836k5492p374j138k8807l8487r286N13k4504m5150l8082
$$ 99984151 99988049 99996072 99981236 99955744 99948370 99947232 99918425 99879938 99870652 99871165 99846661 99801511 99763429
1880.5I9763429k9093m2534n8859o1429n4276n9199q2725q8251p0816o5220o7776n3460
$$ 99763429 99734336 99691802 99632943 99571514 99517238 99458039 99375314 99287063 99216247 99151027 99083251 99029791
1905I9029791k7257p731L028J7399L3319M0084L9762L6335L4511L6049L0613J8305
$$ 99029791 99002534 98994803 98997831 99015230 99048549 99088633 99128395 99164730 99199241 99235290 99265903 99284208
1929.5I9284208J1790J1551Q756J919j174r36r42n048j3220j1951l082l344j4883j9997
$$ 99284208 99295998 99307549 99316305 99318224 99317050 99316114 99315172 99310124 99296904 99284953 99281871 99278527 99263644 99243647
1958.1I9243647j3322j4072k6471l2294j9592q750j9449l2144k9755k7758m2647n6905
$$ 99243647 99230325 99216253 99189782 99157488 99137896 99129146 99109697 99077553 99047798 99020040 98977393 98920488
1982.5I8920488n1427m4399n3895o7699o7400n9462o8349q7815r1350q4764r3359j13416
$$ 98920488 98869061 98824662 98770767 98703068 98635668 98576206 98507857 98420042 98328692 98243928 98150569 98037153
2007I8037153j17862j09851j15210j36000j50502j48332j51431j72371j91718j99622
$$ 98037153 97919291 97809440 97694230 97558230 97407728 97259396 97107965 96935594 96743876 96544254
2027.4I6544254k14732k48963k88182l16781l42500l82829m30381m62866m89956n30678
$$ 96544254 96329522 96080559 95792377 95475596 95133096 94750267 94319886 93857020 93367064 92836386
2047.8I2836386n74017o05827o29026o54149o83469p02828p03472p05605p15977p19422
$$ 92836386 92262369 91656542 91027516 90373367 89689898 88987070 88283598 87577993 86862016 86142594
2068.2H6142594p20758p31253p61569q09270q54224q92919r30906r50288r18031q27432
$$ 86142594 85421836 84690583 83929014 83119744 82265520 81372601 80441695 79491407 78573376 77745944
2088.6G7745944o99240n45883l69674j75172K0826K01017L70097N27405O48141P10124
$$ 77745944 77046704 76500821 76131147 75955975 75976801 76177818 76547915 77075320 77723461 78433585
2109G8433585P21073P07758O80494O37633N99199N95546O22267O48534O66326O93011
$$ 78433585 79154658 79862416 80542910 81180543 81779742 82375288 82997555 83646089 84312415 85005426
2129.4H5005426P24268P32065P14469O97058O86574O57749O02889N52416N20766M81021
$$ 85005426 85729694 86461759 87176228 87873286 88559860 89217609 89820498 90372914 90893680 91374701
2149.8I1374701M21465L71778L50588L34841K99573K63053K53964K54911K31940K01374
$$ 91374701 91796166 92167944 92518532 92853373 93152946 93415999 93669963 93924874 94156814 94358188
2170.2I4358188J98895K08234J94252J67799J61451J69802J60682J35338J27054J38169
$$ 94358188 94557083 94765317 94959569 95127368 95288819 95458621 95619303 95754641 95881695 96019864
2190.6I6019864J37806J19370J09357J17510J16605R6196Q8435J02985J07843R4134
$$ 96019864 96157670 96277040 96386397 96503907 96620512 96716708 96805143 96908128 97015971 97110105
2211I7110105Q7839J01989J15133J09559J03366J15490J32943J39302J41406J50674
$$ 97110105 97197944 97299933 97415066 97524625 97627991 97743481 97876424 98015726 98157132 98307806
2231.4I8307806J59139J48600J26493J17016J17457J07699Q9175P9203P8433P3773
$$ 98307806 98466945 98615545 98742038 98859054 98976511 99084210 99173385 99252588 99331021 99404794
2251.8I9404794O0678M9507M9853N2220M4513L5339L6514M0919L6824K7436K5546L0476
$$ 99404794 99465472 99514979 99564832 99617052 99661565 99696904 99733418 99774337 99811161 99838597 99864143 99894619
2276.2I9894619L1728K9909K6554J7190N853k265o938q678r251j3500j9265k0390j9354
$$ 99894619 99926347 99956256 99982810 100000000 100005853 100003588 99996650 99987972 99978721 99965221 99945956 99925566 99906212
2302.7I9906212k5248l7981m3946l3438j8007k1297m9680p8064q0872o3544n0468n4282
$$ 99906212 99880964 99842983 99799037 99765599 99747592 99726295 99676615 99598551 99517679 99454135 99403667 99349385
2327.2I9349385n8126m4000l1102l5053k8450j1962m691L1263J25032J51438K5183
$$ 99349385 99291259 99247259 99216157 99181104 99152654 99140692 99136001 99167264 99292296 99443734 99468917
2349.7I9468917j43159k23493j91391j27995o8915n609N7215J02407J24043J40333
$$ 99468917 99325758 99102265 98910874 98782879 98713964 98708355 98765570 98867977 98992020 99132353
2370.1I9132353J53911J45680J27441J26981J32192J06859N6600J7983O211j311j8156
$$ 99132353 99286264 99431944 99559385 99686366 99818558 99925417 99982017 100000000 100006211 100004900 99986744
2392.5I9986744k9147j9508j0312k2221l5226k6822j5050k4086l9214l4583k1815k7472
$$ 99986744 99957597 99938089 99927777 99905556 99870330 99843508 99828458 99804372 99765158 99730575 99708760 99681288
2417I9681288m2945m1032k7847l0953m4048l9285k3979k4241l4881l2187j6051j0973
$$ 99681288 99638343 99597311 99569464 99538511 99494463 99455178 99431199 99406958 99372077 99339890 99323839 99312866
2441.4I9312866k3353k5791q363p93j4811k1249q411k503j5062k4951j5693l177q166
$$ 99312866 99289513 99263722 99255359 99254566 99239755 99218506 99210095 99207592 99192530 99167579 99151886 99148709 99140543
2467.9I9140543j9866j6773o134q934j8084j4192j61J222j2344j4419j758K575o217
$$ 99140543 99120677 99103904 99097770 99088836 99070752 99056560 99056399 99057621 99045277 99030858 99029100 99031675 99025458
2494.5I9025458p123N907R829q82o128J121O491L75m136L695R889K092r012n466O801
$$ 99025458 99018335 99024242 99034071 99033189 99027061 99028182 99034673 99035048 99030912 99034607 99044496 99046588 99037576 99032110 99038911
2525.1I9038911M864o819n633M858M059p039p892L868O855n728j2559q70J0371M721
$$ 99038911 99043775 99036956 99031323 99036181 99040240 99033201 99025309 99029177 99036032 99030304 99017745 99016875 99027246 99031967
2553.6I9031967m405q46N483q34p862p63M733n836j4805p999q47p575j6773r412M542
$$ 99031967 99027562 99026716 99032199 99031365 99023503 99022740 99027473 99021637 99006832 98998833 98997986 98990411 98973638 98964226 98968768
2584.2I8968768K15j5748j6457l332l159j6808j8215m506j777j6719k1934r513m703
$$ 98968768 98968983 98953235 98936778 98933446 98930287 98913479 98895264 98890758 98888981 98872262 98850328 98840815 98836112
2610.7I8836112j6099k4212j8102j4030k5011l4350l0738l0887m0054l6156j6475n216
$$ 98836112 98820013 98795801 98777699 98763669 98738658 98704308 98673570 98642683 98602629 98566473 98549998 98544782
2635.2I8544782j4311l1149l4016k6298k8706l7360l6245k8164k8264l6478l5888k6703
$$ 98544782 98530471 98499322 98465306 98439008 98410302 98372942 98336697 98308533 98280269 98243791 98207903 98181200
2659.7I8181200l0178m1592l6770k5481k7263l3885l1746k3603k5446l7580m1008l2276
$$ 98181200 98151022 98109430 98072660 98047179 98019916 97986031 97954285 97930682 97905236 97867656 97826648 97794372
2684.1I7794372k5922l0136l6258l1608k2900k3496k5517k1643k1386k7627l1822l0417
$$ 97794372 97768450 97738314 97702056 97670448 97647548 97624052 97598535 97576892 97555506 97527879 97496057 97465640
2708.6I7465640k8819k8872k9707k9421k2799j5568j7321k4093k7114k6125k5892k5379
$$ 97465640 97436821 97407949 97378242 97348821 97326022 97310454 97293133 97269040 97241926 97215801 97189909 97164530
2733.1I7164530j8824j2612j7887k6518k4420j5533j5933k8515l6883l3325l0434l4958
$$ 97164530 97145706 97133094 97115207 97088689 97064269 97048736 97032803 97004288 96967405 96934080 96903646 96868688
2757.6I6868688l8976l8272l6609l9047m2540m0191l7491m4841n7864o2007n9789o3575
$$ 96868688 96829712 96791440 96754831 96715784 96673244 96633053 96595562 96550721 96492857 96430850 96371061 96307486
2782I6307486o7162n5307m2868n5748p6556p6318o6197p3618r0855r2578q5074q1760
$$ 96307486 96240324 96185017 96142149 96086401 96009845 95933527 95867330 95793712 95702857 95610279 95525205 95443445
2806.5I5443445q3071r1993r9254r8705j03092j09470j11616j23525j52147j84369
$$ 95443445 95360374 95268381 95169127 95070422 94967330 94857860 94746244 94622719 94470572 94286203
2826.9I4286203k11620k46572k98989l53909l94088m29028m55451m45813l99208l35425
$$ 94286203 94074583 93828011 93529022 93175113 92781025 92351997 91896546 91450733 91051525 90716100
2847.3I0716100k70009k05028j37610q0829m8912m0907n1385p6341j08958j39558j48970
$$ 90716100 90446091 90241063 90103453 90022624 89973712 89932805 89881420 89805079 89696121 89556563 89407593
2869.7H9407593j35493j32501j36835j09446o4927m1574l9167m7314o1047p6967r9099
$$ 89407593 89272100 89139599 89002764 88893318 88828391 88786817 88747650 88700336 88639289 88562322 88463223
2892.2H8463223j30296j70547k14648k47925k69181k90257l09938l17192l12734l08662
$$ 88463223 88332927 88162380 87947732 87699807 87430626 87140369 86830431 86513239 86200505 85891843
2912.6H5891843l05993k90668k55072k03645j38295n7411L5876J22869J86384K41429
$$ 85891843 85585850 85295182 85040110 84836465 84698170 84640759 84676635 84799504 84985888 85227317
2933H5227317L07321L71576M21130M61441M80277M61471M18913L84313L65359L32474
$$ 85227317 85534638 85906214 86327344 86788785 87269062 87730533 88149446 88533759 88899118 89231592
2953.4H9231592K89333K69318K68859K69591K61110K49130K49821K54637K50846K35677
$$ 89231592 89520925 89790243 90059102 90328693 90589803 90838933 91088754 91343391 91594237 91829914
2973.8I1829914K09772J86420J56563J04309N9360M5889M7589N7912O4557M7529J8704
$$ 91829914 92039686 92226106 92382669 92486978 92546338 92592227 92639816 92697728 92762285 92809814 92828518
2996.2I2828518k4587p9614j18404j45471j64015j59430j36602j19156j20914j30629
$$ 92828518 92803931 92724317 92605913 92460442 92296427 92136997 92000395 91881239 91760325 91629696
3016.6I1629696j36042j30605r8306l2396N8294J49232J96481J82318J22762N8901
$$ 91629696 91493654 91363049 91264743 91232347 91290641 91439873 91636354 91818672 91941434 92000335
3037I2000335K6197o295o8324j29635j53678j37580j06704o7603k0725P081J9193M0561
$$ 92000335 92026532 92020237 91951913 91822278 91668600 91531020 91424316 91356713 91335988 91343069 91362262 91402823
3061.5I1402823N7381M4692j484n2834p4899p3344o9356p7659j05500j29437j34629
$$ 91402823 91460204 91504896 91503412 91450578 91375679 91302335 91232979 91155320 91049820 90920383 90785754
3083.9I0785754j31417j12009r2727j02263j04785p0447m2236o7687j16086j21021
$$ 90785754 90654337 90542328 90449601 90347338 90242553 90172106 90129870 90062183 89946097 89825076
3104.3H9825076r4837j04094j44934j45310j13732j24985j69838k03466k19279k10935
$$ 89825076 89730239 89626145 89481211 89335901 89222169 89097184 88927346 88723880 88504601 88293666
3124.7H8293666j83708j56611j44392j50425j49482j27387j17707j43498j67048j53625
$$ 88293666 88109958 87953347 87808955 87658530 87509048 87381661 87263954 87120456 86953408 86799783
3145.1H6799783j21242r2918q7357j17123j46216j42950j35010j35541j29247j24788
$$ 86799783 86678541 86585623 86498266 86381143 86234927 86091977 85956967 85821426 85692179 85567391
3165.5H5567391j35827j49852j52099j50109j52295j59169j61600j56700j61016j74505
$$ 85567391 85431564 85281712 85129613 84979504 84827209 84668040 84506440 84349740 84188724 84014219
3185.9H4014219j76960j68801j71208j85066j90217j79332j66840j69742j80208j78999
$$ 84014219 83837259 83668458 83497250 83312184 83121967 82942635 82775795 82606053 82425845 82246846
3206.3H2246846j73503j75053j76287j72996j65493j65301j77646j80149j67423j60093
$$ 82246846 82073343 81898290 81722003 81549007 81383514 81218213 81040567 80860418 80692995 80532902
3226.7H0532902j58756j43999j32829j58763j90163j82950j53923j33264j27656j36983
$$ 80532902 80374146 80230147 80097318 79938555 79748392 79565442 79411519 79278255 79150599 79013616
3247.1G9013616j51390j49912j37651j34086j38062j36990j31947j32107j26315j02227
$$ 79013616 78862226 78712314 78574663 78440577 78302515 78165525 78033578 77901471 77775156 77672929
3267.5G7672929r0355j18232j44046j41424j38104j40250j37359j28651j23185j23679
$$ 77672929 77582574 77464342 77320296 77178872 77040768 76900518 76763159 76634508 76511323 76387644
3287.8G6387644j20878j21308j32721j46318j56897j54013j33460j20444j37597j71965
$$ 76387644 76266766 76145458 76012737 75866419 75709522 75555509 75422049 75301605 75164008 74992043
3308.2G4992043j93095j94353j85710j79089j78748j78087j75762j77181j90675k07084
$$ 74992043 74798948 74604595 74418885 74239796 74061048 73882961 73707199 73530018 73339343 73132259
3328.6G3132259k10768k04939j91838j81716j98096k24620k28626k23750k17181k00767
$$ 73132259 72921491 72716552 72524714 72342998 72144902 71920282 71691656 71467906 71250725 71049958
3349G1049958k08854k42818k49183k25568k07942k09499k08777j84053j71679k04331
$$ 71049958 70841104 70598286 70349103 70123535 69915593 69706094 69497317 69313264 69141585 68937254
3369.4F8937254k45005k41762k04510j80030j75523j78284j75875j58668j22392q6612
$$ 68937254 68692249 68450487 68245977 68065947 67890424 67712140 67536265 67377597 67255205 67168593
3389.8F7168593j04659j55938j53738r5761o9040j21957j74690j43528q8280p5304
$$ 67168593 67063934 66907996 66754258 66658497 66589457 66467500 66292810 66149282 66061002 65985698
3410.2F5985698q3542r6411j00970p9042n8979n5182l8439q619Q429K747O801K3580
$$ 65985698 65902156 65805745 65704775 65625733 65566754 65511572 65473133 65464514 65472943 65475690 65482491 65506071
3434.7F5506071O997k6601k1768J5354M5336N6189N8621O5834P6437R2321J15109J26415
$$ 65506071 65513068 65486467 65464699 65480053 65525389 65581578 65640199 65706033 65782470 65874791 65989900 66116315
3459.2F6116315J14423J20020J65880J85782J37490Q3839R2918J38211J78314J81979
$$ 66116315 66230738 66350758 66516638 66702420 66839910 66923749 67016667 67154878 67333192 67515171
3479.6F7515171J46538J42115J73950J80757J80024J98054K08348K10637K10047K12109
$$ 67515171 67661709 67803824 67977774 68158531 68338555 68536609 68744957 68955594 69165641 69377750
3500F9377750K12300J88720J74779J99741K37197K61253K51263K25532K25705K55037
$$ 69377750 69590050 69778770 69953549 70153290 70390487 70651740 70903003 71128535 71354240 71609277
3520.4G1609277K83539K64257K27076K33066K65002K94238L11769K93660K68072K93719
$$ 71609277 71892816 72157073 72384149 72617215 72882217 73176455 73488224 73781884 74049956 74343675
3540.8G4343675L27623L11971K69061K62571K84576K97070L07542L22729L34913L33505
$$ 74343675 74671298 74983269 75252330 75514901 75799477 76096547 76404089 76726818 77061731 77395236
3561.1G7395236L12907K95502L32648L83341L73125L50857L60292L85189M10265M26250
$$ 77395236 77708143 78003645 78336293 78719634 79092759 79443616 79803908 80189097 80599362 81025612
3581.5H1025612M17465L86632L76189M11498M25226M21649M33850M50271M54516M48882
$$ 81025612 81443077 81829709 82205898 82617396 83042622 83464271 83898121 84348392 84802908 85251790
3601.9H5251790M31472M08304M17978M38738M36955M28379M00668L94464M26292M02719
$$ 85251790 85683262 86091566 86509544 86948282 87385237 87813616 88214284 88608748 89035040 89437759
3622.3H9437759L43591L10820L51382M06158L70079L48508L40039L22473L18980L11083
$$ 89437759 89781350 90092170 90443552 90849710 91219789 91568297 91908336 92230809 92549789 92860872
3642.7I2860872K85291K78223L31473L52383K85452K68841L20065L24714K77663K44105
$$ 92860872 93146163 93424386 93755859 94108242 94393694 94662535 94982600 95307314 95584977 95829082
3663.1I5829082K31260K23100K37745K54506K26623K32046K46543K19739J95252J74618
$$ 95829082 96060342 96283442 96521187 96775693 97002316 97234362 97480905 97700644 97895896 98070514
3683.5I8070514J67591J76835J44267Q7070R0063R7137P7701O9416P9143P2968N3608
$$ 98070514 98238105 98414940 98559207 98646277 98736340 98833477 98911178 98980594 99059737 99132705 99186313
3706I9186313M2683N3144P5995O7151L9518J9807O246P21Q190J7780J7846J2815J7345
$$ 99186313 99228996 99282140 99358135 99425286 99464804 99484611 99490857 99491578 99499768 99517548 99535394 99548209 99565554
3732.5I9565554M1997O5929M1008j0693l0941N42K5404J2237K2763M8977L9655J7136
$$ 99565554 99607551 99673480 99714488 99703795 99672854 99673396 99698800 99711037 99733800 99782777 99822432 99839568
3756.9I9839568J5062K2221J3918L862N591J6129J8459J4186J4901K1148J4955n466
$$ 99839568 99854630 99876851 99890769 99894631 99900222 99916351 99934810 99948996 99963897 99985045 100000000 99994534
3781.4I9994534o062Q315J2499J0014K050q237j2004j4657j5116J526J7160J4949R871
$$ 99994534 99988472 99996787 100009286 100019300 100021350 100013113 100001109 99986452 99971336 99972862 99990022 100004971 100014842
3807.9A00014842N006l039j0205j1301j2147n043J2815J2624J157l517m226q82L916
$$ 100014842 100019848 100016809 100006604 99995303 99983156 99978113 99990928 100003552 100004709 100001192 99996966 99996084 100000000
3834.4A00000000l749j9723K68K4921K3436O08k7805m9937m2057K1273M7129K0808
$$ 100000000 99996251 99976528 99976796 100001717 100025153 100025761 99997956 99948019 99905962 99927235 99974364 99995172
3858.9I9995172m244r048l266n871p016M572J6212P660q244r06J7220J9276N961j3674
$$ 99995172 99990928 99981880 99978614 99972743 99965727 99970299 99986511 99994171 99985927 99985021 100002241 100021517 100027478 100013804
3887.5A00013804j4215J520M935q065j8692j4835J019J6135K0528J3399M601j394k528
$$ 100013804 99999589 100001109 100006044 99997979 99979287 99964452 99965471 99981606 100002134 100015533 100020134 100018740 100016212
3914A00016212q3j311m494o950p284q136j0812j556J4090J2792J454o300r579k80J2237
$$ 100016212 100016129 100014818 100010324 100003374 99996090 99987954 99977142 99975586 99989676 100002468 100003922 99997622 99988043 99987763 100000000
3944.6A00000000P045m863k802J0002J1670j192j0013n520k4k479r90R072J0550Q35
$$ 100000000 100007045 100002182 99999380 100009382 100021052 100019860 100009847 100004327 100004303 100001824 100000834 100009906 100020456 100021291
3973.1A00021291J728Q846R954J3184J1349k790q285n48J597K4J908J943
$$ 100021291 100023019 100031865 100041819 100055003 100066352 100063562 100055277 100054729 100056326 100056350 100058258 100060201
3997.6A00060201
$$ 100060201
##END=$$ End of the data block
